module gitlab.com/digilab.overheid.nl/ecosystem/mattermost-standup

go 1.21.1

require (
	github.com/mattermost/mattermost/server/public v0.0.9
	github.com/stretchr/testify v1.8.4
)

require (
	github.com/blang/semver/v4 v4.0.0 // indirect
	github.com/davecgh/go-spew v1.1.1 // indirect
	github.com/dyatlov/go-opengraph/opengraph v0.0.0-20220524092352-606d7b1e5f8a // indirect
	github.com/fatih/color v1.15.0 // indirect
	github.com/francoispqt/gojay v1.2.13 // indirect
	github.com/go-asn1-ber/asn1-ber v1.5.5 // indirect
	github.com/go-sql-driver/mysql v1.7.1 // indirect
	github.com/golang/protobuf v1.5.3 // indirect
	github.com/google/uuid v1.3.1 // indirect
	github.com/gorilla/websocket v1.5.0 // indirect
	github.com/graph-gophers/graphql-go v1.5.1-0.20230110080634-edea822f558a // indirect
	github.com/hashicorp/go-hclog v1.5.0 // indirect
	github.com/hashicorp/go-plugin v1.4.10 // indirect
	github.com/hashicorp/yamux v0.1.1 // indirect
	github.com/lib/pq v1.10.9 // indirect
	github.com/mattermost/go-i18n v1.11.1-0.20211013152124-5c415071e404 // indirect
	github.com/mattermost/ldap v0.0.0-20201202150706-ee0e6284187d // indirect
	github.com/mattermost/logr/v2 v2.0.18 // indirect
	github.com/mattn/go-colorable v0.1.13 // indirect
	github.com/mattn/go-isatty v0.0.19 // indirect
	github.com/mitchellh/go-testing-interface v1.14.1 // indirect
	github.com/oklog/run v1.1.0 // indirect
	github.com/pborman/uuid v1.2.1 // indirect
	github.com/pelletier/go-toml v1.9.5 // indirect
	github.com/philhofer/fwd v1.1.2 // indirect
	github.com/pkg/errors v0.9.1 // indirect
	github.com/pmezard/go-difflib v1.0.0 // indirect
	github.com/rogpeppe/go-internal v1.11.0 // indirect
	github.com/sirupsen/logrus v1.9.3 // indirect
	github.com/tinylib/msgp v1.1.8 // indirect
	github.com/vmihailenco/msgpack/v5 v5.4.1 // indirect
	github.com/vmihailenco/tagparser/v2 v2.0.0 // indirect
	github.com/wiggin77/merror v1.0.5 // indirect
	github.com/wiggin77/srslog v1.0.1 // indirect
	golang.org/x/crypto v0.14.0 // indirect
	golang.org/x/net v0.17.0 // indirect
	golang.org/x/sys v0.13.0 // indirect
	golang.org/x/text v0.13.0 // indirect
	google.golang.org/genproto/googleapis/rpc v0.0.0-20230629202037-9506855d4529 // indirect
	google.golang.org/grpc v1.56.1 // indirect
	google.golang.org/protobuf v1.31.0 // indirect
	gopkg.in/natefinch/lumberjack.v2 v2.2.1 // indirect
	gopkg.in/yaml.v2 v2.4.0 // indirect
	gopkg.in/yaml.v3 v3.0.1 // indirect
)
