[
  {
    "relation": [
      "delegate_permission/common.handle_all_urls"
    ],
    "target": {
      "namespace": "android_app",
      "package_name": "com.digilab.digid_app2app_example",
      "sha256_cert_fingerprints": [
        "6D:2A:C2:53:E6:B4:D5:5E:3D:34:07:2D:F7:B1:1F:65:37:F2:8B:E9:D0:F8:AB:F4:E3:25:7A:74:93:D9:2C:19"
      ]
    }
  }
]
