[
  {
    "table": "courbe1",
    "data": [
      {
        "x": 5,
        "y": 5
      },
      {
        "x": 10,
        "y": 6
      },
      {
        "x": 20,
        "y": 7
      },
      {
        "x": 30,
        "y": 15
      },
      {
        "x": 40,
        "y": 20
      },
      {
        "x": 50,
        "y": 20
      },
      {
        "x": 60,
        "y": 15
      },
      {
        "x": 70,
        "y": 25
      }
    ]
  },
  {
    "table": "courbe2",
    "data": [
      {
        "x": 5,
        "y": 5
      },
      {
        "x": 10,
        "y": 6
      },
      {
        "x": 20,
        "y": 7
      },
      {
        "x": 30,
        "y": 15
      },
      {
        "x": 40,
        "y": 20
      },
      {
        "x": 50,
        "y": 20
      },
      {
        "x": 60,
        "y": 15
      },
      {
        "x": 70,
        "y": 25
      }
    ]
  },
  {
    "table": "courbe3",
    "data": [
      {
        "x": 5,
        "y": 5
      },
      {
        "x": 10,
        "y": 6
      },
      {
        "x": 20,
        "y": 7
      },
      {
        "x": 30,
        "y": 15
      },
      {
        "x": 40,
        "y": 20
      },
      {
        "x": 50,
        "y": 20
      },
      {
        "x": 60,
        "y": 15
      },
      {
        "x": 70,
        "y": 25
      }
    ]
  },
  {
    "table": "courbe4",
    "data": [
      {
        "x": 5,
        "y": 5
      },
      {
        "x": 10,
        "y": 6
      },
      {
        "x": 20,
        "y": 7
      },
      {
        "x": 30,
        "y": 15
      },
      {
        "x": 40,
        "y": 20
      },
      {
        "x": 50,
        "y": 20
      },
      {
        "x": 60,
        "y": 15
      },
      {
        "x": 70,
        "y": 25
      }
    ]
  },
  {
    "table": "courbe5",
    "data": [
      {
        "x": 5,
        "y": 5
      },
      {
        "x": 10,
        "y": 6
      },
      {
        "x": 20,
        "y": 7
      },
      {
        "x": 30,
        "y": 15
      },
      {
        "x": 40,
        "y": 20
      },
      {
        "x": 50,
        "y": 20
      },
      {
        "x": 60,
        "y": 15
      },
      {
        "x": 70,
        "y": 25
      }
    ]
  },
  {
    "table": "courbe6",
    "data": [
      {
        "x": 5,
        "y": 5
      },
      {
        "x": 10,
        "y": 6
      },
      {
        "x": 20,
        "y": 7
      },
      {
        "x": 30,
        "y": 15
      },
      {
        "x": 40,
        "y": 20
      },
      {
        "x": 50,
        "y": 20
      },
      {
        "x": 60,
        "y": 15
      },
      {
        "x": 70,
        "y": 25
      }
    ]
  }
]