@ASCII_DATA_FILE
NCurves=12
NPoints=121
Title=very well reproduced with clearly enhanced oscillations when probe rotated
SubTitle=2020-09-15 15:11:47.225653
XLabel=Axe X en fs
YLabel=
FWHM=0,000000
fitform=0
@END_HEADER

Pas de commentaire
# position	x	type_graph	nb_graph	id_grap	position	y	type_graph	nb_graph	id_graph
-10.0	0.8619252901654624	Phase	1	1	-10.0	0.9177869299905674	Amplitude	1	1
-9.0	0.23309031360755617	Phase	1	1	-9.0	0.848365602385801	Amplitude	1	1
-8.0	0.10641275562357821	Phase	1	1	-8.0	0.11462827444610779	Amplitude	1	1
-7.0	0.7191345660866335	Phase	1	1	-7.0	0.9855923250179289	Amplitude	1	1
-6.0	0.10886072466358887	Phase	1	1	-6.0	0.2899433493770517	Amplitude	1	1
-5.0	0.43930103093674977	Phase	1	1	-5.0	0.7785392585419391	Amplitude	1	1
-4.0	0.6424680919815511	Phase	1	1	-4.0	0.6882663936012863	Amplitude	1	1
-3.0	0.5851627321558328	Phase	1	1	-3.0	0.33542408767038423	Amplitude	1	1
-2.0	0.7377333598785002	Phase	1	1	-2.0	0.4883441208866125	Amplitude	1	1
-1.0	0.7718713729922313	Phase	1	1	-1.0	0.8358752993926195	Amplitude	1	1
0.0	0.06745646434935515	Phase	1	1	0.0	0.9751971289756584	Amplitude	1	1
1.0	0.22497711648396024	Phase	1	1	1.0	0.35596231231925224	Amplitude	1	1
2.0	0.7313632682248794	Phase	1	1	2.0	0.4678679902259806	Amplitude	1	1
3.0	0.6874493571743058	Phase	1	1	3.0	0.5943205974126965	Amplitude	1	1
4.0	0.3325335318331515	Phase	1	1	4.0	0.4897854857074383	Amplitude	1	1
5.0	0.3734562393850127	Phase	1	1	5.0	0.9064521126699934	Amplitude	1	1
6.0	0.12158820974889928	Phase	1	1	6.0	0.8904891613346041	Amplitude	1	1
7.0	0.926524643819324	Phase	1	1	7.0	0.18852707595248663	Amplitude	1	1
8.0	0.4816848494691741	Phase	1	1	8.0	0.46067974650429744	Amplitude	1	1
9.0	0.910658772074449	Phase	1	1	9.0	0.41798963551753754	Amplitude	1	1
