{
Brut_corps : {
source : mail ref =40570111-B7E0-4884-8AE7-949466350E96@gmail.com,
fichier : mail_num_corps_24_2019_12_09_18_44_13.txt,
emplacement  : C:\Users\noah\Desktop\D-CRITIQUE\RECEPMAIL\traitement\24
date : 09/12/2019 18:44:13
},
Brut_complet : {
source : mail ref =40570111-B7E0-4884-8AE7-949466350E96@gmail.com,
fichier : mail_num_complet_24_2019_12_09_18_44_13.txt,
emplacement  : C:\Users\noah\Desktop\D-CRITIQUE\RECEPMAIL\traitement\24
date : 09/12/2019 18:44:13
}
}
