EMAIL : targuq@gmail.com
DATE  : Mon, 9 Dec 2019 13:18:20 +0100
SUJET :Re: test
MESSAGEID :CAPXM4FS4oZFUs9ViZ=2wygUOmx_ezv7TsT8sc9F3FoAxnasBkw@mail.gmail.com
warcraft
orc
broxigar
for : 2

end : 1
signe : gros

On Mon, Dec 9, 2019 at 12:33 PM Noah fiquet  wrote:

> warcraft
> orc
> broxigar
> for :
>
> end : 1
> signe : gros
>

