EMAIL : theo.paul.49@gmail.com
DATE  : Mon, 9 Dec 2019 18:36:55 +0100
SUJET :Essai 8000
MESSAGEID :40570111-B7E0-4884-8AE7-949466350E96@gmail.com
Warcraft 
Troll 
Nom: DonTheoDeLaVega
Charisme 2
Force 1

