<?xml version="1.0" encoding="UTF-8" standalone="no"?>
<!-- Created with Inkscape (http://www.inkscape.org/) -->

<svg
   xmlns:dc="http://purl.org/dc/elements/1.1/"
   xmlns:cc="http://creativecommons.org/ns#"
   xmlns:rdf="http://www.w3.org/1999/02/22-rdf-syntax-ns#"
   xmlns:svg="http://www.w3.org/2000/svg"
   xmlns="http://www.w3.org/2000/svg"
   xmlns:sodipodi="http://sodipodi.sourceforge.net/DTD/sodipodi-0.dtd"
   xmlns:inkscape="http://www.inkscape.org/namespaces/inkscape"
   id="svg2"
   version="1.1"
   inkscape:version="0.91 r13725"
   xml:space="preserve"
   width="1000"
   height="1000"
   viewBox="0 0 1000 1000"
   sodipodi:docname="computer0101.svg"><metadata
     id="metadata8"><rdf:RDF><cc:Work
         rdf:about=""><dc:format>image/svg+xml</dc:format><dc:type
           rdf:resource="http://purl.org/dc/dcmitype/StillImage" /><dc:title /></cc:Work></rdf:RDF></metadata><defs
     id="defs6"><clipPath
       clipPathUnits="userSpaceOnUse"
       id="clipPath20"><path
         d="M 0,800 800,800 800,0 0,0 0,800 Z"
         id="path22"
         inkscape:connector-curvature="0" /></clipPath><clipPath
       clipPathUnits="userSpaceOnUse"
       id="clipPath28"><path
         d="m 0,408.306 799.845,0 0,-402.10092 L 0,6.20508 0,408.306 Z"
         id="path30"
         inkscape:connector-curvature="0" /></clipPath><clipPath
       clipPathUnits="userSpaceOnUse"
       id="clipPath152"><path
         d="M 0,800 800,800 800,0 0,0 0,800 Z"
         id="path154"
         inkscape:connector-curvature="0" /></clipPath></defs><sodipodi:namedview
     pagecolor="#ffffff"
     bordercolor="#666666"
     borderopacity="1"
     objecttolerance="10"
     gridtolerance="10"
     guidetolerance="10"
     inkscape:pageopacity="0"
     inkscape:pageshadow="2"
     inkscape:window-width="1366"
     inkscape:window-height="703"
     id="namedview4"
     showgrid="false"
     inkscape:zoom="0.472"
     inkscape:cx="67.409879"
     inkscape:cy="465.15074"
     inkscape:window-x="0"
     inkscape:window-y="0"
     inkscape:window-maximized="1"
     inkscape:current-layer="g10" /><g
     id="g10"
     inkscape:groupmode="layer"
     inkscape:label="43"
     transform="matrix(1.25,0,0,-1.25,0,1000)"><g
       id="g5527"
       transform="translate(1112.1951,-166.19411)"><path
         inkscape:connector-curvature="0"
         id="path14"
         style="fill:#e8ceab;fill-opacity:1;fill-rule:nonzero;stroke:none"
         d="m -1109.8231,164.25282 800.00003,0 0,417.16 -800.00003,0 0,-417.16 z" /><g
         transform="translate(-1108.9098,164.74985)"
         id="g16"><g
           clip-path="url(#clipPath20)"
           id="g18"><g
             id="g24"><g
               id="g26" /><g
               id="g32"><g
                 style="opacity:0.14999402"
                 id="g34"
                 clip-path="url(#clipPath28)"><g
                   id="g36"
                   transform="translate(0,194.457)"><path
                     inkscape:connector-curvature="0"
                     id="path38"
                     style="fill:#bf864f;fill-opacity:1;fill-rule:nonzero;stroke:none"
                     d="m 0,0 172.213,0 9.83,0 151.522,0 11.485,0 149.39,0 11.986,0 104.884,0 15.185,0 14.448,0 14.853,0 29.396,0 14.556,0 14.204,0 9.475,0 74.7,0 0,-4.12 -84.197,0 c -3.239,0 -6.565,0.006 -9.923,0.012 -20.831,-0.008 -43.341,-0.012 -62.324,-0.012 l -15.188,0 c -40.493,0 -81.032,0.004 -120.099,0.006 -3.938,-0.002 -7.939,-0.006 -11.956,-0.006 l -149.39,0 -11.487,0 -151.517,0 -9.833,0 L 0,-4.12 0,0 Z" /></g><g
                   id="g40"
                   transform="translate(0,205.2236)"><path
                     inkscape:connector-curvature="0"
                     id="path42"
                     style="fill:#bf864f;fill-opacity:1;fill-rule:nonzero;stroke:none"
                     d="m 0,0 182.065,0 10.071,0 C 236.233,0 278.775,-1.047 323.255,-0.01 327.104,0 330.952,0 334.82,0 l 81.405,0 13.59,0 53.863,0 13.277,0 12.087,0 c 31.131,0 63.405,-0.501 95.482,-0.518 4.581,-0.003 9.16,-0.258 13.737,-0.258 29.235,0.024 54.76,-0.102 84.144,-0.018 4.293,-0.063 8.898,-0.127 13.499,-0.123 4.609,0.004 9.214,0.479 13.82,0.482 3.46,-0.028 6.867,0.435 10.148,0.435 l 58.255,0 0,-2.06 -52.787,0 -17.554,0 -12.108,0 -12.243,0 c -24.738,0 -47.43,-0.519 -73.266,-0.551 -5.193,0.028 -10.303,0.287 -15.406,0.289 -35.698,0.002 -71.281,0.262 -105.718,0.262 l -12.09,0 -29.71,0 -30.073,0 -30.271,0 -60.527,0 -11.574,0 c -50.349,-2.06 -101.405,-2.06 -152.735,0 l -9.915,0 L 0,-2.06 0,0 Z" /></g><g
                   id="g44"
                   transform="translate(0,216.6885)"><path
                     inkscape:connector-curvature="0"
                     id="path46"
                     style="fill:#bf864f;fill-opacity:1;fill-rule:nonzero;stroke:none"
                     d="m 0,0 118.422,0 c 3.458,0 7.307,-0.551 11.16,-0.571 13.053,0.064 30.069,0.32 44.8,0.36 C 177.977,-0.25 181.956,0 185.971,0 l 12.193,0 10.521,0 112.161,0 11.705,0 44.268,0 14.835,0 C 431.938,-2.061 468.81,-1.046 509.088,-0.014 513.083,0 517.084,0 521.064,0 l 75.507,0 c 5.074,0 10.412,-0.682 15.908,-0.944 37.855,-3.754 71.888,3.833 109.966,0.971 C 726.757,-0.142 731.196,0 735.758,0 l 13.638,0 16.741,0 31.99,0 0,-4.12 -48.737,0 c -3.043,0 -6.212,-0.01 -9.446,0.033 -4.135,-0.004 -8.316,-0.019 -12.524,-0.021 -37.38,1.007 -77.086,-0.042 -115.306,-0.195 -5.406,0.147 -10.481,0.163 -15.551,0.163 -25.353,0.006 -50.582,0.02 -75.521,0.02 l -11.978,0 c -34.584,0 -68.62,0.002 -102.524,-0.02 -4.992,0.022 -9.94,0.02 -14.886,0.02 l -59.103,0 -11.705,0 c -36.395,0 -76.103,0 -112.179,-0.006 -3.523,0.004 -7.027,0.006 -10.503,0.006 L 0,-4.12 0,0 Z" /></g><g
                   id="g48"
                   transform="translate(0,228.1709)"><path
                     inkscape:connector-curvature="0"
                     id="path50"
                     style="fill:#bf864f;fill-opacity:1;fill-rule:nonzero;stroke:none"
                     d="m 0,0 90.641,0 10.222,0 c 30.426,0 64.46,0 94.975,0.006 4.366,0 8.781,-0.006 13.229,-0.006 l 13.486,0 10.362,0 64.414,0 11.038,0 60.826,0 15.349,0 c 44.559,-2.061 89.938,0 136.531,0 l 11.895,0 40.481,0 20.074,0 c 3.796,0 7.807,-0.626 11.918,-0.816 42.055,-3.848 87.435,4.3 129.794,0.12 4.824,-0.002 9.657,0.35 14.493,0.35 C 755.779,-0.35 761.34,0 766.358,0 l 31.769,0 0,-2.061 -31.99,0 -16.741,0 -13.476,0 C 692.876,0 647.496,-5.207 603.554,-2.218 c -4.095,0.152 -8.018,0.157 -11.947,0.157 l -58.661,0 -11.876,0 c -40.915,-2.059 -80.626,-2.096 -120.99,-0.098 -5.261,0.081 -10.417,0.098 -15.538,0.098 l -76.175,0 -11.051,0 -84.993,0 -10.092,0 -91.628,0 -10.03,0 L 0,-2.061 0,0 Z" /></g><g
                   id="g52"
                   transform="translate(0,240.3037)"><path
                     inkscape:connector-curvature="0"
                     id="path54"
                     style="fill:#bf864f;fill-opacity:1;fill-rule:nonzero;stroke:none"
                     d="M 0,0 74.943,0 C 80.228,0 85.738,-0.007 92.114,-0.422 131.289,-4.191 173.835,2.06 213.474,0 l 11.57,0 135.414,0 c 4.15,0 8.304,-0.518 12.462,-0.52 47.673,-2.087 98.726,-2.881 148.165,0.246 3.97,0.011 7.935,0.274 11.883,0.274 l 52.648,0 c 3.492,0 6.98,-0.518 10.465,-0.656 45.744,-4.048 91.124,4.078 136.949,0.155 4.544,-0.218 9.07,0.167 13.596,0.173 4.04,-0.047 7.857,0.328 11.459,0.328 l 40.042,0 0,-2.062 -45.603,0 c -3.177,0 -6.51,-0.478 -10.001,-0.405 -46.811,3.02 -97.863,-3.002 -146.45,0.002 -3.543,0.137 -7.058,0.403 -10.576,0.403 l -52.529,0 c -3.948,0 -7.915,-0.534 -11.889,-0.543 -46.599,-2.082 -89.141,-2.864 -135.607,0.214 -4.23,0.048 -8.392,0.329 -12.55,0.329 l -150.247,0 c -3.628,0 -7.227,0.004 -10.805,0.007 C 168.163,1.081 122.782,-4.12 80.901,-2.062 l -14.723,0 L 0,-2.062 0,0 Z" /></g><g
                   id="g56"
                   transform="translate(0,280.5762)"><path
                     inkscape:connector-curvature="0"
                     id="path58"
                     style="fill:#bf864f;fill-opacity:1;fill-rule:nonzero;stroke:none"
                     d="m 0,0 c 0,0 34.444,0.786 75.949,0 5.282,-0.1 17.128,-1.405 23.228,-1.833 41.963,-3.232 72.073,5.93 114.867,2.283 3.628,-0.338 7.125,-0.643 11,-0.643 l 135.414,0 c 4.15,0 8.304,0.091 12.462,0.088 50.511,-2.086 85.456,-5.947 134.89,-1.775 7.798,1.308 21.234,1.751 25.291,1.719 17.106,0.013 34.162,-0.032 51.171,-0.032 l 10.207,0 c 44.508,-4.12 92.726,3.152 138.459,0.165 4.658,-0.154 9.187,-0.165 13.715,-0.165 l 11.432,0 10.129,0 29.913,0 0,-4.12 -40.042,0 -11.432,0 c -4.528,0 -9.057,0.066 -13.654,0.279 -45.794,3.973 -91.174,-4.441 -136.95,-0.386 -3.453,0.133 -6.941,0.107 -10.433,0.107 l -52.648,0 c -3.948,0 -7.913,0.054 -11.881,0.04 -52.277,-3.123 -97.656,-2.106 -148.167,-0.019 -4.158,0.005 -8.312,-0.021 -12.462,-0.021 l -135.414,0 c -3.869,0 -7.72,0.075 -11.252,0.343 C 173.835,-1.11 131.289,-7.363 92.261,-4.853 85.953,-4.424 81.215,-4.387 75.949,-4.206 30.192,-2.636 0,-4.189 0,-4.189 L 0,0 Z" /></g><g
                   id="g60"
                   transform="translate(0,266.7344)"><path
                     inkscape:connector-curvature="0"
                     id="path62"
                     style="fill:#bf864f;fill-opacity:1;fill-rule:nonzero;stroke:none"
                     d="m 0,0 66.178,0 c 4.705,0 9.616,-0.816 14.613,-1.143 7.953,-1.762 17.171,-1.88 25.681,-1.88 42.543,-1.049 53.179,5.084 127.159,3.023 l 11.099,0 128.19,0 c 4.16,0 8.322,-0.824 12.497,-0.849 34.889,-2.33 67.542,-2.724 101.343,-1.694 6.761,0.206 13.568,0.249 20.446,0.527 30.903,1.03 62.031,1.107 93.107,0.995 4.433,-0.019 8.857,-0.098 12.954,-0.267 34.229,-0.281 71.1,-0.306 105.477,-0.236 5.512,-0.204 10.52,-0.206 15.482,-0.165 4.949,0.041 9.889,0.892 14.822,0.965 C 759.165,-0.799 768.017,0 775.268,0 l 22.859,0 0,-4.119 -22.859,0 -26.358,0 -16.282,0 C 690.04,0 644.66,-6.013 602.247,-3.945 c -4.518,-0.002 -9.034,0.096 -13.548,0.094 -22.569,-0.015 -45.072,0.017 -67.455,-0.011 -5.084,-0.246 -10.077,-0.459 -15.049,-0.676 -44.727,-1.936 -90.371,-0.335 -133.275,0.602 -4.158,0 -8.312,-0.183 -12.462,-0.183 l -135.414,0 c -3.883,0 -7.792,0.553 -11.697,0.889 -28.168,2.458 -56.532,0.461 -84.896,-2.681 -17.015,-2.096 -36.868,0.898 -53.508,1.94 C 69.654,-3.969 64.6,-4.119 59.778,-4.119 L 0,-4.119 0,0 Z" /></g><g
                   id="g64"
                   transform="translate(798.127,401.7153)"><path
                     inkscape:connector-curvature="0"
                     id="path66"
                     style="fill:#bf864f;fill-opacity:1;fill-rule:nonzero;stroke:none"
                     d="M 0,0 -75.855,0 C -81.143,0 -86.656,0.007 -93.03,0.483 -132.207,4.812 -174.751,-4.12 -214.391,0 l -11.572,0 -135.411,0 c -4.151,0 -8.305,1.113 -12.463,1.115 C -421.51,3.512 -472.564,4.163 -522,0.574 -525.971,0.561 -529.936,0 -533.883,0 l -52.649,0 c -3.491,0 -6.984,1.113 -10.465,1.27 -45.743,4.649 -91.127,-4.42 -136.947,0.081 -4.545,0.251 -9.072,-0.58 -13.593,-0.586 C -751.584,0.819 -755.399,0 -759.003,0 l -39.124,0 0,4.121 44.686,0 c 3.179,0 6.513,0.19 10.001,0.106 46.808,-3.464 97.864,3.628 146.451,0.178 3.542,-0.156 7.06,-0.284 10.573,-0.284 l 52.533,0 c 3.947,0 7.914,0.254 11.889,0.265 46.596,2.388 89.141,3.469 135.605,-0.066 4.227,-0.054 8.39,-0.199 12.548,-0.199 l 150.25,0 c 3.624,0 7.226,-0.004 10.803,-0.006 43.709,-3.601 89.091,2.066 130.972,0.006 l 14.722,0 L 0,4.121 0,0 Z" /></g><g
                   id="g68"
                   transform="translate(798.127,385.3623)"><path
                     inkscape:connector-curvature="0"
                     id="path70"
                     style="fill:#bf864f;fill-opacity:1;fill-rule:nonzero;stroke:none"
                     d="m 0,0 c 0,0 -34.961,-0.903 -76.467,0 -5.279,0.115 -17.329,1.613 -23.429,2.104 -41.961,3.71 -72.169,-7.828 -114.965,-3.645 -3.63,0.387 -7.226,-0.288 -11.102,-0.288 l -135.411,0 c -4.151,0 -8.305,0.919 -12.463,0.926 -50.509,2.394 -85.455,7.34 -134.887,2.551 -7.8,-1.504 -21.237,-2.783 -25.29,-2.745 -17.11,-0.014 -34.164,-0.732 -51.174,-0.732 l -10.205,0 c -44.511,8.241 -92.731,-3.617 -138.461,-0.187 -4.66,0.173 -9.187,0.187 -13.717,0.187 l -11.432,0 -10.127,0 -28.997,0 0,8.241 39.124,0 11.432,0 c 4.53,0 9.057,-0.805 13.655,-1.049 45.792,-4.56 91.176,5.459 136.949,0.807 3.451,-0.152 6.944,0.242 10.435,0.242 l 52.649,0 c 3.947,0 7.912,-0.793 11.883,-0.775 52.274,3.584 97.654,2.781 148.163,0.384 4.158,-0.003 8.312,0.391 12.463,0.391 l 135.411,0 c 3.87,0 7.725,-0.814 11.256,-1.125 39.956,-3.283 82.5,3.533 121.528,0.649 C -86.871,5.444 -81.732,5.219 -76.467,5.01 -30.706,3.207 0,4.81 0,4.81 L 0,0 Z" /></g><g
                   id="g72"
                   transform="translate(798.127,366.9541)"><path
                     inkscape:connector-curvature="0"
                     id="path74"
                     style="fill:#bf864f;fill-opacity:1;fill-rule:nonzero;stroke:none"
                     d="M 0,0 -67.094,0 C -71.8,0 -76.708,1.31 -81.706,1.689 -89.661,3.71 -98.882,3.658 -107.39,3.658 -149.932,4.862 -160.568,-2.061 -234.551,0 l -11.095,0 -128.191,0 c -4.162,0 -8.325,1.321 -12.499,1.349 -34.888,2.672 -67.541,3.316 -101.339,2.134 -6.764,-0.236 -13.568,-0.194 -20.448,-0.511 -30.903,-1.186 -62.032,-1.224 -93.106,-1.096 -4.435,0.022 -8.858,0.135 -12.955,0.328 -34.228,0.324 -71.099,0.364 -105.476,0.284 -5.509,0.234 -10.518,0.241 -15.48,0.198 -4.949,-0.044 -9.891,-1.401 -14.825,-1.484 C -760.08,1.289 -768.933,0 -776.182,0 l -21.945,0 0,6.18 21.945,0 26.356,0 16.278,0 c 42.592,-6.18 87.972,1.825 130.383,-0.551 4.519,0.004 9.037,-0.286 13.55,-0.281 22.569,0.015 45.073,-0.107 67.451,-0.075 5.089,0.28 10.08,0.483 15.052,0.732 44.727,2.225 90.368,0.713 133.275,-0.362 4.158,-0.004 8.312,0.537 12.463,0.537 l 135.411,0 c 3.886,0 7.79,-0.986 11.7,-1.37 28.167,-2.822 56.53,-0.706 84.892,2.903 17.018,2.404 36.874,-0.769 53.516,-1.963 5.285,-0.004 10.339,0.43 15.16,0.43 L 0,6.18 0,0 Z" /></g><g
                   id="g76"
                   transform="translate(0,292.3008)"><path
                     inkscape:connector-curvature="0"
                     id="path78"
                     style="fill:#bf864f;fill-opacity:1;fill-rule:nonzero;stroke:none"
                     d="m 0,0 66.178,0 14.723,0 c 13.515,-2.06 24.863,-1.839 39.042,-1.839 31.2,3.143 59.564,3.014 91.411,2.499 C 215.237,0.366 219.036,0 222.675,0 L 372.92,0 c 4.16,0 8.322,0.248 12.487,0.241 35.748,-0.903 72.791,-0.888 108.461,-0.217 5.094,0.096 10.161,0.273 15.307,0.324 30.597,0.036 60.889,0.095 91.203,0.112 5.052,0.007 10.104,0.022 15.146,0.022 31.972,0.013 60.333,0.021 90.949,0.23 5.622,-0.12 10.877,-0.145 16.034,-0.14 10.314,0.007 20.679,-0.236 31.108,-0.221 C 762.813,0.26 770.845,0 777.415,0 l 20.712,0 0,-2.06 -19.507,0 -22.568,0 -15.558,0 -15.545,0 c -37.744,0 -71.78,0.237 -108.964,0.064 -4.213,0.115 -8.744,0.229 -13.272,0.225 -31.72,-0.044 -63.519,-0.048 -95.507,-0.161 -6.878,-0.124 -13.685,-0.197 -20.446,-0.273 -33.801,-0.393 -66.456,-0.425 -101.353,0.345 -4.165,0.012 -8.327,-0.2 -12.485,-0.2 l -128.192,0 -11.099,0 c -45.616,4.121 -85.324,-1.859 -130.703,-0.808 -5.677,0 -17.02,-1.168 -22.191,0.643 -4.943,0.28 -9.854,0.165 -14.559,0.165 L 0,-2.06 0,0 Z" /></g><g
                   id="g80"
                   transform="translate(0,303.6572)"><path
                     inkscape:connector-curvature="0"
                     id="path82"
                     style="fill:#bf864f;fill-opacity:1;fill-rule:nonzero;stroke:none"
                     d="m 0,0 68.961,0 15.294,0 c 44.196,-2.062 89.58,3.143 135.578,0.004 C 223.531,0.002 227.252,0 231.004,0 l 14.72,0 14.946,0 45.918,0 15.591,0 63.228,0 c 4.161,0 8.327,0.278 12.494,0.271 29.781,0.016 57.392,0.163 86.488,0.142 4.158,-0.002 8.345,0.069 12.574,0.066 37.316,0.011 75.138,0.056 112.96,0.072 5.402,0.003 10.806,0.024 16.207,0.024 21.366,-0.012 41.222,-0.002 64.33,0.088 5.659,-0.028 11.042,-0.021 16.395,-0.017 C 722.909,0.663 738.877,0.394 754.73,0.418 763.688,0.297 771.523,0 777.933,0 l 20.194,0 0,-2.062 -20.712,0 c -6.57,0 -14.602,0.281 -23.782,0.391 -11.735,-0.165 -23.391,-0.106 -34.985,-0.124 -3.861,-0.008 -7.719,0.06 -11.57,0.068 -28.381,0.145 -59.582,0.179 -88.501,0.672 -4.553,0.038 -9.098,0.089 -13.645,0.117 -31.827,0.199 -63.611,0.166 -95.73,-0.708 -4.757,-0.065 -9.487,-0.126 -14.146,-0.224 -32.629,-0.683 -64.89,-0.843 -97.142,0.032 -4.18,0.026 -8.346,-0.224 -12.507,-0.224 l -154.407,0 c -3.748,0 -7.469,0.279 -11.169,0.281 C 173.835,2.403 128.451,-6.115 83.958,-2.189 78.95,-1.928 73.85,-2.062 68.961,-2.062 L 0,-2.062 0,0 Z" /></g><g
                   id="g84"
                   transform="translate(0.0322,323.9121)"><path
                     inkscape:connector-curvature="0"
                     id="path86"
                     style="fill:#bf864f;fill-opacity:1;fill-rule:nonzero;stroke:none"
                     d="m 0,0 c 40.666,-0.105 81.394,-0.193 122.165,-0.264 5.098,-0.009 10.192,-0.02 15.397,-0.023 88.731,0.955 173.577,-1.047 262.341,-0.7 4.905,0.048 9.799,0.108 14.68,0.184 4.88,0.073 9.746,0.161 14.604,0.258 5.347,0.036 10.442,0.046 15.518,0.055 14.961,0.004 29.925,0.01 44.889,0.022 5.437,0.002 10.924,-0.012 16.329,-0.016 28.651,-0.182 54.105,-0.182 81.78,0.123 5.423,0.03 10.832,0.06 16.237,0.091 48.633,0.292 96.669,0.761 146.086,0.283 10.823,0.024 37.267,0.167 48.069,0.167 4.918,0 -2.554,0 0,0 2.555,0 0,0 0,0 0,0 2.361,0 0,0 -2.365,0 4.57,-0.76 0,-0.762 -10.848,-0.028 -36.221,-0.43 -47.089,-0.45 -48.229,0.474 -97.009,-0.092 -146.249,-0.388 -5.489,-0.036 -11.117,-0.201 -16.596,-0.235 -28.133,-0.252 -53.587,-0.302 -81.877,-0.147 -5.519,0.041 -10.977,0.022 -16.416,0.022 -9.812,-0.008 -19.622,-0.024 -29.433,-0.028 -4.905,-0.003 -9.811,-0.012 -14.722,-0.012 -14.068,-0.053 -28.245,-0.093 -42.456,-0.117 -4.77,-0.008 -9.627,-0.008 -14.362,-0.016 -83.411,0.619 -168.258,0.619 -251.263,0.338 -5.087,0.008 -10.389,0.008 -15.486,0.015 -40.779,0.074 -81.514,0.162 -122.178,0.266 L 0,0 Z" /></g><g
                   id="g88"
                   transform="translate(0,10.8281)"><path
                     inkscape:connector-curvature="0"
                     id="path90"
                     style="fill:#bf864f;fill-opacity:1;fill-rule:nonzero;stroke:none"
                     d="m 0,0 118.422,0 c 3.458,0 7.307,-0.737 11.16,-0.757 13.053,0.065 30.069,0.41 44.8,0.455 3.595,-0.04 7.574,0.302 11.589,0.302 l 12.193,0 10.521,0 112.161,0 11.705,0 44.268,0 14.835,0 C 431.938,-2.061 468.81,-1.049 509.088,-0.017 513.083,-0.002 517.084,0 521.064,0 l 75.507,0 c 5.074,0 10.412,-0.867 15.908,-1.128 37.855,-3.753 71.888,3.927 109.966,1.064 C 726.757,-0.235 731.196,0 735.758,0 l 13.638,0 16.741,0 31.99,0 0,-4.12 -48.737,0 c -3.043,0 -6.212,-0.195 -9.446,-0.149 -4.135,-0.008 -8.316,-0.114 -12.524,-0.116 -37.38,1.009 -77.086,-0.086 -115.306,-0.238 -5.406,0.144 -10.481,0.12 -15.551,0.12 -25.353,0.004 -50.582,-0.008 -75.521,-0.008 -3.964,0 -7.963,-0.007 -11.978,-0.009 -34.584,0.002 -68.62,0.203 -102.524,0.18 -4.992,0.023 -9.94,0.22 -14.886,0.22 l -59.103,0 -11.705,0 c -36.395,0 -76.103,0 -112.179,-0.007 -3.523,0.007 -7.027,0.007 -10.503,0.007 L 0,-4.12 0,0 Z" /></g><g
                   id="g92"
                   transform="translate(0,24.7881)"><path
                     inkscape:connector-curvature="0"
                     id="path94"
                     style="fill:#bf864f;fill-opacity:1;fill-rule:nonzero;stroke:none"
                     d="m 0,0 90.641,0 10.222,0 c 30.426,0 64.46,0 94.975,0.004 4.366,0 8.781,-0.004 13.229,-0.004 l 13.486,0 10.362,0 64.414,0 11.038,0 60.826,0 15.349,0 c 44.559,-2.061 89.938,0 136.531,0 l 11.895,0 40.481,0 20.074,0 c 3.796,0 7.807,-0.811 11.918,-1.002 42.055,-3.842 87.435,4.209 129.794,0.029 4.824,-0.004 9.657,0.491 14.493,0.491 C 755.779,-0.492 761.34,0 766.358,0 l 31.769,0 0,-2.061 -31.99,0 -16.741,0 -13.476,0 C 692.876,0 647.496,-5.207 603.554,-2.217 c -4.095,0.149 -8.018,0.156 -11.947,0.156 l -58.661,0 -11.876,0 c -40.915,-2.06 -80.626,-2.095 -120.99,-0.101 -5.261,0.084 -10.417,0.101 -15.538,0.101 l -76.175,0 -11.051,0 -84.993,0 -10.092,0 -91.628,0 -10.03,0 L 0,-2.061 0,0 Z" /></g><g
                   id="g96"
                   transform="translate(0,79.1475)"><path
                     inkscape:connector-curvature="0"
                     id="path98"
                     style="fill:#bf864f;fill-opacity:1;fill-rule:nonzero;stroke:none"
                     d="m 0,0 c 0,0 34.444,0.787 75.949,0 5.282,-0.098 17.128,-1.404 23.228,-1.831 41.963,-3.232 72.073,5.943 114.867,2.296 3.628,-0.334 7.125,-0.626 11,-0.626 l 135.414,0 c 4.15,0 8.304,0.076 12.462,0.072 50.511,-2.084 85.456,-5.954 134.89,-1.782 7.798,1.308 21.234,1.767 25.291,1.73 17.106,0.012 34.162,-0.02 51.171,-0.02 l 10.207,0 c 44.508,-4.12 92.726,3.153 138.459,0.165 4.658,-0.152 9.187,-0.165 13.715,-0.165 l 11.432,0 10.129,0 29.913,0 0,-4.12 -40.042,0 -11.432,0 c -4.528,0 -9.057,0.049 -13.654,0.261 -45.794,3.976 -91.174,-4.43 -136.95,-0.377 -3.453,0.132 -6.941,0.116 -10.433,0.116 l -52.648,0 c -3.948,0 -7.913,0.037 -11.881,0.024 -52.277,-3.122 -97.656,-2.099 -148.167,-0.01 -4.158,0.002 -8.312,-0.014 -12.462,-0.014 l -135.414,0 c -3.869,0 -7.72,0.061 -11.252,0.33 C 173.835,-1.094 131.289,-7.354 92.261,-4.843 85.953,-4.416 81.215,-4.382 75.949,-4.201 30.192,-2.629 0,-4.188 0,-4.188 L 0,0 Z" /></g><g
                   id="g100"
                   transform="translate(0,94.5918)"><path
                     inkscape:connector-curvature="0"
                     id="path102"
                     style="fill:#bf864f;fill-opacity:1;fill-rule:nonzero;stroke:none"
                     d="m 0,0 66.178,0 c 4.705,0 9.616,0.365 14.613,0.035 7.953,-1.759 17.171,-2.471 25.681,-2.471 C 149.015,-3.481 159.651,4.12 233.631,0 l 11.099,0 128.19,0 c 4.16,0 8.322,0.358 12.497,0.331 34.889,-2.329 67.542,-2.132 101.343,-1.102 6.761,0.207 13.568,0.545 20.446,0.823 30.903,1.034 62.031,1.258 93.107,1.147 4.433,-0.022 8.857,-0.028 12.954,-0.197 34.229,-0.28 71.1,-0.269 105.477,-0.199 5.512,-0.204 10.52,-0.184 15.482,-0.148 4.949,0.04 9.889,-0.278 14.822,-0.209 C 759.165,0.373 768.017,0 775.268,0 l 22.859,0 0,-2.061 -22.859,0 -26.358,0 -16.282,0 C 690.04,0 644.66,-3.799 602.247,-1.73 c -4.518,-0.005 -9.034,0.169 -13.548,0.167 -22.569,-0.015 -45.072,0.053 -67.455,0.026 -5.084,-0.241 -10.077,-0.442 -15.049,-0.656 -44.727,-1.936 -90.371,-0.475 -133.275,0.46 -4.158,0.003 -8.312,-0.328 -12.462,-0.328 l -135.414,0 c -3.883,0 -7.792,0.708 -11.697,1.042 -28.168,2.457 -56.532,0.54 -84.896,-2.605 C 111.436,-5.719 91.583,-2.842 74.943,-1.799 69.654,-1.795 64.6,-2.061 59.778,-2.061 L 0,-2.061 0,0 Z" /></g><g
                   id="g104"
                   transform="translate(0,110.7178)"><path
                     inkscape:connector-curvature="0"
                     id="path106"
                     style="fill:#bf864f;fill-opacity:1;fill-rule:nonzero;stroke:none"
                     d="m 0,0 66.178,0 14.723,0 c 13.515,-4.12 24.863,-2.659 39.042,-2.659 31.2,3.142 59.564,3.425 91.411,2.907 C 215.237,-0.043 219.036,0 222.675,0 L 372.92,0 c 4.16,0 8.322,-0.573 12.487,-0.579 35.748,-0.901 72.791,-1.3 108.461,-0.627 5.094,0.096 10.161,0.065 15.307,0.116 30.597,0.04 60.889,-0.008 91.203,0.012 5.052,0.005 10.104,-0.032 15.146,-0.028 31.972,0.012 60.333,-0.008 90.949,0.202 5.622,-0.121 10.877,-0.156 16.034,-0.154 10.314,0.01 20.679,0.579 31.108,0.594 9.198,-0.091 17.23,0.464 23.8,0.464 l 20.712,0 0,-4.12 -19.507,0 -22.568,0 -15.558,0 -15.545,0 c -37.744,0 -71.78,0.447 -108.964,0.276 -4.213,0.113 -8.744,0.332 -13.272,0.326 -31.72,-0.043 -63.519,0.002 -95.507,-0.107 -6.878,-0.127 -13.685,-0.169 -20.446,-0.249 -33.801,-0.392 -66.456,-0.617 -101.353,0.15 -4.165,0.01 -8.327,-0.396 -12.485,-0.396 l -128.192,0 -11.099,0 C 188.015,0 148.307,-5.769 102.928,-4.722 c -5.677,0 -17.02,-1.269 -22.191,0.542 -4.943,0.278 -9.854,0.06 -14.559,0.06 L 0,-4.12 0,0 Z" /></g><g
                   id="g108"
                   transform="translate(0,123.8516)"><path
                     inkscape:connector-curvature="0"
                     id="path110"
                     style="fill:#bf864f;fill-opacity:1;fill-rule:nonzero;stroke:none"
                     d="m 0,0 80.317,0 c 5.627,0 11.489,-0.124 16.847,-0.44 34.125,-3.873 70.999,4.571 105.704,0.597 C 207.275,-0.053 211.237,0 215.233,0 l 20.147,0 c 3.397,0 6.853,-0.103 10.285,-0.103 27.439,-0.015 52.965,0.042 80.012,0.067 4.108,0 8.266,0.036 12.35,0.036 l 47.38,0 12.494,0 86.483,0 c 4.159,0 8.346,-0.118 12.6,-0.156 5.212,0.116 10.422,0.16 15.632,0.253 5.21,0.098 10.419,0.15 15.635,0.231 14.302,0.509 31.321,0.493 46.851,0.342 5.203,0.015 10.407,0.137 15.614,0.137 C 653.167,0.821 715.556,0 777.933,0 l 20.194,0 0,-2.06 -20.194,0 c -6.41,0 -14.234,-0.119 -23.193,0.016 -84.552,0.894 -172.48,0.824 -257.777,-0.235 -4.233,0.006 -8.42,0.11 -12.579,0.11 -29.091,0.005 -56.702,0.109 -86.483,0.109 l -12.494,0 -12.225,0 -12.226,0 -29.821,0 -10.071,0 -75.382,0 -10.508,0 -10.391,0 c -4.139,0 -8.244,-0.133 -12.315,-0.13 -41.471,4.186 -86.853,-3.081 -128.217,0.06 -5.884,0.002 -11.528,0.07 -16.912,0.07 L 0,-2.06 0,0 Z" /></g><g
                   id="g112"
                   transform="translate(0,138.957)"><path
                     inkscape:connector-curvature="0"
                     id="path114"
                     style="fill:#bf864f;fill-opacity:1;fill-rule:nonzero;stroke:none"
                     d="M 0,0 76.694,0 93.552,0 C 128.451,0 159.651,0 194.609,0.096 198.714,0.004 202.532,0 206.382,0 l 9.66,0 9.783,0 c 35.934,0 69.97,2.096 106.489,0.068 C 336.878,0.021 341.357,0 345.833,0 l 40.39,0 12.401,0 36.723,0 12.425,0 12.392,0 24.046,0 c 3.987,0 7.96,-0.506 11.936,-0.568 32.224,0.05 63.426,1.888 94.356,0.244 5.232,0.002 10.46,0.388 15.692,0.385 C 663.711,0.004 721.136,0 778.911,0 l 19.216,0 0,-4.119 -20.194,0 c -57.178,0 -114.37,1.279 -171.607,1.394 -5.201,0.008 -10.408,0.266 -15.61,0.262 -25.472,0.137 -53.835,0.258 -78.067,-0.506 -5.201,-0.095 -10.451,-0.164 -15.661,-0.281 -4.25,0.062 -8.393,0.094 -12.497,0.094 -20.502,0 -39.885,-0.483 -61.608,-0.489 -4.159,0.002 -8.321,-0.474 -12.485,-0.474 l -11.774,0 -11.813,0 -39.343,0 c -4.43,0 -8.905,0.021 -13.322,0.021 -32.679,-0.021 -69.551,-0.021 -103.932,-0.021 l -9.946,0 -9.824,0 c -3.916,0 -7.798,0.008 -12.126,0.168 -32.995,2.974 -69.867,-0.168 -102.768,-0.168 l -17.196,0 L 0,-4.119 0,0 Z" /></g><g
                   id="g116"
                   transform="translate(0,165.1289)"><path
                     inkscape:connector-curvature="0"
                     id="path118"
                     style="fill:#bf864f;fill-opacity:1;fill-rule:nonzero;stroke:none"
                     d="m 0,0 18.44,0 10.964,0 178.787,0 c 5.468,0 10.89,0.01 16.514,0.045 C 267.431,2.097 312.812,0 354.386,0 l 16.316,0 81.944,0 9.944,0 9.904,0 c 4.106,0 8.439,-0.396 12.279,-0.442 43.597,2.092 88.98,1.867 130.642,0.981 5.454,-0.004 10.91,0.318 16.358,0.304 C 680.845,0.713 729.79,0 778.05,0 l 20.077,0 0,-2.061 -20.077,0 c -48.26,0 -97.205,0.063 -146.277,0.322 -5.448,0.032 -10.904,0.289 -16.358,0.31 C 573.753,-0.197 528.37,0 484.766,-2.061 l -12.272,0 -59.866,0 -12.192,0 -12.761,0 -12.926,0 -16.149,0 c -5.433,0 -10.849,0.023 -16.448,0.078 C 298.63,0.036 256.087,-2.061 214,-2.061 l -16.402,0 -16.547,0 -12.112,0 -11.847,0 -114.638,0 -13.046,0 L 0,-2.061 0,0 Z" /></g><g
                   id="g120"
                   transform="translate(0.0059,179.4219)"><path
                     inkscape:connector-curvature="0"
                     id="path122"
                     style="fill:#bf864f;fill-opacity:1;fill-rule:nonzero;stroke:none"
                     d="m 0,0 c 65.619,0.281 138.592,0.486 208.196,0.619 5.449,0.009 10.373,0.019 16.067,0.023 26.203,0.243 51.749,0.339 77.106,0.32 4.228,-0.004 8.314,-0.013 12.518,-0.019 35.925,0.103 69.896,0.103 107.23,-0.118 4.445,-0.002 9.01,-0.045 13.489,-0.054 4.457,-0.002 8.9,-0.006 13.36,-0.008 5.347,-0.002 10.691,-0.009 16.044,-0.013 5.349,-0.006 11.099,0.006 16.186,-0.014 42.505,-1.787 85.049,0.31 128.139,-0.837 5.661,0.048 11.056,0.122 16.491,0.196 48.264,0.698 96.545,1.869 144.892,0.313 4.505,-0.033 31.88,0.34 28.403,0.34 -5.145,0 0,0 0,0 l 0,-3.891 c 0,0 -10.326,0 -28.309,0.107 -49.603,1.116 -99.17,0.614 -148.832,0.177 -5.598,-0.04 -11.238,-0.079 -17.112,-0.07 -41.437,0.833 -86.83,1.878 -130.415,0.244 -5.601,-0.002 -11.205,-0.003 -16.807,-0.006 -9,-0.005 -18.001,-0.009 -27.007,-0.017 -4.5,-0.005 -9.003,-0.005 -13.509,-0.009 -29.572,0.621 -57.935,0.621 -86.178,0.307 -4.944,0.012 -9.854,0.036 -14.745,0.058 C 281.04,-2.175 247.274,-2.358 213.482,-2.966 208.069,-2.974 202.665,-3.094 197.261,-3.103 132.43,-3.189 67.653,-3.372 3.023,-3.372 L 0,-3.372 0,0 Z" /></g><g
                   id="g124"
                   transform="translate(0,334.2773)"><path
                     inkscape:connector-curvature="0"
                     id="path126"
                     style="fill:#bf864f;fill-opacity:1;fill-rule:nonzero;stroke:none"
                     d="m 0,0 121.694,0 c 4.153,0 8.395,-0.2 12.706,-0.187 18.219,-0.017 38.017,-0.125 55.135,-0.125 4.977,-0.004 9.951,-0.057 14.934,-0.055 49.776,0.006 100.016,-0.023 149.64,-0.023 4.964,0 9.942,0 14.896,0.004 29.676,-0.016 60.781,-0.02 89.667,-0.02 5.375,0 10.727,0.009 16.065,0.034 58.766,0.279 115.961,2.091 174.911,0.191 C 652.776,-0.19 655.896,0 659.009,0 l 29.165,0 17.032,0 92.921,0 0,-2.06 -77.098,0 -15.823,0 -44.482,0 c -4.855,0 -9.732,-0.197 -14.541,-0.197 -58.011,-0.03 -117.406,-0.14 -175.935,-0.135 -3.756,0 -7.537,-0.062 -11.311,-0.062 -4.404,0 -8.825,-0.024 -13.247,-0.023 -21.557,-0.004 -44.183,-0.019 -66.655,-0.017 -4.344,0.016 -8.845,-0.053 -13.189,-0.053 -56.426,-0.79 -112.165,-0.315 -168.26,-0.081 -5.102,0.021 -10.204,0.265 -15.307,0.282 -15.521,0.061 -29.66,0.286 -42.966,0.286 l -12.469,0 L 0,-2.06 0,0 Z" /></g><g
                   id="g128"
                   transform="translate(0,152.7441)"><path
                     inkscape:connector-curvature="0"
                     id="path130"
                     style="fill:#bf864f;fill-opacity:1;fill-rule:nonzero;stroke:none"
                     d="m 0,0 123.528,0 c 4.164,0 8.422,-0.271 12.746,-0.257 18.268,-0.02 38.124,-0.16 55.291,-0.158 4.985,-0.007 9.977,-0.08 14.972,-0.077 49.921,0.006 100.302,-0.028 150.067,-0.028 4.98,0 9.975,-0.006 14.939,-0.004 29.758,-0.012 60.959,-0.022 89.923,-0.022 5.388,0 10.759,0.01 16.115,0.036 58.934,0.278 116.289,2.156 175.406,0.261 3.137,-0.012 6.266,0.249 9.391,0.249 l 29.241,0 17.083,0 89.425,0 -73.558,0 -15.867,0 -44.607,0 c -4.867,0 -9.762,-1.299 -14.582,-1.299 -58.18,-0.029 -117.74,-0.689 -176.438,-0.683 -3.763,0 -7.559,-0.338 -11.346,-0.338 -4.413,0 -8.848,-0.162 -13.281,-0.16 -21.621,-0.007 -44.312,-0.09 -66.846,-0.086 -4.357,0.013 -8.87,-0.089 -13.223,-0.089 -56.59,-0.789 -112.488,-0.329 -168.742,-0.097 -5.114,0.023 -10.232,1.356 -15.351,1.373 C 168.726,-1.315 154.542,0 141.195,0 L 128.694,0 0,0 Z" /></g><g
                   id="g132"
                   transform="translate(0,346.2842)"><path
                     inkscape:connector-curvature="0"
                     id="path134"
                     style="fill:#bf864f;fill-opacity:1;fill-rule:nonzero;stroke:none"
                     d="m 0,0 75.618,0 9.303,0 C 217.67,2.061 353.425,2.061 486.392,0 l 14.705,0 178.646,0 16.42,0 82.774,0 19.19,0 c 2.655,0 0,0 0,0 l 0,-4.12 -19.19,0 -8.465,0 -80.432,0 -15.947,0 c -58.075,2.06 -117.141,0.308 -174.674,0.062 -4.797,-0.02 -9.583,-0.082 -14.358,-0.098 C 356.253,-2.152 226.155,-4.183 94.732,-4.168 91.354,-4.18 88.09,-4.12 84.921,-4.12 L 0,-4.12 0,0 Z" /></g><g
                   id="g136"
                   transform="translate(0,359.1631)"><path
                     inkscape:connector-curvature="0"
                     id="path138"
                     style="fill:#bf864f;fill-opacity:1;fill-rule:nonzero;stroke:none"
                     d="m 0,0 77.856,0 9.63,0 c 130.184,0 260.284,1.053 389.096,-1.222 5.122,-0.049 10.526,-0.625 15.731,-0.688 56.551,-0.737 113.917,-2.493 169.782,-0.413 5.645,0.022 11.129,0.941 16.565,0.947 C 716.065,-1.39 760.936,0 798.127,0 c 2.655,0 0,0 0,0 l 0,-4.12 c 0,0 2.655,0 0,0 -2.654,0 -14.108,-0.032 -19.243,-0.038 -30.913,0.004 -61.968,-0.013 -93.026,-0.013 -5.177,0 -10.598,0.019 -15.768,0.015 -57.699,0.01 -117.203,0.036 -175.959,0.036 l -16.314,0 C 347.77,0 220.497,-4.118 91.51,-4.111 87.556,-4.115 83.768,-4.12 80.113,-4.12 L 0,-4.12 0,0 Z" /></g><g
                   id="g140"
                   transform="translate(798.127,55.251)"><path
                     inkscape:connector-curvature="0"
                     id="path142"
                     style="fill:#bf864f;fill-opacity:1;fill-rule:nonzero;stroke:none"
                     d="m 0,0 c 0,0 -34.961,-0.904 -76.467,0 -5.279,0.113 -17.329,1.611 -23.429,2.102 -41.961,3.71 -72.169,-7.948 -114.965,-3.762 -3.63,0.386 -7.226,-0.407 -11.102,-0.407 l -135.411,0 c -4.151,0 -8.305,1.038 -12.463,1.043 -50.509,2.395 -85.455,7.401 -134.887,2.61 -7.8,-1.504 -21.237,-2.871 -25.29,-2.832 -17.11,-0.013 -34.164,-0.821 -51.174,-0.821 l -10.205,0 c -44.511,8.241 -92.731,-3.618 -138.461,-0.188 -4.66,0.172 -9.187,0.188 -13.717,0.188 l -11.432,0 -10.127,0 -28.997,0 0,8.241 39.124,0 11.432,0 c 4.53,0 9.057,-0.687 13.655,-0.93 45.792,-4.563 91.176,5.4 136.949,0.746 3.451,-0.152 6.944,0.184 10.435,0.184 l 52.649,0 c 3.947,0 7.912,-0.677 11.883,-0.656 52.274,3.581 97.654,2.72 148.163,0.324 4.158,-0.004 8.312,0.332 12.463,0.332 l 135.411,0 c 3.87,0 7.725,-0.699 11.256,-1.008 39.956,-3.282 82.5,3.591 121.528,0.71 6.308,-0.491 11.447,-0.688 16.712,-0.897 C -30.706,3.176 0,4.81 0,4.81 L 0,0 Z" /></g><g
                   id="g144"
                   transform="translate(798.127,35.9258)"><path
                     inkscape:connector-curvature="0"
                     id="path146"
                     style="fill:#bf864f;fill-opacity:1;fill-rule:nonzero;stroke:none"
                     d="M 0,0 -67.094,0 C -71.8,0 -76.708,0.397 -81.706,0.776 -89.661,2.799 -98.882,3.202 -107.39,3.202 -149.932,4.406 -160.568,-4.12 -234.551,0 l -11.095,0 -128.191,0 c -4.162,0 -8.325,0.409 -12.499,0.438 -34.888,2.672 -67.541,2.859 -101.339,1.678 -6.764,-0.237 -13.568,-0.423 -20.448,-0.741 -30.903,-1.184 -62.032,-1.339 -93.106,-1.21 -4.435,0.024 -8.858,0.08 -12.955,0.273 -34.228,0.322 -71.099,0.336 -105.476,0.254 -5.509,0.235 -10.518,0.229 -15.48,0.184 -4.949,-0.043 -9.891,-0.499 -14.825,-0.578 C -760.08,0.381 -768.933,0 -776.182,0 l -21.945,0 0,4.12 21.945,0 26.356,0 16.278,0 c 42.592,-4.12 87.972,1.943 130.383,-0.432 4.519,10e-4 9.037,-0.228 13.55,-0.224 22.569,0.016 45.073,-0.076 67.451,-0.044 5.089,0.277 10.08,0.499 15.052,0.748 44.727,2.224 90.368,0.6 133.275,-0.475 4.158,-0.004 8.312,0.427 12.463,0.427 l 135.411,0 c 3.886,0 7.79,-0.867 11.7,-1.252 28.167,-2.822 56.53,-0.645 84.892,2.961 17.018,2.405 36.874,-0.855 53.516,-2.051 5.285,-0.004 10.339,0.342 15.16,0.342 L 0,4.12 0,0 Z" /></g></g></g></g></g></g></g><g
       id="g5373"><g
         transform="translate(585.8516,294.9688)"
         id="g198"><path
           inkscape:connector-curvature="0"
           id="path200"
           style="fill:#929292;fill-opacity:1;fill-rule:nonzero;stroke:none"
           d="m 0,0 c 0,2.557 -2.238,4.653 -4.964,4.653 l -374.179,0 c -2.725,0 -4.953,-2.096 -4.953,-4.653 l 0,-137.492 c 0,-2.555 2.228,-4.654 4.953,-4.654 l 374.179,0 c 2.726,0 4.964,2.099 4.964,4.654 L 0,0 Z" /></g><g
         transform="translate(585.8516,157.4766)"
         id="g202"><path
           inkscape:connector-curvature="0"
           id="path204"
           style="fill:#999999;fill-opacity:1;fill-rule:nonzero;stroke:none"
           d="m 0,0 0,137.492 c 0,2.557 -2.238,4.654 -4.964,4.654 l -269.027,0 193.981,-146.8 75.046,0 C -2.238,-4.654 0,-2.555 0,0" /></g><g
         transform="translate(232.2539,267.8945)"
         id="g206"><path
           inkscape:connector-curvature="0"
           id="path208"
           style="fill:#ffffff;fill-opacity:1;fill-rule:nonzero;stroke:none"
           d="m 0,0 c 0,-0.667 -0.542,-1.211 -1.208,-1.211 l -18.488,0 c -0.668,0 -1.21,0.544 -1.21,1.211 l 0,18.481 c 0,0.669 0.542,1.21 1.21,1.21 l 18.488,0 C -0.542,19.691 0,19.15 0,18.481 L 0,0 Z" /></g><g
         transform="translate(270.5698,242.4395)"
         id="g210"><path
           inkscape:connector-curvature="0"
           id="path212"
           style="fill:#ffffff;fill-opacity:1;fill-rule:nonzero;stroke:none"
           d="m 0,0 c 0,-0.673 -0.535,-1.217 -1.21,-1.217 l -18.487,0 c -0.666,0 -1.203,0.544 -1.203,1.217 l 0,18.488 c 0,0.657 0.537,1.202 1.203,1.202 l 18.487,0 C -0.535,19.69 0,19.145 0,18.488 L 0,0 Z" /></g><g
         transform="translate(276.5996,216.9785)"
         id="g214"><path
           inkscape:connector-curvature="0"
           id="path216"
           style="fill:#ffffff;fill-opacity:1;fill-rule:nonzero;stroke:none"
           d="m 0,0 c 0,-0.67 -0.543,-1.203 -1.208,-1.203 l -18.491,0 c -0.655,0 -1.208,0.533 -1.208,1.203 l 0,18.492 c 0,0.654 0.553,1.199 1.208,1.199 l 18.491,0 C -0.543,19.691 0,19.146 0,18.492 L 0,0 Z" /></g><g
         transform="translate(264.1338,191.5225)"
         id="g218"><path
           inkscape:connector-curvature="0"
           id="path220"
           style="fill:#ffffff;fill-opacity:1;fill-rule:nonzero;stroke:none"
           d="m 0,0 c 0,-0.661 -0.541,-1.208 -1.203,-1.208 l -18.489,0 c -0.66,0 -1.204,0.547 -1.204,1.208 l 0,18.486 c 0,0.663 0.544,1.212 1.204,1.212 l 18.489,0 C -0.541,19.698 0,19.149 0,18.486 L 0,0 Z" /></g><g
         transform="translate(232.2539,162.8516)"
         id="g222"><path
           inkscape:connector-curvature="0"
           id="path224"
           style="fill:#ffffff;fill-opacity:1;fill-rule:nonzero;stroke:none"
           d="m 0,0 c 0,-0.668 -0.542,-1.209 -1.208,-1.209 l -18.488,0 c -0.668,0 -1.21,0.541 -1.21,1.209 l 0,21.705 c 0,0.652 0.542,1.207 1.21,1.207 l 18.488,0 C -0.542,22.912 0,22.357 0,21.705 L 0,0 Z" /></g><g
         transform="translate(257.6362,162.8516)"
         id="g226"><path
           inkscape:connector-curvature="0"
           id="path228"
           style="fill:#ffffff;fill-opacity:1;fill-rule:nonzero;stroke:none"
           d="m 0,0 c 0,-0.668 -0.541,-1.209 -1.21,-1.209 l -18.481,0 c -0.662,0 -1.206,0.541 -1.206,1.209 l 0,21.705 c 0,0.652 0.544,1.207 1.206,1.207 l 18.481,0 C -0.541,22.912 0,22.357 0,21.705 L 0,0 Z" /></g><g
         transform="translate(283.0308,162.8516)"
         id="g230"><path
           inkscape:connector-curvature="0"
           id="path232"
           style="fill:#ffffff;fill-opacity:1;fill-rule:nonzero;stroke:none"
           d="m 0,0 c 0,-0.668 -0.546,-1.209 -1.211,-1.209 l -18.488,0 c -0.664,0 -1.205,0.541 -1.205,1.209 l 0,21.705 c 0,0.652 0.541,1.207 1.205,1.207 l 18.488,0 C -0.546,22.912 0,22.357 0,21.705 L 0,0 Z" /></g><g
         transform="translate(499.8877,162.8516)"
         id="g234"><path
           inkscape:connector-curvature="0"
           id="path236"
           style="fill:#ffffff;fill-opacity:1;fill-rule:nonzero;stroke:none"
           d="m 0,0 c 0,-0.668 -0.553,-1.209 -1.216,-1.209 l -18.49,0 c -0.66,0 -1.202,0.541 -1.202,1.209 l 0,21.705 c 0,0.652 0.542,1.207 1.202,1.207 l 18.49,0 C -0.553,22.912 0,22.357 0,21.705 L 0,0 Z" /></g><g
         transform="translate(525.335,162.8516)"
         id="g238"><path
           inkscape:connector-curvature="0"
           id="path240"
           style="fill:#ffffff;fill-opacity:1;fill-rule:nonzero;stroke:none"
           d="m 0,0 c 0,-0.668 -0.543,-1.209 -1.208,-1.209 l -18.477,0 c -0.675,0 -1.222,0.541 -1.222,1.209 l 0,9.646 c 0,0.66 0.547,1.208 1.222,1.208 l 18.477,0 C -0.543,10.854 0,10.306 0,9.646 L 0,0 Z" /></g><g
         transform="translate(576.249,162.8516)"
         id="g242"><path
           inkscape:connector-curvature="0"
           id="path244"
           style="fill:#ffffff;fill-opacity:1;fill-rule:nonzero;stroke:none"
           d="m 0,0 c 0,-0.668 -0.546,-1.209 -1.212,-1.209 l -18.481,0 c -0.663,0 -1.215,0.541 -1.215,1.209 l 0,9.646 c 0,0.66 0.552,1.208 1.215,1.208 l 18.481,0 C -0.546,10.854 0,10.306 0,9.646 L 0,0 Z" /></g><g
         transform="translate(315.0459,162.8516)"
         id="g246"><path
           inkscape:connector-curvature="0"
           id="path248"
           style="fill:#ffffff;fill-opacity:1;fill-rule:nonzero;stroke:none"
           d="m 0,0 c 0,-0.668 -0.542,-1.209 -1.199,-1.209 l -25.128,0 c -0.663,0 -1.202,0.541 -1.202,1.209 l 0,21.705 c 0,0.652 0.539,1.207 1.202,1.207 l 25.128,0 C -0.542,22.912 0,22.357 0,21.705 L 0,0 Z" /></g><g
         transform="translate(474.4238,162.8516)"
         id="g250"><path
           inkscape:connector-curvature="0"
           id="path252"
           style="fill:#ffffff;fill-opacity:1;fill-rule:nonzero;stroke:none"
           d="m 0,0 c 0,-0.668 -0.539,-1.209 -1.209,-1.209 l -25.119,0 c -0.658,0 -1.212,0.541 -1.212,1.209 l 0,21.705 c 0,0.652 0.554,1.207 1.212,1.207 l 25.119,0 C -0.539,22.912 0,22.357 0,21.705 L 0,0 Z" /></g><g
         transform="translate(442.3369,162.8516)"
         id="g254"><path
           inkscape:connector-curvature="0"
           id="path256"
           style="fill:#ffffff;fill-opacity:1;fill-rule:nonzero;stroke:none"
           d="m 0,0 c 0,-0.668 -0.549,-1.209 -1.218,-1.209 l -120.31,0 c -0.656,0 -1.212,0.541 -1.212,1.209 l 0,21.705 c 0,0.652 0.556,1.207 1.212,1.207 l 120.31,0 C -0.549,22.912 0,22.357 0,21.705 L 0,0 Z" /></g><g
         transform="translate(289.5894,191.5225)"
         id="g258"><path
           inkscape:connector-curvature="0"
           id="path260"
           style="fill:#ffffff;fill-opacity:1;fill-rule:nonzero;stroke:none"
           d="m 0,0 c 0,-0.661 -0.537,-1.208 -1.203,-1.208 l -18.489,0 c -0.655,0 -1.204,0.547 -1.204,1.208 l 0,18.486 c 0,0.663 0.549,1.212 1.204,1.212 l 18.489,0 C -0.537,19.698 0,19.149 0,18.486 L 0,0 Z" /></g><g
         transform="translate(315.0459,191.5225)"
         id="g262"><path
           inkscape:connector-curvature="0"
           id="path264"
           style="fill:#ffffff;fill-opacity:1;fill-rule:nonzero;stroke:none"
           d="m 0,0 c 0,-0.661 -0.542,-1.208 -1.199,-1.208 l -18.489,0 c -0.666,0 -1.208,0.547 -1.208,1.208 l 0,18.486 c 0,0.663 0.542,1.212 1.208,1.212 l 18.489,0 C -0.542,19.698 0,19.149 0,18.486 L 0,0 Z" /></g><g
         transform="translate(340.5063,191.5225)"
         id="g266"><path
           inkscape:connector-curvature="0"
           id="path268"
           style="fill:#ffffff;fill-opacity:1;fill-rule:nonzero;stroke:none"
           d="m 0,0 c 0,-0.661 -0.541,-1.208 -1.211,-1.208 l -18.486,0 c -0.657,0 -1.213,0.547 -1.213,1.208 l 0,18.486 c 0,0.663 0.556,1.212 1.213,1.212 l 18.486,0 C -0.541,19.698 0,19.149 0,18.486 L 0,0 Z" /></g><g
         transform="translate(365.9604,191.5225)"
         id="g270"><path
           inkscape:connector-curvature="0"
           id="path272"
           style="fill:#ffffff;fill-opacity:1;fill-rule:nonzero;stroke:none"
           d="m 0,0 c 0,-0.661 -0.546,-1.208 -1.203,-1.208 l -18.484,0 c -0.664,0 -1.213,0.547 -1.213,1.208 l 0,18.486 c 0,0.663 0.549,1.212 1.213,1.212 l 18.484,0 C -0.546,19.698 0,19.149 0,18.486 L 0,0 Z" /></g><g
         transform="translate(391.4185,191.5225)"
         id="g274"><path
           inkscape:connector-curvature="0"
           id="path276"
           style="fill:#ffffff;fill-opacity:1;fill-rule:nonzero;stroke:none"
           d="m 0,0 c 0,-0.661 -0.542,-1.208 -1.203,-1.208 l -18.49,0 c -0.66,0 -1.202,0.547 -1.202,1.208 l 0,18.486 c 0,0.663 0.542,1.212 1.202,1.212 l 18.49,0 C -0.542,19.698 0,19.149 0,18.486 L 0,0 Z" /></g><g
         transform="translate(416.877,191.5225)"
         id="g278"><path
           inkscape:connector-curvature="0"
           id="path280"
           style="fill:#ffffff;fill-opacity:1;fill-rule:nonzero;stroke:none"
           d="m 0,0 c 0,-0.661 -0.539,-1.208 -1.204,-1.208 l -18.489,0 c -0.669,0 -1.212,0.547 -1.212,1.208 l 0,18.486 c 0,0.663 0.543,1.212 1.212,1.212 l 18.489,0 C -0.539,19.698 0,19.149 0,18.486 L 0,0 Z" /></g><g
         transform="translate(442.3369,191.5225)"
         id="g282"><path
           inkscape:connector-curvature="0"
           id="path284"
           style="fill:#ffffff;fill-opacity:1;fill-rule:nonzero;stroke:none"
           d="m 0,0 c 0,-0.661 -0.549,-1.208 -1.218,-1.208 l -18.482,0 c -0.661,0 -1.202,0.547 -1.202,1.208 l 0,18.486 c 0,0.663 0.541,1.212 1.202,1.212 l 18.482,0 C -0.549,19.698 0,19.149 0,18.486 L 0,0 Z" /></g><g
         transform="translate(467.792,191.5225)"
         id="g286"><path
           inkscape:connector-curvature="0"
           id="path288"
           style="fill:#ffffff;fill-opacity:1;fill-rule:nonzero;stroke:none"
           d="m 0,0 c 0,-0.661 -0.544,-1.208 -1.211,-1.208 l -18.485,0 c -0.658,0 -1.212,0.547 -1.212,1.208 l 0,18.486 c 0,0.663 0.554,1.212 1.212,1.212 l 18.485,0 C -0.544,19.698 0,19.149 0,18.486 L 0,0 Z" /></g><g
         transform="translate(493.2451,191.5225)"
         id="g290"><path
           inkscape:connector-curvature="0"
           id="path292"
           style="fill:#ffffff;fill-opacity:1;fill-rule:nonzero;stroke:none"
           d="m 0,0 c 0,-0.661 -0.533,-1.208 -1.204,-1.208 l -18.488,0 c -0.668,0 -1.208,0.547 -1.208,1.208 l 0,18.486 c 0,0.663 0.54,1.212 1.208,1.212 l 18.488,0 C -0.533,19.698 0,19.149 0,18.486 L 0,0 Z" /></g><g
         transform="translate(518.7031,191.5225)"
         id="g294"><path
           inkscape:connector-curvature="0"
           id="path296"
           style="fill:#ffffff;fill-opacity:1;fill-rule:nonzero;stroke:none"
           d="m 0,0 c 0,-0.661 -0.546,-1.208 -1.209,-1.208 l -18.482,0 c -0.666,0 -1.213,0.547 -1.213,1.208 l 0,18.486 c 0,0.663 0.547,1.212 1.213,1.212 l 18.482,0 C -0.546,19.698 0,19.149 0,18.486 L 0,0 Z" /></g><g
         transform="translate(576.0439,191.5225)"
         id="g298"><path
           inkscape:connector-curvature="0"
           id="path300"
           style="fill:#ffffff;fill-opacity:1;fill-rule:nonzero;stroke:none"
           d="m 0,0 c 0,-0.661 -0.542,-1.208 -1.207,-1.208 l -50.372,0 c -0.664,0 -1.208,0.547 -1.208,1.208 l 0,18.486 c 0,0.663 0.544,1.212 1.208,1.212 l 50.372,0 C -0.542,19.698 0,19.149 0,18.486 L 0,0 Z" /></g><g
         transform="translate(302.0483,216.9785)"
         id="g302"><path
           inkscape:connector-curvature="0"
           id="path304"
           style="fill:#ffffff;fill-opacity:1;fill-rule:nonzero;stroke:none"
           d="m 0,0 c 0,-0.67 -0.531,-1.203 -1.197,-1.203 l -18.499,0 c -0.656,0 -1.198,0.533 -1.198,1.203 l 0,18.492 c 0,0.654 0.542,1.199 1.198,1.199 l 18.499,0 C -0.531,19.691 0,19.146 0,18.492 L 0,0 Z" /></g><g
         transform="translate(327.5107,216.9785)"
         id="g306"><path
           inkscape:connector-curvature="0"
           id="path308"
           style="fill:#ffffff;fill-opacity:1;fill-rule:nonzero;stroke:none"
           d="m 0,0 c 0,-0.67 -0.544,-1.203 -1.209,-1.203 l -18.49,0 c -0.66,0 -1.197,0.533 -1.197,1.203 l 0,18.492 c 0,0.654 0.537,1.199 1.197,1.199 l 18.49,0 C -0.544,19.691 0,19.146 0,18.492 L 0,0 Z" /></g><g
         transform="translate(352.9609,216.9785)"
         id="g310"><path
           inkscape:connector-curvature="0"
           id="path312"
           style="fill:#ffffff;fill-opacity:1;fill-rule:nonzero;stroke:none"
           d="m 0,0 c 0,-0.67 -0.531,-1.203 -1.199,-1.203 l -18.492,0 c -0.664,0 -1.203,0.533 -1.203,1.203 l 0,18.492 c 0,0.654 0.539,1.199 1.203,1.199 l 18.492,0 C -0.531,19.691 0,19.146 0,18.492 L 0,0 Z" /></g><g
         transform="translate(378.4233,216.9785)"
         id="g314"><path
           inkscape:connector-curvature="0"
           id="path316"
           style="fill:#ffffff;fill-opacity:1;fill-rule:nonzero;stroke:none"
           d="m 0,0 c 0,-0.67 -0.544,-1.203 -1.203,-1.203 l -18.497,0 c -0.658,0 -1.198,0.533 -1.198,1.203 l 0,18.492 c 0,0.654 0.54,1.199 1.198,1.199 l 18.497,0 C -0.544,19.691 0,19.146 0,18.492 L 0,0 Z" /></g><g
         transform="translate(403.8809,216.9785)"
         id="g318"><path
           inkscape:connector-curvature="0"
           id="path320"
           style="fill:#ffffff;fill-opacity:1;fill-rule:nonzero;stroke:none"
           d="m 0,0 c 0,-0.67 -0.547,-1.203 -1.207,-1.203 l -18.488,0 c -0.655,0 -1.211,0.533 -1.211,1.203 l 0,18.492 c 0,0.654 0.556,1.199 1.211,1.199 l 18.488,0 C -0.547,19.691 0,19.146 0,18.492 L 0,0 Z" /></g><g
         transform="translate(429.334,216.9785)"
         id="g322"><path
           inkscape:connector-curvature="0"
           id="path324"
           style="fill:#ffffff;fill-opacity:1;fill-rule:nonzero;stroke:none"
           d="m 0,0 c 0,-0.67 -0.542,-1.203 -1.205,-1.203 l -18.484,0 c -0.666,0 -1.207,0.533 -1.207,1.203 l 0,18.492 c 0,0.654 0.541,1.199 1.207,1.199 l 18.484,0 C -0.542,19.691 0,19.146 0,18.492 L 0,0 Z" /></g><g
         transform="translate(454.7881,216.9785)"
         id="g326"><path
           inkscape:connector-curvature="0"
           id="path328"
           style="fill:#ffffff;fill-opacity:1;fill-rule:nonzero;stroke:none"
           d="m 0,0 c 0,-0.67 -0.535,-1.203 -1.203,-1.203 l -18.488,0 c -0.664,0 -1.204,0.533 -1.204,1.203 l 0,18.492 c 0,0.654 0.54,1.199 1.204,1.199 l 18.488,0 C -0.535,19.691 0,19.146 0,18.492 L 0,0 Z" /></g><g
         transform="translate(480.25,216.9785)"
         id="g330"><path
           inkscape:connector-curvature="0"
           id="path332"
           style="fill:#ffffff;fill-opacity:1;fill-rule:nonzero;stroke:none"
           d="m 0,0 c 0,-0.67 -0.547,-1.203 -1.205,-1.203 l -18.49,0 c -0.662,0 -1.204,0.533 -1.204,1.203 l 0,18.492 c 0,0.654 0.542,1.199 1.204,1.199 l 18.49,0 C -0.547,19.691 0,19.146 0,18.492 L 0,0 Z" /></g><g
         transform="translate(505.708,216.9785)"
         id="g334"><path
           inkscape:connector-curvature="0"
           id="path336"
           style="fill:#ffffff;fill-opacity:1;fill-rule:nonzero;stroke:none"
           d="m 0,0 c 0,-0.67 -0.543,-1.203 -1.205,-1.203 l -18.495,0 c -0.666,0 -1.203,0.533 -1.203,1.203 l 0,18.492 c 0,0.654 0.537,1.199 1.203,1.199 l 18.495,0 C -0.543,19.691 0,19.146 0,18.492 L 0,0 Z" /></g><g
         transform="translate(531.1592,216.9785)"
         id="g338"><path
           inkscape:connector-curvature="0"
           id="path340"
           style="fill:#ffffff;fill-opacity:1;fill-rule:nonzero;stroke:none"
           d="m 0,0 c 0,-0.67 -0.541,-1.203 -1.203,-1.203 l -18.483,0 c -0.67,0 -1.212,0.533 -1.212,1.203 l 0,18.492 c 0,0.654 0.542,1.199 1.212,1.199 l 18.483,0 C -0.541,19.691 0,19.146 0,18.492 L 0,0 Z" /></g><g
         transform="translate(556.6162,216.9785)"
         id="g342"><path
           inkscape:connector-curvature="0"
           id="path344"
           style="fill:#ffffff;fill-opacity:1;fill-rule:nonzero;stroke:none"
           d="m 0,0 c 0,-0.67 -0.542,-1.203 -1.202,-1.203 l -18.496,0 c -0.661,0 -1.197,0.533 -1.197,1.203 l 0,18.492 c 0,0.654 0.536,1.199 1.197,1.199 l 18.496,0 C -0.542,19.691 0,19.146 0,18.492 L 0,0 Z" /></g><g
         transform="translate(296.0264,242.4395)"
         id="g346"><path
           inkscape:connector-curvature="0"
           id="path348"
           style="fill:#ffffff;fill-opacity:1;fill-rule:nonzero;stroke:none"
           d="m 0,0 c 0,-0.673 -0.543,-1.217 -1.21,-1.217 l -18.487,0 c -0.662,0 -1.21,0.544 -1.21,1.217 l 0,18.488 c 0,0.657 0.548,1.202 1.21,1.202 l 18.487,0 C -0.543,19.69 0,19.145 0,18.488 L 0,0 Z" /></g><g
         transform="translate(321.4824,242.4395)"
         id="g350"><path
           inkscape:connector-curvature="0"
           id="path352"
           style="fill:#ffffff;fill-opacity:1;fill-rule:nonzero;stroke:none"
           d="m 0,0 c 0,-0.673 -0.542,-1.217 -1.21,-1.217 l -18.489,0 c -0.661,0 -1.202,0.544 -1.202,1.217 l 0,18.488 c 0,0.657 0.541,1.202 1.202,1.202 l 18.489,0 C -0.542,19.69 0,19.145 0,18.488 L 0,0 Z" /></g><g
         transform="translate(346.9375,242.4395)"
         id="g354"><path
           inkscape:connector-curvature="0"
           id="path356"
           style="fill:#ffffff;fill-opacity:1;fill-rule:nonzero;stroke:none"
           d="m 0,0 c 0,-0.673 -0.541,-1.217 -1.209,-1.217 l -18.488,0 c -0.657,0 -1.198,0.544 -1.198,1.217 l 0,18.488 c 0,0.657 0.541,1.202 1.198,1.202 l 18.488,0 C -0.541,19.69 0,19.145 0,18.488 L 0,0 Z" /></g><g
         transform="translate(372.3882,242.4395)"
         id="g358"><path
           inkscape:connector-curvature="0"
           id="path360"
           style="fill:#ffffff;fill-opacity:1;fill-rule:nonzero;stroke:none"
           d="m 0,0 c 0,-0.673 -0.543,-1.217 -1.2,-1.217 l -18.488,0 c -0.666,0 -1.208,0.544 -1.208,1.217 l 0,18.488 c 0,0.657 0.542,1.202 1.208,1.202 l 18.488,0 c 0.657,0 1.2,-0.545 1.2,-1.202 L 0,0 Z" /></g><g
         transform="translate(397.8486,242.4395)"
         id="g362"><path
           inkscape:connector-curvature="0"
           id="path364"
           style="fill:#ffffff;fill-opacity:1;fill-rule:nonzero;stroke:none"
           d="m 0,0 c 0,-0.673 -0.54,-1.217 -1.21,-1.217 l -18.485,0 c -0.662,0 -1.201,0.544 -1.201,1.217 l 0,18.488 c 0,0.657 0.539,1.202 1.201,1.202 l 18.485,0 C -0.54,19.69 0,19.145 0,18.488 L 0,0 Z" /></g><g
         transform="translate(423.3008,242.4395)"
         id="g366"><path
           inkscape:connector-curvature="0"
           id="path368"
           style="fill:#ffffff;fill-opacity:1;fill-rule:nonzero;stroke:none"
           d="m 0,0 c 0,-0.673 -0.534,-1.217 -1.2,-1.217 l -18.49,0 c -0.666,0 -1.208,0.544 -1.208,1.217 l 0,18.488 c 0,0.657 0.542,1.202 1.208,1.202 l 18.49,0 c 0.666,0 1.2,-0.545 1.2,-1.202 L 0,0 Z" /></g><g
         transform="translate(448.7598,242.4395)"
         id="g370"><path
           inkscape:connector-curvature="0"
           id="path372"
           style="fill:#ffffff;fill-opacity:1;fill-rule:nonzero;stroke:none"
           d="m 0,0 c 0,-0.673 -0.535,-1.217 -1.203,-1.217 l -18.494,0 c -0.657,0 -1.199,0.544 -1.199,1.217 l 0,18.488 c 0,0.657 0.542,1.202 1.199,1.202 l 18.494,0 C -0.535,19.69 0,19.145 0,18.488 L 0,0 Z" /></g><g
         transform="translate(474.2217,242.4395)"
         id="g374"><path
           inkscape:connector-curvature="0"
           id="path376"
           style="fill:#ffffff;fill-opacity:1;fill-rule:nonzero;stroke:none"
           d="m 0,0 c 0,-0.673 -0.542,-1.217 -1.212,-1.217 l -18.488,0 c -0.663,0 -1.205,0.544 -1.205,1.217 l 0,18.488 c 0,0.657 0.542,1.202 1.205,1.202 l 18.488,0 C -0.542,19.69 0,19.145 0,18.488 L 0,0 Z" /></g><g
         transform="translate(499.6719,242.4395)"
         id="g378"><path
           inkscape:connector-curvature="0"
           id="path380"
           style="fill:#ffffff;fill-opacity:1;fill-rule:nonzero;stroke:none"
           d="m 0,0 c 0,-0.673 -0.542,-1.217 -1.198,-1.217 l -18.49,0 c -0.667,0 -1.206,0.544 -1.206,1.217 l 0,18.488 c 0,0.657 0.539,1.202 1.206,1.202 l 18.49,0 C -0.542,19.69 0,19.145 0,18.488 L 0,0 Z" /></g><g
         transform="translate(525.1338,242.4395)"
         id="g382"><path
           inkscape:connector-curvature="0"
           id="path384"
           style="fill:#ffffff;fill-opacity:1;fill-rule:nonzero;stroke:none"
           d="m 0,0 c 0,-0.673 -0.542,-1.217 -1.213,-1.217 l -18.486,0 c -0.655,0 -1.203,0.544 -1.203,1.217 l 0,18.488 c 0,0.657 0.548,1.202 1.203,1.202 l 18.486,0 C -0.542,19.69 0,19.145 0,18.488 L 0,0 Z" /></g><g
         transform="translate(550.5869,242.4395)"
         id="g386"><path
           inkscape:connector-curvature="0"
           id="path388"
           style="fill:#ffffff;fill-opacity:1;fill-rule:nonzero;stroke:none"
           d="m 0,0 c 0,-0.673 -0.542,-1.217 -1.202,-1.217 l -18.489,0 c -0.666,0 -1.208,0.544 -1.208,1.217 l 0,18.488 c 0,0.657 0.542,1.202 1.208,1.202 l 18.489,0 C -0.542,19.69 0,19.145 0,18.488 L 0,0 Z" /></g><g
         transform="translate(245.1138,242.4395)"
         id="g390"><path
           inkscape:connector-curvature="0"
           id="path392"
           style="fill:#ffffff;fill-opacity:1;fill-rule:nonzero;stroke:none"
           d="m 0,0 c 0,-0.673 -0.541,-1.217 -1.208,-1.217 l -31.348,0 c -0.668,0 -1.21,0.544 -1.21,1.217 l 0,18.488 c 0,0.657 0.542,1.202 1.21,1.202 l 31.348,0 C -0.541,19.69 0,19.145 0,18.488 L 0,0 Z" /></g><g
         transform="translate(576.0439,267.8945)"
         id="g394"><path
           inkscape:connector-curvature="0"
           id="path396"
           style="fill:#ffffff;fill-opacity:1;fill-rule:nonzero;stroke:none"
           d="m 0,0 c 0,-0.667 -0.542,-1.211 -1.207,-1.211 l -31.352,0 c -0.654,0 -1.203,0.544 -1.203,1.211 l 0,18.481 c 0,0.669 0.549,1.21 1.203,1.21 l 31.352,0 C -0.542,19.691 0,19.15 0,18.481 L 0,0 Z" /></g><g
         transform="translate(251.1372,216.9785)"
         id="g398"><path
           inkscape:connector-curvature="0"
           id="path400"
           style="fill:#ffffff;fill-opacity:1;fill-rule:nonzero;stroke:none"
           d="m 0,0 c 0,-0.67 -0.536,-1.203 -1.208,-1.203 l -37.372,0 c -0.668,0 -1.209,0.533 -1.209,1.203 l 0,18.492 c 0,0.654 0.541,1.199 1.209,1.199 l 37.372,0 C -0.536,19.691 0,19.146 0,18.492 L 0,0 Z" /></g><g
         transform="translate(238.6846,191.5225)"
         id="g402"><path
           inkscape:connector-curvature="0"
           id="path404"
           style="fill:#ffffff;fill-opacity:1;fill-rule:nonzero;stroke:none"
           d="m 0,0 c 0,-0.661 -0.543,-1.208 -1.209,-1.208 l -24.918,0 c -0.668,0 -1.209,0.547 -1.209,1.208 l 0,18.486 c 0,0.663 0.541,1.212 1.209,1.212 l 24.918,0 C -0.543,19.698 0,19.149 0,18.486 L 0,0 Z" /></g><g
         transform="translate(257.7056,267.8945)"
         id="g406"><path
           inkscape:connector-curvature="0"
           id="path408"
           style="fill:#ffffff;fill-opacity:1;fill-rule:nonzero;stroke:none"
           d="m 0,0 c 0,-0.667 -0.538,-1.211 -1.212,-1.211 l -18.476,0 c -0.666,0 -1.209,0.544 -1.209,1.211 l 0,18.481 c 0,0.669 0.543,1.21 1.209,1.21 l 18.476,0 C -0.538,19.691 0,19.15 0,18.481 L 0,0 Z" /></g><g
         transform="translate(283.1641,267.8945)"
         id="g410"><path
           inkscape:connector-curvature="0"
           id="path412"
           style="fill:#ffffff;fill-opacity:1;fill-rule:nonzero;stroke:none"
           d="m 0,0 c 0,-0.667 -0.541,-1.211 -1.206,-1.211 l -18.491,0 c -0.658,0 -1.199,0.544 -1.199,1.211 l 0,18.481 c 0,0.669 0.541,1.21 1.199,1.21 l 18.491,0 C -0.541,19.691 0,19.15 0,18.481 L 0,0 Z" /></g><g
         transform="translate(308.6294,267.8945)"
         id="g414"><path
           inkscape:connector-curvature="0"
           id="path416"
           style="fill:#ffffff;fill-opacity:1;fill-rule:nonzero;stroke:none"
           d="m 0,0 c 0,-0.667 -0.555,-1.211 -1.219,-1.211 l -18.489,0 c -0.662,0 -1.202,0.544 -1.202,1.211 l 0,18.481 c 0,0.669 0.54,1.21 1.202,1.21 l 18.489,0 C -0.555,19.691 0,19.15 0,18.481 L 0,0 Z" /></g><g
         transform="translate(334.0776,267.8945)"
         id="g418"><path
           inkscape:connector-curvature="0"
           id="path420"
           style="fill:#ffffff;fill-opacity:1;fill-rule:nonzero;stroke:none"
           d="m 0,0 c 0,-0.667 -0.544,-1.211 -1.21,-1.211 l -18.489,0 c -0.662,0 -1.209,0.544 -1.209,1.211 l 0,18.481 c 0,0.669 0.547,1.21 1.209,1.21 l 18.489,0 C -0.544,19.691 0,19.15 0,18.481 L 0,0 Z" /></g><g
         transform="translate(359.5244,267.8945)"
         id="g422"><path
           inkscape:connector-curvature="0"
           id="path424"
           style="fill:#ffffff;fill-opacity:1;fill-rule:nonzero;stroke:none"
           d="m 0,0 c 0,-0.667 -0.533,-1.211 -1.201,-1.211 l -18.488,0 c -0.663,0 -1.205,0.544 -1.205,1.211 l 0,18.481 c 0,0.669 0.542,1.21 1.205,1.21 l 18.488,0 C -0.533,19.691 0,19.15 0,18.481 L 0,0 Z" /></g><g
         transform="translate(384.9893,267.8945)"
         id="g426"><path
           inkscape:connector-curvature="0"
           id="path428"
           style="fill:#ffffff;fill-opacity:1;fill-rule:nonzero;stroke:none"
           d="m 0,0 c 0,-0.667 -0.543,-1.211 -1.209,-1.211 l -18.477,0 c -0.67,0 -1.211,0.544 -1.211,1.211 l 0,18.481 c 0,0.669 0.541,1.21 1.211,1.21 l 18.477,0 C -0.543,19.691 0,19.15 0,18.481 L 0,0 Z" /></g><g
         transform="translate(410.4375,267.8945)"
         id="g430"><path
           inkscape:connector-curvature="0"
           id="path432"
           style="fill:#ffffff;fill-opacity:1;fill-rule:nonzero;stroke:none"
           d="m 0,0 c 0,-0.667 -0.529,-1.211 -1.2,-1.211 l -18.483,0 c -0.671,0 -1.212,0.544 -1.212,1.211 l 0,18.481 c 0,0.669 0.541,1.21 1.212,1.21 l 18.483,0 c 0.671,0 1.2,-0.541 1.2,-1.21 L 0,0 Z" /></g><g
         transform="translate(435.8994,267.8945)"
         id="g434"><path
           inkscape:connector-curvature="0"
           id="path436"
           style="fill:#ffffff;fill-opacity:1;fill-rule:nonzero;stroke:none"
           d="m 0,0 c 0,-0.667 -0.541,-1.211 -1.212,-1.211 l -18.487,0 c -0.665,0 -1.206,0.544 -1.206,1.211 l 0,18.481 c 0,0.669 0.541,1.21 1.206,1.21 l 18.487,0 C -0.541,19.691 0,19.15 0,18.481 L 0,0 Z" /></g><g
         transform="translate(461.3496,267.8945)"
         id="g438"><path
           inkscape:connector-curvature="0"
           id="path440"
           style="fill:#ffffff;fill-opacity:1;fill-rule:nonzero;stroke:none"
           d="m 0,0 c 0,-0.667 -0.534,-1.211 -1.197,-1.211 l -18.487,0 c -0.67,0 -1.211,0.544 -1.211,1.211 l 0,18.481 c 0,0.669 0.541,1.21 1.211,1.21 l 18.487,0 C -0.534,19.691 0,19.15 0,18.481 L 0,0 Z" /></g><g
         transform="translate(486.8154,267.8945)"
         id="g442"><path
           inkscape:connector-curvature="0"
           id="path444"
           style="fill:#ffffff;fill-opacity:1;fill-rule:nonzero;stroke:none"
           d="m 0,0 c 0,-0.667 -0.547,-1.211 -1.203,-1.211 l -18.495,0 c -0.659,0 -1.201,0.544 -1.201,1.211 l 0,18.481 c 0,0.669 0.542,1.21 1.201,1.21 l 18.495,0 C -0.547,19.691 0,19.15 0,18.481 L 0,0 Z" /></g><g
         transform="translate(512.2715,267.8945)"
         id="g446"><path
           inkscape:connector-curvature="0"
           id="path448"
           style="fill:#ffffff;fill-opacity:1;fill-rule:nonzero;stroke:none"
           d="m 0,0 c 0,-0.667 -0.541,-1.211 -1.208,-1.211 l -18.487,0 c -0.669,0 -1.212,0.544 -1.212,1.211 l 0,18.481 c 0,0.669 0.543,1.21 1.212,1.21 l 18.487,0 C -0.541,19.691 0,19.15 0,18.481 L 0,0 Z" /></g><g
         transform="translate(537.7227,267.8945)"
         id="g450"><path
           inkscape:connector-curvature="0"
           id="path452"
           style="fill:#ffffff;fill-opacity:1;fill-rule:nonzero;stroke:none"
           d="m 0,0 c 0,-0.667 -0.537,-1.211 -1.199,-1.211 l -18.499,0 c -0.657,0 -1.198,0.544 -1.198,1.211 l 0,18.481 c 0,0.669 0.541,1.21 1.198,1.21 l 18.499,0 C -0.537,19.691 0,19.15 0,18.481 L 0,0 Z" /></g><g
         transform="translate(529.8906,173.0205)"
         id="g454"><path
           inkscape:connector-curvature="0"
           id="path456"
           style="fill:#ffffff;fill-opacity:1;fill-rule:nonzero;stroke:none"
           d="m 0,0 0,-10.169 c 0,-0.312 0.118,-0.628 0.35,-0.853 0.238,-0.239 0.551,-0.356 0.856,-0.356 l 18.49,0 c 0.307,0 0.611,0.117 0.852,0.356 0.236,0.225 0.354,0.541 0.354,0.853 L 20.902,0 0,0 Z" /></g><g
         transform="translate(550.793,174.3848)"
         id="g458"><path
           inkscape:connector-curvature="0"
           id="path460"
           style="fill:#ffffff;fill-opacity:1;fill-rule:nonzero;stroke:none"
           d="m 0,0 0,10.172 c 0,0.301 -0.118,0.613 -0.354,0.845 -0.242,0.238 -0.545,0.362 -0.852,0.362 l -18.49,0 c -0.305,0 -0.618,-0.124 -0.857,-0.362 -0.231,-0.232 -0.349,-0.544 -0.349,-0.845 L -20.902,0 0,0 Z" /></g><g
         transform="translate(556.3457,262.1299)"
         id="g462"><path
           inkscape:connector-curvature="0"
           id="path464"
           style="fill:#ffffff;fill-opacity:1;fill-rule:nonzero;stroke:none"
           d="m 0,0 c -0.305,0 -0.61,-0.111 -0.849,-0.354 -0.235,-0.235 -0.346,-0.538 -0.346,-0.848 l 0,-18.488 c 0,-0.311 0.111,-0.623 0.346,-0.862 0.239,-0.23 0.544,-0.355 0.849,-0.355 l 4.827,0 0,-24.244 c 0,-0.313 0.123,-0.623 0.357,-0.854 0.236,-0.236 0.541,-0.349 0.852,-0.349 l 12.455,0 c 0.313,0 0.617,0.113 0.857,0.349 0.238,0.231 0.356,0.541 0.356,0.854 l 0,43.949 c 0,0.31 -0.118,0.613 -0.356,0.848 C 19.108,-0.111 18.804,0 18.491,0 L 0,0 Z" /></g><g
         transform="translate(434.0391,251.9961)"
         id="g466"><path
           inkscape:connector-curvature="0"
           id="path468"
           style="fill:#ffce89;fill-opacity:1;fill-rule:nonzero;stroke:none"
           d="m 0,0 c 4.134,2.461 9.484,1.105 11.949,-3.031 l 32.843,-55.15 c 2.463,-4.133 1.105,-9.482 -3.029,-11.946 -4.138,-2.464 -9.488,-1.109 -11.95,3.026 L -3.035,-11.955 C -5.498,-7.816 -4.139,-2.466 0,0" /></g><g
         transform="translate(485.585,249.4092)"
         id="g474"><path
           inkscape:connector-curvature="0"
           id="path476"
           style="fill:#ffce89;fill-opacity:1;fill-rule:nonzero;stroke:none"
           d="m 0,0 c 4.137,2.463 9.488,1.107 11.951,-3.026 l 21.036,-35.326 c 2.463,-4.133 1.105,-9.486 -3.03,-11.949 -4.137,-2.464 -9.484,-1.106 -11.948,3.03 L -3.026,-11.947 C -5.49,-7.813 -4.135,-2.463 0,0" /></g><g
         transform="translate(458.5283,253.1533)"
         id="g478"><path
           inkscape:connector-curvature="0"
           id="path480"
           style="fill:#ffce89;fill-opacity:1;fill-rule:nonzero;stroke:none"
           d="M 0,0 C 4.137,2.463 9.49,1.104 11.952,-3.033 L 44.795,-58.18 c 2.463,-4.136 1.105,-9.488 -3.029,-11.952 -4.136,-2.463 -9.49,-1.105 -11.953,3.029 L -3.026,-11.955 C -5.489,-7.817 -4.137,-2.463 0,0" /></g><g
         transform="translate(419.7246,233.7461)"
         id="g482"><path
           inkscape:connector-curvature="0"
           id="path484"
           style="fill:#ffce89;fill-opacity:1;fill-rule:nonzero;stroke:none"
           d="m 0,0 c 4.137,2.464 9.491,1.107 11.952,-3.028 l 32.843,-55.151 c 2.462,-4.134 1.104,-9.486 -3.029,-11.95 -4.137,-2.463 -9.491,-1.105 -11.952,3.028 L -3.029,-11.949 C -5.493,-7.815 -4.136,-2.461 0,0" /></g><g
         transform="translate(348.5229,253.96)"
         id="g510"><path
           inkscape:connector-curvature="0"
           id="path512"
           style="fill:#ffce89;fill-opacity:1;fill-rule:nonzero;stroke:none"
           d="m 0,0 c -4.133,2.461 -9.484,1.105 -11.948,-3.031 l -32.844,-55.15 c -2.462,-4.133 -1.105,-9.482 3.03,-11.946 4.138,-2.464 9.487,-1.109 11.949,3.026 L 3.036,-11.955 C 5.499,-7.816 4.139,-2.466 0,0" /></g><g
         transform="translate(296.9771,251.373)"
         id="g518"><path
           inkscape:connector-curvature="0"
           id="path520"
           style="fill:#ffce89;fill-opacity:1;fill-rule:nonzero;stroke:none"
           d="m 0,0 c -4.137,2.463 -9.487,1.107 -11.951,-3.026 l -21.036,-35.326 c -2.463,-4.133 -1.105,-9.486 3.031,-11.949 4.137,-2.464 9.484,-1.106 11.947,3.03 L 3.027,-11.947 C 5.491,-7.813 4.136,-2.463 0,0" /></g><g
         transform="translate(324.0342,255.1172)"
         id="g522"><path
           inkscape:connector-curvature="0"
           id="path524"
           style="fill:#ffce89;fill-opacity:1;fill-rule:nonzero;stroke:none"
           d="M 0,0 C -4.137,2.463 -9.49,1.104 -11.952,-3.033 L -44.795,-58.18 c -2.463,-4.136 -1.106,-9.488 3.03,-11.952 4.135,-2.463 9.489,-1.105 11.952,3.029 L 3.026,-11.955 C 5.489,-7.817 4.137,-2.463 0,0" /></g><g
         transform="translate(362.8379,235.71)"
         id="g526"><path
           inkscape:connector-curvature="0"
           id="path528"
           style="fill:#ffce89;fill-opacity:1;fill-rule:nonzero;stroke:none"
           d="m 0,0 c -4.136,2.464 -9.491,1.107 -11.952,-3.028 l -32.842,-55.151 c -2.463,-4.134 -1.105,-9.486 3.029,-11.95 4.137,-2.463 9.49,-1.105 11.951,3.028 L 3.03,-11.949 C 5.493,-7.815 4.136,-2.461 0,0" /></g><g
         transform="translate(319.7363,138.3486)"
         id="g534"><path
           inkscape:connector-curvature="0"
           id="path536"
           style="fill:#ffce89;fill-opacity:1;fill-rule:nonzero;stroke:none"
           d="m 0,0 17.015,28.571 c 3.638,6.108 11.535,8.113 17.645,4.475 l 3.685,-2.195 c 0.156,-0.093 0.295,-0.201 0.446,-0.3 L 24.259,6.148 0,0 Z" /></g></g><g
       id="g156"
       transform="translate(465.4453,335.1807)"><path
         d="m 0,0 257.82,0 c 5.562,0 10.085,-4.527 10.085,-10.09 0,-5.565 -4.523,-10.093 -10.085,-10.093 l -51.795,0 c -5.545,0 -10.059,-4.511 -10.059,-10.061 l 0,-58.174 4.36,0 0,58.174 c 0,3.139 2.563,5.695 5.699,5.695 l 51.795,0 c 7.961,0 14.448,6.49 14.448,14.459 0,7.969 -6.487,14.45 -14.448,14.45 L 0,4.366"
         style="fill:#ffffff;fill-opacity:1;fill-rule:nonzero;stroke:none"
         id="path158"
         inkscape:connector-curvature="0" /></g><g
       id="g160"
       transform="translate(668.582,250.6465)"><path
         d="m 0,0 c 11.041,0 19.999,-8.959 19.999,-19.995 l 0,-47.979 C 19.999,-79.005 11.041,-87.957 0,-87.957 l -5.318,0 L -5.318,0 0,0 Z"
         style="fill:#ffffff;fill-opacity:1;fill-rule:nonzero;stroke:none"
         id="path162"
         inkscape:connector-curvature="0" /></g><g
       id="g164"
       transform="translate(657.9297,250.6465)"><path
         d="m 0,0 5.334,0 0,-87.957 -5.334,0 c -11.034,0 -19.992,8.952 -19.992,19.983 l 0,47.979 C -19.992,-8.959 -11.034,0 0,0"
         style="fill:#e6e7e8;fill-opacity:1;fill-rule:nonzero;stroke:none"
         id="path166"
         inkscape:connector-curvature="0" /></g><g
       id="g168"
       transform="translate(669.9268,229.4277)"><path
         d="m 0,0 0,-4.299 c 0,-3.68 -2.998,-6.663 -6.663,-6.672 l 0,17.63 C -2.998,6.659 0,3.675 0,0"
         style="fill:#103754;fill-opacity:1;fill-rule:nonzero;stroke:none"
         id="path170"
         inkscape:connector-curvature="0" /></g><g
       id="g172"
       transform="translate(663.2637,236.0869)"><path
         d="m 0,0 0,0 0,-17.63 c -3.688,0 -6.665,2.992 -6.665,6.672 l 0,4.299 C -6.665,-2.984 -3.688,0 0,0"
         style="fill:#0e303f;fill-opacity:1;fill-rule:nonzero;stroke:none"
         id="path174"
         inkscape:connector-curvature="0" /></g><g
       id="g176"
       transform="translate(346.3213,396.5605)"><path
         d="m 0,0 c -4.317,-17.651 -8.635,-35.302 -12.95,-52.957 l 120.871,0 C 103.601,-35.302 99.283,-17.651 94.97,0 L 0,0 Z"
         style="fill:#929292;fill-opacity:1;fill-rule:nonzero;stroke:none"
         id="path178"
         inkscape:connector-curvature="0" /></g><g
       id="g180"
       transform="translate(393.0986,343.6035)"><path
         d="M 0,0 61.144,0 C 56.823,17.655 52.506,35.306 48.192,52.957 L 0,52.957 0,0 Z"
         style="fill:#969a9d;fill-opacity:1;fill-rule:nonzero;stroke:none"
         id="path182"
         inkscape:connector-curvature="0" /></g><g
       id="g184"
       transform="translate(461.71,344.5391)"><path
         d="m 0,0 -135.811,0 c -3.447,0 -6.243,-3.276 -6.243,-7.332 l 0,-2.751 148.298,0 0,2.751 C 6.244,-3.276 3.443,0 0,0"
         style="fill:#ffffff;fill-opacity:1;fill-rule:nonzero;stroke:none"
         id="path186"
         inkscape:connector-curvature="0" /></g><g
       id="g188"
       transform="translate(189.5869,417.1602)"><path
         d="M 0,0 0,-29.184 C 0,-34.8 4.541,-39.346 10.173,-39.346 l 388.088,0 c 5.616,0 10.172,4.546 10.172,10.162 L 408.433,0 0,0 Z"
         style="fill:#ffffff;fill-opacity:1;fill-rule:nonzero;stroke:none"
         id="path190"
         inkscape:connector-curvature="0" /></g><g
       id="g192"
       transform="translate(598.0195,417.1602)"><path
         d="m 0,0 0,247.07 c 0,5.62 -4.556,10.167 -10.172,10.167 l -388.088,0 c -5.632,0 -10.173,-4.547 -10.173,-10.167 L -408.433,0 0,0 Z"
         style="fill:#0e303f;fill-opacity:1;fill-rule:nonzero;stroke:none"
         id="path194"
         inkscape:connector-curvature="0" /></g><path
       d="m 206.319,658.508 374.972,0 0,-224.485 -374.972,0 0,224.485 z"
       style="fill:#6d8b95;fill-opacity:1;fill-rule:nonzero;stroke:none"
       id="path196"
       inkscape:connector-curvature="0" /><g
       id="g470"
       transform="translate(467.9424,135.6523)"><path
         d="m 0,0 c 6.399,-10.745 20.296,-14.27 31.04,-7.871 l 31.612,18.825 c 10.746,6.4 14.272,20.299 7.869,31.044 L 51.699,73.611 C 45.3,84.355 31.401,87.881 20.654,81.483 l -31.612,-18.83 c -10.75,-6.401 -14.27,-20.296 -7.869,-31.042 L 0,0 Z"
         style="fill:#ffce89;fill-opacity:1;fill-rule:nonzero;stroke:none"
         id="path472"
         inkscape:connector-curvature="0" /></g><g
       id="g486"
       transform="translate(569.9727,106.9316)"><path
         d="m 0,0 -42.833,71.924 c -4.342,7.29 -13.768,9.68 -21.058,5.34 L -85.335,64.492 c -7.293,-4.341 -9.681,-13.769 -5.339,-21.059 L -47.84,-28.49 0,0 Z"
         style="fill:#ffce89;fill-opacity:1;fill-rule:nonzero;stroke:none"
         id="path488"
         inkscape:connector-curvature="0" /></g><g
       id="g490"
       transform="translate(462.8262,136.3848)"><path
         d="m 0,0 -17.015,28.571 c -3.638,6.108 -11.536,8.113 -17.645,4.475 l -3.685,-2.195 c -0.157,-0.093 -0.295,-0.201 -0.446,-0.3 L -24.259,6.148 0,0 Z"
         style="fill:#ffce89;fill-opacity:1;fill-rule:nonzero;stroke:none"
         id="path492"
         inkscape:connector-curvature="0" /></g><g
       id="g494"
       transform="translate(469.9131,146.1465)"><path
         d="m 0,0 -29.616,7.506 c -2.8,0.71 -5.614,0.429 -8.092,-0.6 L -26.762,-11.476 12.807,-21.504 0,0 Z"
         style="fill:#ffce89;fill-opacity:1;fill-rule:nonzero;stroke:none"
         id="path496"
         inkscape:connector-curvature="0" /></g><g
       id="g498"
       transform="translate(640,0)"><path
         d="m 0,0 -76.544,0 -52.629,87.701 56.391,33.584 L 0,0 Z"
         style="fill:#424244;fill-opacity:1;fill-rule:nonzero;stroke:none"
         id="path500"
         inkscape:connector-curvature="0" /></g><g
       id="g502"
       transform="translate(561.79,124.084)"><path
         d="M 0,0 -50.838,-30.276 -63.019,-9.82 -12.183,20.454 0,0 Z"
         style="fill:#ffffff;fill-opacity:1;fill-rule:nonzero;stroke:none"
         id="path504"
         inkscape:connector-curvature="0" /></g><g
       id="g506"
       transform="translate(573.7656,112.2363)"><path
         d="M 0,0 -58.102,-34.603 -73.258,-9.155 -15.155,25.446 0,0 Z"
         style="fill:#58595b;fill-opacity:1;fill-rule:nonzero;stroke:none"
         id="path508"
         inkscape:connector-curvature="0" /></g><g
       id="g514"
       transform="translate(314.6206,137.6162)"><path
         d="m 0,0 c -6.399,-10.745 -20.296,-14.27 -31.041,-7.871 l -31.612,18.825 c -10.745,6.4 -14.271,20.299 -7.868,31.044 l 18.822,31.613 c 6.399,10.744 20.298,14.27 31.045,7.872 L 10.958,62.653 C 21.707,56.252 25.227,42.357 18.826,31.611 L 0,0 Z"
         style="fill:#ffce89;fill-opacity:1;fill-rule:nonzero;stroke:none"
         id="path516"
         inkscape:connector-curvature="0" /></g><g
       id="g530"
       transform="translate(212.5898,108.8955)"><path
         d="m 0,0 42.833,71.924 c 4.342,7.29 13.767,9.68 21.058,5.34 L 85.335,64.492 c 7.293,-4.341 9.681,-13.769 5.338,-21.059 L 47.84,-28.49 0,0 Z"
         style="fill:#ffce89;fill-opacity:1;fill-rule:nonzero;stroke:none"
         id="path532"
         inkscape:connector-curvature="0" /></g><g
       id="g538"
       transform="translate(312.6494,148.1104)"><path
         d="m 0,0 29.616,7.506 c 2.801,0.71 5.614,0.429 8.092,-0.6 L 26.762,-11.476 -12.807,-21.504 0,0 Z"
         style="fill:#ffce89;fill-opacity:1;fill-rule:nonzero;stroke:none"
         id="path540"
         inkscape:connector-curvature="0" /></g><g
       id="g542"
       transform="translate(135.125,0)"><path
         d="M 0,0 78.164,0 136.61,89.665 80.22,123.249 0,0 Z"
         style="fill:#424244;fill-opacity:1;fill-rule:nonzero;stroke:none"
         id="path544"
         inkscape:connector-curvature="0" /></g><g
       id="g546"
       transform="translate(220.7729,126.0479)"><path
         d="M 0,0 50.838,-30.276 63.018,-9.82 12.183,20.454 0,0 Z"
         style="fill:#ffffff;fill-opacity:1;fill-rule:nonzero;stroke:none"
         id="path548"
         inkscape:connector-curvature="0" /></g><g
       id="g550"
       transform="translate(208.7964,114.2002)"><path
         d="M 0,0 58.102,-34.603 73.258,-9.155 15.156,25.446 0,0 Z"
         style="fill:#58595b;fill-opacity:1;fill-rule:nonzero;stroke:none"
         id="path552"
         inkscape:connector-curvature="0" /></g><g
       transform="matrix(0.26610075,0,0,-0.26610075,292.07617,621.27482)"
       id="g4157"><g
         transform="matrix(1.7258825,0,0,1.7258825,-341.79557,-173.1258)"
         id="g3"><g
           id="g5"><path
             style="fill:#ff9800"
             inkscape:connector-curvature="0"
             id="path7"
             d="m 311.6,182.7 c 0,4.8 -3.9,8.6 -8.6,8.5 l -1.3,0 c -4.7,-0.2 -8.6,-4.3 -8.6,-9.1 l 0,-7 c 0,-4.8 3.9,-8.6 8.6,-8.5 l 1.3,0 c 4.7,0.2 8.6,4.3 8.6,9.1 l 0,7 z" /><g
             id="g9"><path
               style="fill:#ff9800"
               inkscape:connector-curvature="0"
               id="path11"
               d="m 293.1,177.9 c -0.4,-4.5 -0.5,-6.7 -5.1,-12.3 -4.6,-5.6 -10.7,-10.7 -9.9,-22.9 1.3,-19.3 24.2,-18.5 24.2,-18.5 0,0 23,0.8 24.2,20.3 0.8,12.2 -5.4,16.9 -9.9,22.1 -4.6,5.3 -4.7,7.5 -5.1,12 l -18.4,-0.7 z" /></g><g
             id="g13"><polygon
               style="fill:#ff9800"
               id="polygon15"
               points="304.4,164 308.9,154.4 302.6,154.2 296.4,154 300.8,163.8 300.8,178.1 298.6,178 298.6,164.3 292.9,151.6 302.6,152 312.3,152.3 306.6,164.5 306.6,178.3 304.4,178.2 " /></g><path
             style="fill:#ff9800"
             inkscape:connector-curvature="0"
             id="path17"
             d="m 311.4,184.1 -18.5,-0.7 c -0.9,0 -1.6,-0.8 -1.6,-1.7 0,-0.9 0.7,-1.6 1.6,-1.6 l 18.5,0.7 c 0.9,0 1.6,0.8 1.6,1.7 0.1,0.9 -0.7,1.7 -1.6,1.6 z" /><path
             style="fill:#ff9800"
             inkscape:connector-curvature="0"
             id="path19"
             d="m 309.3,189.4 -14.1,-0.5 c -0.9,0 -1.6,-0.8 -1.6,-1.7 0,-0.9 0.7,-1.6 1.6,-1.6 l 14.1,0.5 c 0.9,0 1.6,0.8 1.6,1.7 0,1 -0.7,1.7 -1.6,1.6 z" /></g><polygon
           style="fill:#ff9800"
           id="polygon21"
           points="303.7,117.8 299.5,117.5 299.8,105.5 304,105.8 " /><polygon
           style="fill:#ff9800"
           id="polygon23"
           points="284.5,122.6 277.8,112.5 281.3,110.1 288,120.2 " /><polygon
           style="fill:#ff9800"
           id="polygon25"
           points="317.7,121.3 314.1,119 319.9,108.8 323.6,111.1 " /></g><path
         style="fill:#039be5"
         inkscape:connector-curvature="0"
         id="path27"
         d="m 111.076,83.340337 c -33.309527,0 -58.507408,25.025303 -55.918589,55.746013 l 19.157293,224.53731 c 2.588829,30.72071 32.101416,55.91859 65.410946,56.09118 l 541.23676,1.20812 c 33.30953,0 58.50742,-25.0253 55.91859,-55.74601 L 717.72371,140.63964 C 715.13488,109.91893 685.62229,84.721047 652.31276,84.548457 L 111.076,83.340337 Z" /><polygon
         style="fill:#ffffff"
         transform="matrix(1.7258825,0,0,1.7258825,-341.79557,-173.1258)"
         id="polygon29"
         points="572.1,329.7 558.1,163.9 278.6,163.1 292.7,328.9 " /><path
         style="fill:#039be5"
         inkscape:connector-curvature="0"
         id="path31"
         d="m 254.49684,434.38485 c 3.27918,34.34505 -21.9187,62.30436 -56.26377,62.47695 -34.34506,0.17257 -64.7206,-27.44155 -67.82719,-61.61401 -3.27916,-34.34506 21.91872,-62.30436 56.26377,-62.47695 34.17248,-0.17259 64.54801,27.44153 67.82719,61.61401 z" /><path
         style="fill:#ffffff"
         inkscape:connector-curvature="0"
         id="path33"
         d="m 220.66954,434.73002 c 1.5533,15.70553 -10.01011,28.30448 -25.54306,28.47707 -15.53294,0.17258 -29.51259,-12.42636 -30.8933,-28.13189 -1.55329,-15.70554 10.01013,-28.30447 25.54306,-28.47706 15.53295,-0.17259 29.5126,12.42635 30.8933,28.13188 z" /><path
         style="fill:#039be5"
         inkscape:connector-curvature="0"
         id="path35"
         d="m 672.50559,432.1412 c 3.27918,34.34506 -21.91871,62.30436 -56.26377,62.47695 -34.34506,0.17259 -64.72059,-27.44153 -67.82718,-61.61401 -3.27918,-34.34506 21.9187,-62.30436 56.26377,-62.47695 34.17247,-0.34517 64.548,27.26895 67.82718,61.61401 z" /><path
         style="fill:#ffffff"
         inkscape:connector-curvature="0"
         id="path37"
         d="m 638.67829,432.31379 c 1.5533,15.70552 -10.01012,28.30447 -25.54306,28.47706 -15.53295,0.17259 -29.51259,-12.42636 -30.8933,-28.13189 -1.55329,-15.70553 10.01012,-28.47706 25.54306,-28.47706 15.53294,0 29.5126,12.59894 30.8933,28.13189 z" /><path
         style="fill:#ffffff"
         inkscape:connector-curvature="0"
         id="path39"
         d="m 654.21123,244.02 c -1.55329,-15.70553 10.01012,-28.30447 25.54306,-28.47706 15.53295,-0.17259 29.51259,12.42636 30.8933,28.13188 1.55329,15.70554 -10.01011,28.30448 -25.54306,28.47706 -15.53294,0 -29.34,-12.42634 -30.8933,-28.13188 z" /><path
         style="fill:#ff9800"
         inkscape:connector-curvature="0"
         id="path41"
         d="m 408.96333,310.1213 c 0,11.39083 -9.31977,20.71059 -20.7106,20.71059 l -22.43647,0 c -11.39082,0 -20.71059,-9.31976 -20.71059,-20.71059 l 0,-119.08589 c 0,-11.39083 9.31977,-20.71059 20.71059,-20.71059 l 22.43647,0 c 11.39083,0 20.7106,9.31976 20.7106,20.71059 l 0,119.08589 z" /><path
         style="fill:#ff9800"
         inkscape:connector-curvature="0"
         id="path43"
         d="m 436.57745,218.64953 c 11.39082,0 20.71059,9.31977 20.71059,20.71059 l 0,22.43648 c 0,11.39081 -9.31977,20.71058 -20.71059,20.71058 l -119.0859,0 c -11.39082,0 -20.71058,-9.31977 -20.71058,-20.71058 l 0,-22.43648 c 0,-11.39082 9.31976,-20.71059 20.71058,-20.71059 l 119.0859,0 z" /><path
         style="fill:#ebeae8"
         inkscape:connector-curvature="0"
         id="path45"
         d="m 98.131886,216.75106 c -0.34518,-4.83248 3.106584,-8.62942 7.939054,-8.62942 l 0,0 c 4.83248,0 8.97459,3.79694 9.31977,8.62942 l 7.24871,82.84236 c 0.34518,4.83247 -3.10659,8.62941 -7.93906,8.62941 l 0,0 c -4.83247,0 -8.97459,-3.79694 -9.31977,-8.62941 l -7.248704,-82.84236 z" /><path
         style="fill:#039be5"
         inkscape:connector-curvature="0"
         id="path47"
         d="m 877.19524,261.7966 c 0,-2.93401 -2.2436,-5.17765 -5.1776,-5.17765 l -104.7611,0 c -2.934,0 -5.17764,2.24364 -5.17764,5.17765 l 0,0 c 0,2.93399 2.24364,5.17764 5.17764,5.17764 l 104.7611,0 c 2.934,0 5.1776,-2.24365 5.1776,-5.17764 l 0,0 z" /><path
         style="fill:#039be5"
         inkscape:connector-curvature="0"
         id="path49"
         d="m 831.28678,288.2026 c 0,-2.934 -1.38071,-5.17765 -2.934,-5.17765 l -59.19777,0 c -1.5533,0 -2.934,2.24365 -2.934,5.17765 l 0,0 c 0,2.934 1.3807,5.17765 2.934,5.17765 l 59.19777,0 c 1.55329,0 2.934,-2.24365 2.934,-5.17765 l 0,0 z" /><path
         style="fill:#039be5"
         inkscape:connector-curvature="0"
         id="path51"
         d="m 822.65737,232.97436 c 0,-2.934 -1.3807,-5.17765 -2.934,-5.17765 l -59.19777,0 c -1.55329,0 -2.934,2.24365 -2.934,5.17765 l 0,0 c 0,2.93399 1.38071,5.17764 2.934,5.17764 l 59.19777,0 c 1.5533,0 2.934,-2.24365 2.934,-5.17764 l 0,0 z" /></g></g></svg>