<?xml version="1.0" encoding="UTF-8" standalone="no"?>
<!-- Created with Inkscape (http://www.inkscape.org/) -->

<svg
   xmlns:dc="http://purl.org/dc/elements/1.1/"
   xmlns:cc="http://creativecommons.org/ns#"
   xmlns:rdf="http://www.w3.org/1999/02/22-rdf-syntax-ns#"
   xmlns:svg="http://www.w3.org/2000/svg"
   xmlns="http://www.w3.org/2000/svg"
   xmlns:sodipodi="http://sodipodi.sourceforge.net/DTD/sodipodi-0.dtd"
   xmlns:inkscape="http://www.inkscape.org/namespaces/inkscape"
   id="svg2"
   version="1.1"
   inkscape:version="0.91 r13725"
   xml:space="preserve"
   width="1000"
   height="1000"
   viewBox="0 0 1000 1000"
   sodipodi:docname="business1001.svg"><metadata
     id="metadata8"><rdf:RDF><cc:Work
         rdf:about=""><dc:format>image/svg+xml</dc:format><dc:type
           rdf:resource="http://purl.org/dc/dcmitype/StillImage" /><dc:title></dc:title></cc:Work></rdf:RDF></metadata><defs
     id="defs6"><clipPath
       clipPathUnits="userSpaceOnUse"
       id="clipPath20"><path
         d="M 0,800 800,800 800,0 0,0 0,800 Z"
         id="path22"
         inkscape:connector-curvature="0" /></clipPath><clipPath
       clipPathUnits="userSpaceOnUse"
       id="clipPath36"><path
         d="m 421.553,634.441 c 0,0 -53.614,17.219 -92.167,-29.366 l 0,0 c 0,0 58.652,24.725 94.096,-21.112 l 0,0 c 14.909,-64.146 76.226,-112.211 149.616,-112.211 l 0,0 c 84.548,0 153.088,63.785 153.088,142.467 l 0,0 c 0,78.684 -68.54,142.469 -153.088,142.469 l 0,0 c -77.17,0 -140.993,-53.144 -151.545,-122.247"
         id="path38"
         inkscape:connector-curvature="0" /></clipPath><clipPath
       clipPathUnits="userSpaceOnUse"
       id="clipPath160"><path
         d="m 585.104,658.392 c -0.809,-4.183 -2.941,-10.691 3.021,-13.067 l 0,0 c 5.961,-2.375 16.87,-5.226 19.623,2.071 l 0,0 c 2.754,7.297 2.3,8.302 0.111,9.128 l 0,0 c -2.189,0.826 -13.481,4.011 -13.481,4.011 l 0,0 c -2.284,0.455 -4.203,0.906 -5.704,0.906 l 0,0 c -1.891,0 -3.118,-0.717 -3.57,-3.049"
         id="path162"
         inkscape:connector-curvature="0" /></clipPath><linearGradient
       x1="0"
       y1="0"
       x2="1"
       y2="0"
       gradientUnits="userSpaceOnUse"
       gradientTransform="matrix(7.9690537,-32.938755,-32.938755,-7.9690537,591.72375,673.82123)"
       spreadMethod="pad"
       id="linearGradient172"><stop
         style="stop-opacity:1;stop-color:#ffffff"
         offset="0"
         id="stop174" /><stop
         style="stop-opacity:0;stop-color:#ffffff"
         offset="1"
         id="stop176" /></linearGradient><mask
       maskUnits="userSpaceOnUse"
       x="0"
       y="0"
       width="1"
       height="1"
       id="mask178"><g
         id="g180"><g
           id="g182"><g
             id="g184"><g
               id="g186"><path
                 d="m -32768,32767 65535,0 0,-65535 -65535,0 0,65535 z"
                 style="fill:url(#linearGradient172);stroke:none"
                 id="path188"
                 inkscape:connector-curvature="0" /></g></g></g></g></mask><linearGradient
       x1="0"
       y1="0"
       x2="1"
       y2="0"
       gradientUnits="userSpaceOnUse"
       gradientTransform="matrix(7.9690537,-32.938755,-32.938755,-7.9690537,591.72375,673.82123)"
       spreadMethod="pad"
       id="linearGradient194"><stop
         style="stop-opacity:1;stop-color:#ffffff"
         offset="0"
         id="stop196" /><stop
         style="stop-opacity:1;stop-color:#ffffff"
         offset="1"
         id="stop198" /></linearGradient><clipPath
       clipPathUnits="userSpaceOnUse"
       id="clipPath206"><path
         d="m 552.322,666.827 c -0.718,-3.714 -2.612,-9.493 2.682,-11.602 l 0,0 c 5.293,-2.109 11.028,-3.365 13.473,3.114 l 0,0 c 2.445,6.479 2.042,7.371 0.098,8.105 l 0,0 c -1.944,0.734 -8.019,2.287 -8.019,2.287 l 0,0 c -2.027,0.403 -3.732,0.804 -5.065,0.804 l 0,0 c -1.679,0 -2.769,-0.637 -3.169,-2.708"
         id="path208"
         inkscape:connector-curvature="0" /></clipPath><linearGradient
       x1="0"
       y1="0"
       x2="1"
       y2="0"
       gradientUnits="userSpaceOnUse"
       gradientTransform="matrix(5.0459986,-16.997049,-16.997049,-5.0459986,557.57477,673.06036)"
       spreadMethod="pad"
       id="linearGradient218"><stop
         style="stop-opacity:1;stop-color:#ffffff"
         offset="0"
         id="stop220" /><stop
         style="stop-opacity:0;stop-color:#ffffff"
         offset="1"
         id="stop222" /></linearGradient><mask
       maskUnits="userSpaceOnUse"
       x="0"
       y="0"
       width="1"
       height="1"
       id="mask224"><g
         id="g226"><g
           id="g228"><g
             id="g230"><g
               id="g232"><path
                 d="m -32768,32767 65535,0 0,-65535 -65535,0 0,65535 z"
                 style="fill:url(#linearGradient218);stroke:none"
                 id="path234"
                 inkscape:connector-curvature="0" /></g></g></g></g></mask><linearGradient
       x1="0"
       y1="0"
       x2="1"
       y2="0"
       gradientUnits="userSpaceOnUse"
       gradientTransform="matrix(5.0459986,-16.997049,-16.997049,-5.0459986,557.57477,673.06036)"
       spreadMethod="pad"
       id="linearGradient240"><stop
         style="stop-opacity:1;stop-color:#ffffff"
         offset="0"
         id="stop242" /><stop
         style="stop-opacity:1;stop-color:#ffffff"
         offset="1"
         id="stop244" /></linearGradient><clipPath
       clipPathUnits="userSpaceOnUse"
       id="clipPath252"><path
         d="m 421.553,634.441 c 0,0 -53.614,17.219 -92.167,-29.366 l 0,0 c 0,0 58.652,24.725 94.096,-21.112 l 0,0 c 14.909,-64.146 76.226,-112.211 149.616,-112.211 l 0,0 c 84.548,0 153.088,63.785 153.088,142.467 l 0,0 c 0,78.684 -68.54,142.469 -153.088,142.469 l 0,0 c -77.17,0 -140.993,-53.144 -151.545,-122.247"
         id="path254"
         inkscape:connector-curvature="0" /></clipPath><clipPath
       clipPathUnits="userSpaceOnUse"
       id="clipPath264"><path
         d="M 0,800 800,800 800,0 0,0 0,800 Z"
         id="path266"
         inkscape:connector-curvature="0" /></clipPath></defs><sodipodi:namedview
     pagecolor="#ffffff"
     bordercolor="#666666"
     borderopacity="1"
     objecttolerance="10"
     gridtolerance="10"
     guidetolerance="10"
     inkscape:pageopacity="0"
     inkscape:pageshadow="2"
     inkscape:window-width="1366"
     inkscape:window-height="703"
     id="namedview4"
     showgrid="false"
     inkscape:zoom="0.472"
     inkscape:cx="215.75241"
     inkscape:cy="548.37418"
     inkscape:window-x="0"
     inkscape:window-y="0"
     inkscape:window-maximized="1"
     inkscape:current-layer="g10" /><g
     id="g10"
     inkscape:groupmode="layer"
     inkscape:label="business2"
     transform="matrix(1.25,0,0,-1.25,0,1000)"><g
       id="g24"
       transform="translate(684.5542,139.2366)"><path
         d="m 0,0 c 0,-12.951 -47.394,-23.45 -105.858,-23.45 -58.463,0 -105.858,10.499 -105.858,23.45 0,12.951 47.395,23.45 105.858,23.45 C -47.394,23.45 0,12.951 0,0"
         style="fill:#3e888c;fill-opacity:1;fill-rule:nonzero;stroke:none"
         id="path26"
         inkscape:connector-curvature="0" /></g><path
       inkscape:connector-curvature="0"
       id="path30"
       style="fill:#828282;fill-opacity:1;fill-rule:nonzero;stroke:none"
       d="m 573.0982,756.6875 c -77.17,0 -140.993,-53.143 -151.545,-122.247 -10e-4,0 -53.614,17.22 -92.167,-29.365 0,0 58.651,24.725 94.096,-21.112 l 0,0 c 14.909,-64.147 76.226,-112.211 149.616,-112.211 84.548,0 153.087,63.784 153.087,142.467 0,78.683 -68.539,142.468 -153.087,142.468" /><g
       clip-path="url(#clipPath36)"
       id="g34"><g
         transform="translate(564.6937,572.8329)"
         id="g40"><path
           inkscape:connector-curvature="0"
           id="path42"
           style="fill:#414b54;fill-opacity:1;fill-rule:nonzero;stroke:none"
           d="m 0,0 c 0,0 -30.671,-13.814 -43.646,-18.502 -14.702,-5.313 -40.73,-3.19 -43.086,5.576 -4.504,16.764 42.378,55.716 44.503,58.163 2.125,2.447 -11.879,19.765 -13.296,23.1 0,0 -68.874,-64.898 -55.645,-95.51 5.572,-12.894 56.687,-23.578 87.713,-2.373 C 7.569,-8.341 0,0 0,0" /></g><g
         transform="translate(523.7999,678.6265)"
         id="g44"><path
           inkscape:connector-curvature="0"
           id="path46"
           style="fill:#8ea5a8;fill-opacity:1;fill-rule:nonzero;stroke:none"
           d="M 0,0 C 0,0 -9.417,-2.852 -11.751,-6.198 -14.086,-9.544 -3.712,-71.702 0,-74.359 c 3.712,-2.656 24.999,4.016 24.999,4.016 0,0 -7.726,72.98 -24.999,70.343" /></g><g
         transform="translate(538.687,681.4551)"
         id="g48"><path
           inkscape:connector-curvature="0"
           id="path50"
           style="fill:#e1f8ff;fill-opacity:1;fill-rule:nonzero;stroke:none"
           d="m 0,0 c -12.326,-1.481 -21.004,-3.075 -20.472,-9.45 0.531,-6.375 7.969,-67.737 12.485,-67.737 4.515,0 34.001,8.238 35.86,9.166 1.86,0.928 -6.621,65.278 -9.406,67.337 C 14.304,2.393 11.962,1.437 0,0" /></g><g
         transform="translate(539.3564,677.5807)"
         id="g52"><path
           inkscape:connector-curvature="0"
           id="path54"
           style="fill:#97c2d1;fill-opacity:1;fill-rule:nonzero;stroke:none"
           d="m 0,0 c -10.167,-1.222 -17.324,-2.536 -16.885,-7.794 0.438,-5.259 6.572,-55.87 10.297,-55.87 3.725,0 28.044,6.795 29.578,7.56 1.534,0.766 -5.461,53.841 -7.758,55.54 C 11.798,1.974 9.867,1.186 0,0" /></g><g
         transform="translate(550.4451,613.4341)"
         id="g56"><path
           inkscape:connector-curvature="0"
           id="path58"
           style="fill:#a6d6e2;fill-opacity:1;fill-rule:nonzero;stroke:none"
           d="m 0,0 c 0,-1.476 -1.197,-2.673 -2.673,-2.673 -1.476,0 -2.673,1.197 -2.673,2.673 0,1.476 1.197,2.673 2.673,2.673 C -1.197,2.673 0,1.476 0,0" /></g><g
         transform="translate(539.5389,675.7695)"
         id="g60"><path
           inkscape:connector-curvature="0"
           id="path62"
           style="fill:#a6d6e2;fill-opacity:1;fill-rule:nonzero;stroke:none"
           d="m 0,0 c -9.578,-1.151 -16.32,-2.389 -15.908,-7.343 0.413,-4.954 6.193,-52.634 9.701,-52.634 3.509,0 26.421,6.402 27.865,7.123 1.445,0.721 -5.145,50.723 -7.309,52.322 C 11.115,1.86 9.295,1.117 0,0" /></g><g
         transform="translate(510.623,648.1236)"
         id="g64"><path
           inkscape:connector-curvature="0"
           id="path66"
           style="fill:#ffdcb8;fill-opacity:1;fill-rule:nonzero;stroke:none"
           d="m 0,0 c 0,0 5.181,4.036 11.368,4.941 6.186,0.905 15.315,-1.392 9.608,-5.49 -6.247,-4.485 -13.093,-6.18 -13.093,-6.18 0,0 12.431,1.655 16.56,0.213 4.128,-1.442 6.453,-5.387 -0.673,-7.407 -7.127,-2.02 -15.493,-4.778 -15.493,-4.778 0,0 11.781,-0.753 16.279,-4.095 4.497,-3.343 -6.485,-6.732 -12.773,-7.069 -6.288,-0.338 -18.958,5.45 -8.03,10.345 0,0 -10.024,5.228 -3.248,10.911 0,0 -8.436,0.578 -0.505,8.609" /></g><g
         transform="translate(561.8521,564.9539)"
         id="g68"><path
           inkscape:connector-curvature="0"
           id="path70"
           style="fill:#4f2508;fill-opacity:1;fill-rule:nonzero;stroke:none"
           d="m 0,0 c 0,0 -2.908,33.94 -8.22,50.44 -5.312,16.5 -12.625,44.457 -4.833,69.273 7.792,24.816 43.97,45.335 74.873,39.314 30.902,-6.021 51.799,-27.98 46.84,-63.044 C 103.702,60.919 86.053,-5.565 64.388,-24.504 42.722,-43.442 0,0 0,0" /></g><g
         transform="translate(583.3888,574.0023)"
         id="g72"><path
           inkscape:connector-curvature="0"
           id="path74"
           style="fill:#414b54;fill-opacity:1;fill-rule:nonzero;stroke:none"
           d="m 0,0 c 0,0 -12.947,-1.082 -18.695,-1.169 -5.748,-0.087 -20.624,-17.218 -31.604,-32.383 -10.979,-15.164 -2.744,-28.888 -2.39,-32.784 0.354,-3.896 -20.631,-44.362 -24.527,-52.862 0,0 4.958,-11.557 7.083,-11.8 2.125,-0.242 3.896,1.883 3.896,1.883 0,0 3.188,-8.484 7.792,-8.315 4.605,0.168 57.481,-0.186 64.914,3.002 -0.005,2.125 -0.841,38.251 5.728,48.168 6.57,9.917 34.962,47.44 38.652,61.795 3.69,14.354 -21.515,18.781 -27.507,20.464 C 17.35,-2.319 0,0 0,0" /></g><g
         transform="translate(606.7238,564.8411)"
         id="g76"><path
           inkscape:connector-curvature="0"
           id="path78"
           style="fill:#a1acaf;fill-opacity:1;fill-rule:nonzero;stroke:none"
           d="m 0,0 c -0.479,-2.238 -11.741,-21.404 -23.335,-32.826 -11.594,-11.422 -43.923,-22.845 -43.923,-22.845 0,0 0,4.782 2.39,12.485 2.391,7.704 19.126,34.533 23.908,39.58 4.781,5.047 17.625,10.495 17.625,10.495 0,0 23.814,-4.651 23.335,-6.889" /></g><g
         transform="translate(579.0451,571.7302)"
         id="g80"><path
           inkscape:connector-curvature="0"
           id="path82"
           style="fill:#515d66;fill-opacity:1;fill-rule:nonzero;stroke:none"
           d="m 0,0 c 0,0 -11.541,0.932 -17.193,0 0,0 -0.981,-4.684 0,-9.433 0,0 -12.049,-1.328 -13.764,-2.39 0,0 -12.607,-33.736 -8.623,-50.737 0,0 0.428,7.033 8.623,22.845 8.194,15.812 22.363,32.433 28.832,36.074 C 4.344,0 0,0 0,0" /></g><g
         transform="translate(580.7272,563.9508)"
         id="g84"><path
           inkscape:connector-curvature="0"
           id="path86"
           style="fill:#b9c4c6;fill-opacity:1;fill-rule:nonzero;stroke:none"
           d="M 0,0 C -1.688,-1.006 -3.807,12.321 -3.807,12.321 -2.745,12.747 7.771,15.613 7.771,15.613 12.973,-1.388 1.688,1.006 0,0" /></g><g
         transform="translate(586.2173,590.6348)"
         id="g88"><path
           inkscape:connector-curvature="0"
           id="path90"
           style="fill:#ffdcb8;fill-opacity:1;fill-rule:nonzero;stroke:none"
           d="m 0,0 c 0,0 2.125,-18.528 0,-23.521 0,0 -14.521,-7.823 -18.063,-12.783 -3.542,-4.961 -6.302,-16.114 -6.302,-16.114 0,0 8.426,6.903 18.875,12.57 10.448,5.667 18.24,12.75 20.719,14.875 2.48,2.126 10.272,34.221 13.46,42.257 C 31.876,25.321 1.984,5.144 0,0" /></g><g
         transform="translate(609.3275,566.5477)"
         id="g92"><path
           inkscape:connector-curvature="0"
           id="path94"
           style="fill:#b9c4c6;fill-opacity:1;fill-rule:nonzero;stroke:none"
           d="m 0,0 c 0,0 1.594,7.172 1.859,9.032 0.266,1.859 -14.078,-0.498 -17.531,-1.577 0,0 1.593,-14.096 3.718,-14.096 C -9.828,-6.641 0,0 0,0" /></g><g
         transform="translate(607.8223,570.001)"
         id="g96"><path
           inkscape:connector-curvature="0"
           id="path98"
           style="fill:#515d66;fill-opacity:1;fill-rule:nonzero;stroke:none"
           d="m 0,0 c 0,0 6.021,-1.849 8.943,-6.104 2.922,-4.256 6.907,-10.631 6.907,-10.631 0,0 -19.919,-4.516 -21.249,-3.985 0,0 8.505,-11.422 8.767,-13.016 0.262,-1.593 -31.879,-36.126 -71.725,-27.094 0,0 35.595,17.266 42.103,24.172 C -19.746,-29.751 -4.693,-10.891 0,0" /></g><g
         transform="translate(538.687,507.6667)"
         id="g100"><path
           inkscape:connector-curvature="0"
           id="path102"
           style="fill:#1b2328;fill-opacity:1;fill-rule:nonzero;stroke:none"
           d="m 0,0 c 0,0 -0.992,-6.111 -2.409,-11.07 -1.417,-4.958 -9.917,-21.959 -9.917,-21.959 L 0,0 Z" /></g><g
         transform="translate(561.0832,537.7465)"
         id="g104"><path
           inkscape:connector-curvature="0"
           id="path106"
           style="fill:#758a8e;fill-opacity:1;fill-rule:nonzero;stroke:none"
           d="M 0,0 C 0,0 -4.972,-2.637 -7.451,-6.487 -9.93,-10.336 -14.116,-21.673 -15.564,-24.151 -17.013,-26.628 -6.599,-4.851 0,0" /></g><g
         transform="translate(620.3199,566.1104)"
         id="g108"><path
           inkscape:connector-curvature="0"
           id="path110"
           style="fill:#414b54;fill-opacity:1;fill-rule:nonzero;stroke:none"
           d="m 0,0 c 0.868,-0.336 13.003,-3.459 16.899,-6.203 3.896,-2.745 21.251,-71.102 26.21,-87.749 4.958,-16.646 -17.626,-23.376 -28.824,-1.771 C 3.086,-74.118 0.81,-61.447 0,-54.678 -0.81,-47.908 0,0 0,0" /></g><g
         transform="translate(626.2396,540.4504)"
         id="g112"><path
           inkscape:connector-curvature="0"
           id="path114"
           style="fill:#ffdcb8;fill-opacity:1;fill-rule:nonzero;stroke:none"
           d="m 0,0 c -2.377,4.546 -6.711,11.89 -8.742,11.458 -2.03,-0.433 -2.503,-15.982 0,-23.789 2.504,-7.807 11.061,-16.887 14.409,-18.949 6.906,-4.254 37.277,14.515 42.236,16.403 4.958,1.888 5.224,11.283 -17.443,4.966 0,0 21.959,15.977 20.365,18.998 -1.594,3.02 -17.619,1.119 -28.909,-9.087 0,0 12.085,18.482 9.252,21.67 C 28.334,24.858 17.001,12.107 10.98,4.669 4.959,-2.768 2.167,-4.145 0,0" /></g><g
         transform="translate(556.4661,677.5833)"
         id="g116"><path
           inkscape:connector-curvature="0"
           id="path118"
           style="fill:#ffdcb8;fill-opacity:1;fill-rule:nonzero;stroke:none"
           d="m 0,0 c 0,0 30.814,12.396 37.189,22.667 0,0 3.896,-49.939 36.48,-65.877 0,0 -21.959,-59.856 -60.21,-47.46 C -24.793,-78.274 -8.854,-15.938 0,0" /></g><g
         transform="translate(595.4017,651.8495)"
         id="g120"><path
           inkscape:connector-curvature="0"
           id="path122"
           style="fill:#190f08;fill-opacity:1;fill-rule:nonzero;stroke:none"
           d="m 0,0 c -0.872,-2.925 -3.12,-4.836 -5.021,-4.269 -1.901,0.566 -2.735,3.397 -1.863,6.322 0.872,2.924 3.12,4.836 5.021,4.269 C 0.038,5.755 0.872,2.925 0,0" /></g><g
         transform="translate(563.883,660.8008)"
         id="g124"><path
           inkscape:connector-curvature="0"
           id="path126"
           style="fill:#190f08;fill-opacity:1;fill-rule:nonzero;stroke:none"
           d="m 0,0 c -0.812,-2.722 -2.904,-4.501 -4.673,-3.973 -1.769,0.527 -2.546,3.161 -1.734,5.883 0.811,2.722 2.904,4.501 4.673,3.974 C 0.035,5.356 0.812,2.722 0,0" /></g><g
         transform="translate(591.7065,681.8334)"
         id="g128"><path
           inkscape:connector-curvature="0"
           id="path130"
           style="fill:#381802;fill-opacity:1;fill-rule:nonzero;stroke:none"
           d="M 0,0 C 0,0 15.496,-0.266 19.48,-9.828 19.48,-9.828 14.255,5.047 0,0" /></g><g
         transform="translate(577.717,682.8783)"
         id="g132"><path
           inkscape:connector-curvature="0"
           id="path134"
           style="fill:#381802;fill-opacity:1;fill-rule:nonzero;stroke:none"
           d="m 0,0 c 0,0 -7.823,7.19 -15.865,4.268 0,0 10.552,6.871 15.865,-4.268" /></g><g
         transform="translate(572.5598,656.2466)"
         id="g136"><path
           inkscape:connector-curvature="0"
           id="path138"
           style="fill:#cb8f5e;fill-opacity:1;fill-rule:nonzero;stroke:none"
           d="m 0,0 c 0,0 -5.313,-9.032 -8.5,-8.766 -3.188,0.266 -9.653,3.973 -11.6,-0.006 -1.948,-3.978 1.771,-6.9 4.959,-8.76 0,0 -11.423,3.188 -7.969,10.36 3.453,7.172 11.688,0.266 13.547,0.266 C -7.703,-6.906 0,0 0,0" /></g><g
         transform="translate(572.9829,597.386)"
         id="g140"><path
           inkscape:connector-curvature="0"
           id="path142"
           style="fill:#eda69d;fill-opacity:1;fill-rule:nonzero;stroke:none"
           d="M 0,0 C 10.877,-2.759 20.787,7.706 27.233,17.075 19.02,16.493 2.829,13.596 0,0" /></g><g
         transform="translate(553.6327,632.2482)"
         id="g144"><path
           inkscape:connector-curvature="0"
           id="path146"
           style="fill:#753427;fill-opacity:1;fill-rule:nonzero;stroke:none"
           d="m 0,0 c 0,0 -0.354,-29.043 18.772,-34.71 0.193,-0.057 0.385,-0.103 0.578,-0.152 2.829,13.596 19.021,16.492 27.233,17.075 4.739,6.889 7.607,13.183 7.607,13.183 C 49.231,-3.896 0,0 0,0" /></g><g
         transform="translate(607.7488,647.396)"
         id="g148"><path
           inkscape:connector-curvature="0"
           id="path150"
           style="fill:#161616;fill-opacity:1;fill-rule:nonzero;stroke:none"
           d="m 0,0 c -2.754,-7.297 -13.662,-4.446 -19.624,-2.071 -5.961,2.376 -3.829,8.884 -3.02,13.067 0.809,4.183 4.114,3.17 9.273,2.143 0,0 11.292,-3.185 13.481,-4.011 C 2.299,8.302 2.754,7.297 0,0 m -39.272,10.943 c -2.445,-6.479 -8.18,-5.223 -13.473,-3.114 -5.294,2.109 -3.401,7.888 -2.682,11.602 0.719,3.715 3.653,2.815 8.234,1.903 0,0 6.076,-1.552 8.019,-2.286 1.944,-0.733 2.347,-1.626 -0.098,-8.105 m 42.71,-0.629 c -2.852,1.076 -17.56,5.225 -17.56,5.225 -5.289,1.052 -9.073,2.079 -10.962,-0.182 -1.555,0.953 -4.568,2.353 -8.937,2.412 0.062,1.826 -0.758,2.445 -2.199,2.989 -2.689,1.015 -11.091,3.162 -11.091,3.162 -6.336,1.261 -10.394,2.505 -11.388,-2.632 -0.994,-5.137 -3.612,-13.129 3.709,-16.046 7.321,-2.917 15.252,-4.654 18.634,4.307 0.508,1.346 0.917,2.5 1.254,3.523 10e-4,-10e-4 0.002,-0.002 0.003,-0.003 0,0 5.29,1.395 8.467,-2.397 l 0,0 c -1.136,-5.328 -2.469,-12.221 4.366,-14.944 7.764,-3.094 21.973,-6.808 25.56,2.697 3.587,9.504 2.995,10.813 0.144,11.889" /></g><g
         transform="translate(613.3785,653.2603)"
         id="g152"><path
           inkscape:connector-curvature="0"
           id="path154"
           style="fill:#161616;fill-opacity:1;fill-rule:nonzero;stroke:none"
           d="m 0,0 c 0,0 20.948,-14.954 23.309,-15.766 2.362,-0.813 0,-3.054 0,-3.054 L -2.192,-4.1 0,0 Z" /></g></g><g
       id="g156"><g
         id="g158"
         clip-path="url(#clipPath160)"><g
           id="g164"><g
             id="g166" /><g
             id="g190"
             mask="url(#mask178)"><g
               id="g192"><path
                 d="m 585.104,658.392 c -0.809,-4.183 -2.941,-10.691 3.021,-13.067 l 0,0 c 5.961,-2.375 16.87,-5.226 19.623,2.071 l 0,0 c 2.754,7.297 2.3,8.302 0.111,9.128 l 0,0 c -2.189,0.826 -13.481,4.011 -13.481,4.011 l 0,0 c -2.284,0.455 -4.203,0.906 -5.704,0.906 l 0,0 c -1.891,0 -3.118,-0.717 -3.57,-3.049"
                 style="fill:url(#linearGradient194);stroke:none"
                 id="path200"
                 inkscape:connector-curvature="0" /></g></g></g></g></g><g
       id="g202"><g
         id="g204"
         clip-path="url(#clipPath206)"><g
           id="g210"><g
             id="g212" /><g
             id="g236"
             mask="url(#mask224)"><g
               id="g238"><path
                 d="m 552.322,666.827 c -0.718,-3.714 -2.612,-9.493 2.682,-11.602 l 0,0 c 5.293,-2.109 11.028,-3.365 13.473,3.114 l 0,0 c 2.445,6.479 2.042,7.371 0.098,8.105 l 0,0 c -1.944,0.734 -8.019,2.287 -8.019,2.287 l 0,0 c -2.027,0.403 -3.732,0.804 -5.065,0.804 l 0,0 c -1.679,0 -2.769,-0.637 -3.169,-2.708"
                 style="fill:url(#linearGradient240);stroke:none"
                 id="path246"
                 inkscape:connector-curvature="0" /></g></g></g></g></g><g
       id="g248"><g
         id="g250"
         clip-path="url(#clipPath252)"><g
           id="g256"
           transform="translate(622.2568,631.1557)"><path
             d="m 0,0 c 0,0 9.491,10.169 18.305,4.746 8.813,-5.424 7.796,-19.112 1.356,-23.963 C 13.22,-24.067 -8.474,-25.084 0,0"
             style="fill:#ffdcb8;fill-opacity:1;fill-rule:nonzero;stroke:none"
             id="path258"
             inkscape:connector-curvature="0" /></g></g></g><g
       id="g392"
       transform="translate(452.6118,117.6656)"><path
         d="m 0,0 c 0,-22.547 -82.512,-40.825 -184.297,-40.825 -101.784,0 -184.296,18.278 -184.296,40.825 0,22.547 82.512,40.825 184.296,40.825 C -82.512,40.825 0,22.547 0,0"
         style="fill:#36787f;fill-opacity:1;fill-rule:nonzero;stroke:none"
         id="path394"
         inkscape:connector-curvature="0" /></g><g
       id="g396"
       transform="translate(252.4857,510.5493)"><path
         d="m 0,0 c -7.797,4.814 -4.768,14.555 1.338,14.383 6.107,-0.172 77.581,-41.132 83.691,-20.677 6.111,20.455 -36.215,69.29 -36.215,69.29 0,0 2.142,20.414 4.619,25.08 0,0 64.048,-68.547 52.739,-107.206 C 94.863,-57.788 15.508,-9.575 0,0"
         style="fill:#464b4c;fill-opacity:1;fill-rule:nonzero;stroke:none"
         id="path398"
         inkscape:connector-curvature="0" /></g><g
       id="g400"
       transform="translate(259.0823,621.8242)"><path
         d="m 0,0 c 5.503,2.643 20.333,9.656 24.002,11.014 3.669,1.359 8.099,4.041 12.15,-6.058 4.05,-10.098 22.365,-55.959 22.106,-58.611 -0.26,-2.652 0.481,-5.01 -11.156,-9.941 -11.637,-4.931 -20.028,-7.467 -23.02,-8.038 -2.991,-0.571 -5.911,-1.708 -11.621,11.846 C 6.75,-46.233 -2.688,-18.031 -4.192,-14.156 -5.696,-10.281 -6.35,-3.049 0,0"
         style="fill:#848484;fill-opacity:1;fill-rule:nonzero;stroke:none"
         id="path402"
         inkscape:connector-curvature="0" /></g><g
       id="g404"
       transform="translate(253.6111,619.5278)"><path
         d="m 0,0 c 5.503,2.643 24.002,11.014 27.671,12.373 3.669,1.358 7.468,0.043 11.519,-10.056 4.05,-10.099 20.426,-52.634 20.167,-55.286 -0.26,-2.652 -0.618,-5.696 -12.255,-10.627 -11.637,-4.931 -20.028,-7.467 -23.02,-8.038 -2.991,-0.571 -5.911,-1.708 -11.621,11.846 C 6.75,-46.233 -2.688,-18.031 -4.192,-14.156 -5.696,-10.281 -6.35,-3.049 0,0"
         style="fill:#282828;fill-opacity:1;fill-rule:nonzero;stroke:none"
         id="path406"
         inkscape:connector-curvature="0" /></g><g
       id="g408"
       transform="translate(257.4515,617.0792)"><path
         d="m 0,0 c 4.325,2.077 18.867,8.658 21.751,9.726 2.884,1.067 5.941,-0.379 9.125,-8.317 3.184,-7.938 15.976,-41.245 15.772,-43.33 -0.204,-2.085 -0.477,-4.192 -9.624,-8.068 -9.147,-3.876 -15.743,-5.87 -18.094,-6.318 -2.351,-0.449 -4.647,-1.343 -9.136,9.311 C 5.306,-36.341 -2.113,-14.173 -3.295,-11.127 -4.477,-8.081 -4.991,-2.397 0,0"
         style="fill:#80a6b7;fill-opacity:1;fill-rule:nonzero;stroke:none"
         id="path410"
         inkscape:connector-curvature="0" /></g><g
       id="g412"
       transform="translate(258.7075,615.6153)"><path
         d="m 0,0 c 4.062,1.951 17.717,8.13 20.425,9.133 2.709,1.003 4.453,-0.498 7.443,-7.953 2.99,-7.454 15.326,-38.828 15.135,-40.785 -0.192,-1.958 0.355,-3.698 -8.235,-7.338 -8.589,-3.64 -14.784,-5.512 -16.992,-5.933 -2.208,-0.422 -4.363,-1.261 -8.578,8.744 C 4.982,-34.127 -1.984,-13.309 -3.094,-10.449 -4.204,-7.589 -4.687,-2.251 0,0"
         style="fill:#97c2d1;fill-opacity:1;fill-rule:nonzero;stroke:none"
         id="path414"
         inkscape:connector-curvature="0" /></g><g
       id="g416"
       transform="translate(304.6212,604.9125)"><path
         d="m 0,0 c 0,0 -6.173,0.852 -11.683,-1.345 -5.51,-2.196 -11.915,-8.42 -5.281,-9.073 7.261,-0.715 13.688,1.146 13.688,1.146 0,0 -10.995,-4.547 -13.7,-7.693 -2.705,-3.146 -2.739,-7.491 4.073,-5.763 6.812,1.728 14.993,3.439 14.993,3.439 0,0 -9.317,-6.217 -11.422,-11.099 -2.105,-4.882 8.524,-2.446 13.848,0.264 5.324,2.711 12.977,13.484 1.678,12.311 0,0 5.747,9.057 -2.518,10.504 0,0 6.653,4.483 -3.676,7.309"
         style="fill:#ffdcb8;fill-opacity:1;fill-rule:nonzero;stroke:none"
         id="path418"
         inkscape:connector-curvature="0" /></g><g
       id="g420"
       transform="translate(254.0289,592.2736)"><path
         d="m 0,0 c 0,0 -1.209,-3.942 -1.68,-7.206 -0.471,-3.263 5.128,-17.822 9.426,-21.575 4.297,-3.753 8.382,-3.193 8.382,-3.193 L 0,0 Z"
         style="fill:#ffdcb8;fill-opacity:1;fill-rule:nonzero;stroke:none"
         id="path422"
         inkscape:connector-curvature="0" /></g><g
       id="g424"
       transform="translate(301.6196,629.915)"><path
         d="m 0,0 c -1.337,0 -2.443,1.057 -2.497,2.401 -0.003,0.082 -0.277,5.042 -3.866,8.073 -2.491,2.104 -6.101,2.879 -10.725,2.306 -1.377,-0.173 -2.62,0.803 -2.789,2.173 -0.17,1.37 0.802,2.619 2.172,2.789 6.097,0.758 11.016,-0.419 14.622,-3.493 C 2.19,9.75 2.49,2.878 2.5,2.587 2.548,1.208 1.469,0.05 0.089,0.001 0.059,0 0.029,0 0,0"
         style="fill:#ffffff;fill-opacity:1;fill-rule:nonzero;stroke:none"
         id="path426"
         inkscape:connector-curvature="0" /></g><g
       id="g428"
       transform="translate(313.8975,628.8452)"><path
         d="m 0,0 c -1.339,0 -2.447,1.06 -2.497,2.407 -0.006,0.146 -0.547,11.193 -8.651,18.073 -5.589,4.745 -13.537,6.515 -23.617,5.265 -1.376,-0.17 -2.618,0.802 -2.789,2.172 -0.17,1.371 0.803,2.62 2.173,2.79 11.554,1.434 20.812,-0.738 27.515,-6.455 C 1.925,15.901 2.481,3.127 2.5,2.587 2.548,1.208 1.469,0.05 0.089,0.001 0.059,0 0.029,0 0,0"
         style="fill:#ffffff;fill-opacity:1;fill-rule:nonzero;stroke:none"
         id="path430"
         inkscape:connector-curvature="0" /></g><g
       id="g432"
       transform="translate(326.4668,630.4038)"><path
         d="m 0,0 c -1.339,0 -2.448,1.061 -2.497,2.41 -0.009,0.224 -0.776,16.225 -12.559,26.242 -8.119,6.902 -19.611,9.486 -34.146,7.682 -1.373,-0.17 -2.619,0.803 -2.789,2.173 -0.17,1.37 0.803,2.619 2.173,2.789 16.014,1.988 28.813,-0.998 38.046,-8.873 C 1.708,20.926 2.474,3.331 2.5,2.587 2.548,1.208 1.469,0.05 0.089,0.001 0.059,0 0.029,0 0,0"
         style="fill:#ffffff;fill-opacity:1;fill-rule:nonzero;stroke:none"
         id="path434"
         inkscape:connector-curvature="0" /></g><g
       id="g436"
       transform="translate(103.074,330.2371)"><path
         d="M 0,0 C 0,0 7.26,23.289 11.415,23.034 15.57,22.778 51.984,13.341 57.46,8.157 62.935,2.972 55.157,-17.822 55.157,-17.822 l -8.153,2.635 c 0,0 4.621,15.934 2.381,18.829 C 47.146,6.537 15.566,14.569 13.423,13.673 11.279,12.776 6.475,-2.092 6.475,-2.092 L 0,0 Z"
         style="fill:#262626;fill-opacity:1;fill-rule:nonzero;stroke:none"
         id="path438"
         inkscape:connector-curvature="0" /></g><g
       id="g440"
       transform="translate(170.949,222.2638)"><path
         d="m 0,0 c -0.514,-1.589 -2.218,-2.461 -3.808,-1.948 l -109.035,35.23 c -1.59,0.514 -2.462,2.219 -1.948,3.808 l 25.519,78.979 c 0.513,1.589 2.218,2.461 3.807,1.948 L 23.571,82.786 c 1.589,-0.513 2.461,-2.218 1.948,-3.807 L 0,0 Z"
         style="fill:#262626;fill-opacity:1;fill-rule:nonzero;stroke:none"
         id="path442"
         inkscape:connector-curvature="0" /></g><g
       id="g444"
       transform="translate(188.2781,306.7097)"><path
         d="m 0,0 c 1.589,-0.514 2.461,-2.218 1.948,-3.808 l -25.519,-78.978 c -0.513,-1.59 -2.218,-2.462 -3.807,-1.948"
         style="fill:none;stroke:#bcbcbc;stroke-width:1;stroke-linecap:round;stroke-linejoin:miter;stroke-miterlimit:10;stroke-dasharray:none;stroke-opacity:1"
         id="path446"
         inkscape:connector-curvature="0" /></g><g
       id="g448"
       transform="translate(156.4003,226.9646)"><path
         d="m 0,0 c -0.514,-1.589 -2.218,-2.461 -3.808,-1.948 l -109.035,35.23 c -1.59,0.514 -2.462,2.219 -1.948,3.808 l 25.519,78.979 c 0.513,1.589 2.218,2.461 3.807,1.948 L 23.571,82.786 c 1.589,-0.513 2.461,-2.218 1.948,-3.807 L 0,0 Z"
         style="fill:#191919;fill-opacity:1;fill-rule:nonzero;stroke:none"
         id="path450"
         inkscape:connector-curvature="0" /></g><g
       id="g452"
       transform="translate(148.1301,355.1917)"><path
         d="M 0,0 C 0,0 7.586,-5.982 7.933,-9.007 8.28,-12.033 2.9,-16.386 2.9,-16.386 c 0,0 -5.051,-13.994 -8.811,-12.515 -3.759,1.48 -5.382,4.653 -5.382,4.653 0,0 -4.413,-5.46 -6.896,-4.128 -2.483,1.332 -2.852,6.748 -2.852,6.748 0,0 -4.28,-2.59 -7.327,-0.546 -3.048,2.044 4.158,24.347 9.995,30.936 C -12.536,15.351 0,0 0,0"
         style="fill:#ffdcb8;fill-opacity:1;fill-rule:nonzero;stroke:none"
         id="path454"
         inkscape:connector-curvature="0" /></g><g
       id="g456"
       transform="translate(202.3362,513.2102)"><path
         d="m 0,0 c -3.418,6.102 -7.415,10.032 -19.856,-4.075 -12.441,-14.106 -57.254,-73.645 -59.545,-148.248 0,0 12.724,-5.585 22.569,-3.575 0,0 1.649,59.211 21.274,92.123 C -15.934,-30.863 5.427,-9.691 0,0"
         style="fill:#464b4c;fill-opacity:1;fill-rule:nonzero;stroke:none"
         id="path458"
         inkscape:connector-curvature="0" /></g><g
       id="g460"
       transform="translate(289.8571,559.2426)"><path
         d="m 0,0 c 0.861,-1.606 0.257,-3.606 -1.349,-4.467 -1.606,-0.861 -3.606,-0.257 -4.467,1.349 -0.861,1.606 -0.257,3.606 1.349,4.467 C -2.861,2.21 -0.861,1.606 0,0"
         style="fill:#9e9e9e;fill-opacity:1;fill-rule:nonzero;stroke:none"
         id="path462"
         inkscape:connector-curvature="0" /></g><g
       id="g464"
       transform="translate(164.6357,151.3034)"><path
         d="m 0,0 c 0,0 8.756,-23.351 13.883,-25.74 5.126,-2.39 26.318,-3.695 30.874,-5.974 4.556,-2.278 1.581,-21.264 1.581,-21.264 0,0 -46.812,-0.025 -57.913,11.204 0,0 0.477,9.689 -1.565,13.577 0,0 -8.971,-6.648 -10.731,-4.91 -1.759,1.738 -13.896,11.227 -12.933,16.203 0.962,4.976 21.547,26.222 21.547,26.222 0,0 10.4,-3.488 15.257,-9.318"
         style="fill:#382b19;fill-opacity:1;fill-rule:nonzero;stroke:none"
         id="path466"
         inkscape:connector-curvature="0" /></g><g
       id="g468"
       transform="translate(213.44,369.3438)"><path
         d="m 0,0 c 0,0 -5.086,-3.412 -1.735,-30.245 3.283,-26.291 -3.397,-63.206 -8.19,-77.758 -16.057,-48.757 -62.096,-100.366 -62.096,-100.366 0,0 19.878,-20.248 29.14,-17.669 9.261,2.58 50.489,74.194 59.201,98.738 9.75,27.466 21.04,72.162 28.338,82.322 7.298,10.161 34.605,31.221 33.612,52.505 C 77.276,28.811 0,0 0,0"
         style="fill:#464b4c;fill-opacity:1;fill-rule:nonzero;stroke:none"
         id="path470"
         inkscape:connector-curvature="0" /></g><g
       id="g472"
       transform="translate(383.4845,146.2857)"><path
         d="M 0,0 C 0,0 7.462,-5.216 13.29,-2.972 19.118,-0.727 41.366,19.511 44.292,22.18 47.219,24.848 56.516,8.054 57.103,5.373 57.69,2.693 25.904,-27.849 19.434,-27.161 l -11.736,2.867 c 0,0 0.33,-5.938 -6.264,-7.888 -6.595,-1.951 -14.636,-6.914 -18.761,-4.111 -4.125,2.804 -5.664,29.949 -5.664,29.949 L 0,0 Z"
         style="fill:#382b19;fill-opacity:1;fill-rule:nonzero;stroke:none"
         id="path474"
         inkscape:connector-curvature="0" /></g><g
       id="g476"
       transform="translate(285.0354,378.1136)"><path
         d="m 0,0 c 0,0 44.579,-66.886 66.331,-107.93 21.751,-41.043 36.739,-124.266 36.739,-124.266 0,0 -18.794,-9.602 -31.323,-5.784 0,0 -13.521,87.357 -29.426,115.481 -15.905,28.123 -48.762,75.526 -61.917,86.711 C -32.751,-24.604 -21.242,3.436 0,0"
         style="fill:#464b4c;fill-opacity:1;fill-rule:nonzero;stroke:none"
         id="path478"
         inkscape:connector-curvature="0" /></g><g
       id="g480"
       transform="translate(196.6299,518.5753)"><path
         d="m 0,0 c 0,0 47.199,8.711 59.388,5.611 0,0 36.939,-114.973 40.181,-160.896 0,0 -21.887,-6.964 -27.324,-8.034 l -5.596,15.088 -6.821,-14.458 c 0,0 -23.527,-6.88 -55.827,0.143 0,0 2.349,60.365 -2.261,91.929 C -2.87,-39.052 -4.964,-4.795 0,0"
         style="fill:#464b4c;fill-opacity:1;fill-rule:nonzero;stroke:none"
         id="path482"
         inkscape:connector-curvature="0" /></g><g
       id="g484"
       transform="translate(240.5607,544.7759)"><path
         d="m 0,0 c 0,0 -3.731,-28.746 -1.925,-37.922 1.805,-9.177 -11.867,-3.436 -16.109,0.817 -4.242,4.253 -1.583,36.755 -3.124,39.525 C -22.7,5.19 -2.801,3.439 0,0"
         style="fill:#ffdcb8;fill-opacity:1;fill-rule:nonzero;stroke:none"
         id="path486"
         inkscape:connector-curvature="0" /></g><g
       id="g488"
       transform="translate(231.3139,521.6983)"><path
         d="m 0,0 6.351,-14.123 -0.31,13.816 11.831,-5.484 c 0,0 3.535,-10.105 4.52,-22.941 0.985,-12.836 -2.846,-56.045 -2.846,-56.045 0,0 -29.877,60.893 -39.233,75.925 0,0 10.062,11.838 19.687,8.852"
         style="fill:#e5e5e5;fill-opacity:1;fill-rule:nonzero;stroke:none"
         id="path490"
         inkscape:connector-curvature="0" /></g><g
       id="g492"
       transform="translate(231.6691,503.8426)"><path
         d="m 0,0 c 0,0 8.811,1.235 10.472,0.814 0,0 1.826,-11.833 1.6,-12.831 -0.226,-0.998 -4.443,-0.483 -7.828,0.362 L 0,0 Z"
         style="fill:#141414;fill-opacity:1;fill-rule:nonzero;stroke:none"
         id="path494"
         inkscape:connector-curvature="0" /></g><g
       id="g496"
       transform="translate(236.7706,465.2428)"><path
         d="m 0,0 0.112,26.931 6.859,-0.348 c 0,0 8.407,-30.083 8.986,-32.456 L 14.089,-28.321 0,0 Z"
         style="fill:#141414;fill-opacity:1;fill-rule:nonzero;stroke:none"
         id="path498"
         inkscape:connector-curvature="0" /></g><g
       id="g500"
       transform="translate(209.7516,522.7931)"><path
         d="m 0,0 c 0,0 -7.121,-23.196 -8.858,-26.472 -1.737,-3.277 23.917,-11.982 23.917,-11.982 0,0 -12.268,-19.228 -13.445,-22.533 0,0 37.061,-29.471 39.828,-32.64 l -0.334,7.756 c 0,0 -36.33,75.056 -39.057,79.369 C -0.677,-2.189 0,0 0,0"
         style="fill:#676b6b;fill-opacity:1;fill-rule:nonzero;stroke:none"
         id="path502"
         inkscape:connector-curvature="0" /></g><g
       id="g504"
       transform="translate(248.1331,519.8298)"><path
         d="m 0,0 c 0,0 6.414,-37.698 1.943,-98.358 0,0 17.459,46.567 18.198,47.875 0.74,1.309 -8.795,18.951 -11.613,19.768 0,0 5.898,13.458 7.301,14.584 L 0,0 Z"
         style="fill:#676b6b;fill-opacity:1;fill-rule:nonzero;stroke:none"
         id="path506"
         inkscape:connector-curvature="0" /></g><g
       id="g508"
       transform="translate(212.1741,530.7399)"><path
         d="m 0,0 c 0,0 19.107,-8.031 19.14,-9.042 0.033,-1.011 -6.669,-17.499 -6.669,-17.499 0,0 -13.654,9.105 -15.954,10.568 0,0 1.384,14.397 3.483,15.973"
         style="fill:#ffffff;fill-opacity:1;fill-rule:nonzero;stroke:none"
         id="path510"
         inkscape:connector-curvature="0" /></g><g
       id="g512"
       transform="translate(238.7723,529.3895)"><path
         d="m 0,0 -1.418,-7.998 c 0,0 9.168,-10.228 10.319,-10.623 L 11.535,-9.67 0,0 Z"
         style="fill:#ffffff;fill-opacity:1;fill-rule:nonzero;stroke:none"
         id="path514"
         inkscape:connector-curvature="0" /></g><g
       id="g516"
       transform="translate(253.0504,421.3207)"><path
         d="m 0,0 c 0,0 8.366,-34.029 8.716,-47.015 0,0 3.125,30.589 -8.716,47.015"
         style="fill:#232728;fill-opacity:1;fill-rule:nonzero;stroke:none"
         id="path518"
         inkscape:connector-curvature="0" /></g><g
       id="g520"
       transform="translate(250.2331,410.9564)"><path
         d="M 0,0 C 0.261,-2.118 -0.594,-3.967 -1.911,-4.129 -3.228,-4.292 -4.507,-2.706 -4.768,-0.588 -5.03,1.53 -4.174,3.379 -2.857,3.541 -1.54,3.704 -0.261,2.118 0,0"
         style="fill:#232728;fill-opacity:1;fill-rule:nonzero;stroke:none"
         id="path522"
         inkscape:connector-curvature="0" /></g><g
       id="g524"
       transform="translate(255.347,391.3502)"><path
         d="M 0,0 C 0.261,-2.118 -0.594,-3.967 -1.911,-4.129 -3.228,-4.292 -4.507,-2.706 -4.768,-0.588 -5.03,1.53 -4.174,3.379 -2.857,3.541 -1.54,3.704 -0.261,2.118 0,0"
         style="fill:#232728;fill-opacity:1;fill-rule:nonzero;stroke:none"
         id="path526"
         inkscape:connector-curvature="0" /></g><g
       id="g528"
       transform="translate(211.6692,354.0945)"><path
         d="m 0,0 c 2.367,1.254 31.189,2.103 44.197,1.632 l 7.267,11.742 4.839,-9.78 c 0,0 18.864,0.91 24.616,4.463 0,0 -12.429,-6.627 -25.787,-7.968 0,0 -3.041,6.379 -3.476,7.747 0,0 -4.059,-8.525 -5.847,-9.124 C 44.022,-1.886 0,0 0,0"
         style="fill:#232728;fill-opacity:1;fill-rule:nonzero;stroke:none"
         id="path530"
         inkscape:connector-curvature="0" /></g><g
       id="g532"
       transform="translate(246.2192,667.433)"><path
         d="m 0,0 c 0,0 41.763,-111.857 37.081,-117.754 -4.683,-5.897 -54.528,-19.527 -64.743,-12.167 -10.215,7.36 -40.299,76.845 -43.564,88.492 C -74.49,-29.782 -54.221,10.147 0,0"
         style="fill:#ffdcb8;fill-opacity:1;fill-rule:nonzero;stroke:none"
         id="path534"
         inkscape:connector-curvature="0" /></g><g
       id="g536"
       transform="translate(195.4901,567.6289)"><path
         d="m 0,0 c 0,0 13.663,32.178 -10.023,53.164 0,0 27.141,-2.73 29.216,2.902 2.075,5.633 -7.34,10.245 -7.34,10.245 0,0 21.826,-7.563 29.216,2.903 7.39,10.465 -5.613,8.771 -5.613,8.771 0,0 29.437,0.676 28.293,6.893 -1.145,6.216 -5.319,5.802 -5.319,5.802 0,0 17.803,11.728 8.837,27.722 C 58.302,134.397 30.78,142.2 26.373,117 c 0,0 -11.249,13.477 -22.889,13.565 -13.751,0.104 -32.147,-16.613 -2.429,-24.51 0,0 -38.294,-6.982 -41.65,-31.543 0,0 -3.692,15.955 -13.79,11.537 -10.099,-4.418 3.84,-17.441 3.84,-17.441 0,0 -12.371,-2.763 -7.452,-9.846 4.919,-7.083 11.686,-6.264 11.686,-6.264 0,0 2.817,-38.956 46.311,-52.498"
         style="fill:#725c2b;fill-opacity:1;fill-rule:nonzero;stroke:none"
         id="path538"
         inkscape:connector-curvature="0" /></g><g
       id="g540"
       transform="translate(201.9781,577.1165)"><path
         d="M 0,0 C 0,0 -9.819,8.676 -20.315,2.965 -30.812,-2.745 -16.747,-32.96 -1.562,-26.71 13.623,-20.459 0,0 0,0"
         style="fill:#ffdcb8;fill-opacity:1;fill-rule:nonzero;stroke:none"
         id="path542"
         inkscape:connector-curvature="0" /></g><g
       id="g544"
       transform="translate(237.3648,610.7153)"><path
         d="m 0,0 c 0,0 3.201,-11.01 7.114,-10.621 3.913,0.389 3.986,7.613 9.597,4.167 5.611,-3.446 0.729,-9.99 -5.377,-12.177 0,0 14.574,4.449 9.029,12.539 C 14.817,1.999 9.71,-6.339 6.798,-7.439 3.886,-8.539 0,0 0,0"
         style="fill:#cb8f5e;fill-opacity:1;fill-rule:nonzero;stroke:none"
         id="path546"
         inkscape:connector-curvature="0" /></g><g
       id="g548"
       transform="translate(221.1939,560.6132)"><path
         d="m 0,0 c 7.343,-10.373 18.409,-17.788 27.97,-15.638 1.349,0.304 2.573,0.884 3.688,1.679 C 23.611,4.285 8.767,2.844 0,0"
         style="fill:#eda69d;fill-opacity:1;fill-rule:nonzero;stroke:none"
         id="path550"
         inkscape:connector-curvature="0" /></g><g
       id="g552"
       transform="translate(264.0052,583.8574)"><path
         d="m 0,0 c -6.34,-2.474 -50.606,-5.027 -50.606,-5.027 0.988,-6.246 3.858,-12.656 7.795,-18.217 8.767,2.843 23.611,4.285 31.658,-13.959 C -0.129,-29.339 0,0 0,0"
         style="fill:#753427;fill-opacity:1;fill-rule:nonzero;stroke:none"
         id="path554"
         inkscape:connector-curvature="0" /></g><g
       id="g556"
       transform="translate(228.6614,604.0041)"><path
         d="m 0,0 c 1.117,-2.671 0.615,-5.426 -1.121,-6.152 -1.736,-0.726 -4.05,0.851 -5.167,3.522 -1.117,2.671 -0.615,5.426 1.121,6.152 C -3.431,4.248 -1.117,2.671 0,0"
         style="fill:#190f08;fill-opacity:1;fill-rule:nonzero;stroke:none"
         id="path558"
         inkscape:connector-curvature="0" /></g><g
       id="g560"
       transform="translate(257.2233,615.5347)"><path
         d="m 0,0 c 1.117,-2.671 0.615,-5.426 -1.121,-6.152 -1.736,-0.726 -4.05,0.851 -5.167,3.522 -1.117,2.671 -0.615,5.426 1.121,6.152 C -3.431,4.248 -1.117,2.671 0,0"
         style="fill:#190f08;fill-opacity:1;fill-rule:nonzero;stroke:none"
         id="path562"
         inkscape:connector-curvature="0" /></g><g
       id="g564"
       transform="translate(219.5223,626.5927)"><path
         d="m 0,0 c 0,0 -8.965,-5.896 -9.544,-13.329 0,0 -4.605,13.241 9.544,13.329"
         style="fill:#493918;fill-opacity:1;fill-rule:nonzero;stroke:none"
         id="path566"
         inkscape:connector-curvature="0" /></g><g
       id="g568"
       transform="translate(239.3618,633.042)"><path
         d="M 0,0 C 0,0 9.681,0.666 14.893,-1.418 14.893,-1.418 6.971,9.386 0,0"
         style="fill:#493918;fill-opacity:1;fill-rule:nonzero;stroke:none"
         id="path570"
         inkscape:connector-curvature="0" /></g></g></svg>