<?xml version="1.0" encoding="UTF-8" standalone="no"?>
<!-- Created with Inkscape (http://www.inkscape.org/) -->

<svg
   xmlns:dc="http://purl.org/dc/elements/1.1/"
   xmlns:cc="http://creativecommons.org/ns#"
   xmlns:rdf="http://www.w3.org/1999/02/22-rdf-syntax-ns#"
   xmlns:svg="http://www.w3.org/2000/svg"
   xmlns="http://www.w3.org/2000/svg"
   xmlns:sodipodi="http://sodipodi.sourceforge.net/DTD/sodipodi-0.dtd"
   xmlns:inkscape="http://www.inkscape.org/namespaces/inkscape"
   id="svg2"
   version="1.1"
   inkscape:version="0.91 r13725"
   xml:space="preserve"
   width="1000"
   height="1000"
   viewBox="0 0 1000 1000"
   sodipodi:docname="business401.svg"><metadata
     id="metadata8"><rdf:RDF><cc:Work
         rdf:about=""><dc:format>image/svg+xml</dc:format><dc:type
           rdf:resource="http://purl.org/dc/dcmitype/StillImage" /><dc:title></dc:title></cc:Work></rdf:RDF></metadata><defs
     id="defs6"><clipPath
       clipPathUnits="userSpaceOnUse"
       id="clipPath20"><path
         d="M 0,800 800,800 800,0 0,0 0,800 Z"
         id="path22"
         inkscape:connector-curvature="0" /></clipPath><clipPath
       clipPathUnits="userSpaceOnUse"
       id="clipPath152"><path
         d="M 0,0 800,0 800,800 0,800 0,0 Z"
         id="path154"
         inkscape:connector-curvature="0" /></clipPath><clipPath
       clipPathUnits="userSpaceOnUse"
       id="clipPath376"><path
         d="m 340.394,663.108 c -20.228,-20.746 -29.5,-69.179 -19.255,-86.04 l 0,0 c 0,0 49.907,4.839 54.532,16.505 l 0,0 c 0,0 -13.987,26.608 -0.731,44.289 l 0,0 c 15.626,20.719 10.574,26.495 12.361,31.857 l 0,0 c -1.8,6.423 1.229,6.534 -8.053,9.622 l 0,0 c 0,0 -1.712,0.415 -4.663,0.415 l 0,0 c -6.78,0 -20.096,-2.192 -34.191,-16.648"
         id="path378"
         inkscape:connector-curvature="0" /></clipPath><clipPath
       clipPathUnits="userSpaceOnUse"
       id="clipPath388"><path
         d="M 0,0 800,0 800,800 0,800 0,0 Z"
         id="path390"
         inkscape:connector-curvature="0" /></clipPath></defs><sodipodi:namedview
     pagecolor="#ffffff"
     bordercolor="#666666"
     borderopacity="1"
     objecttolerance="10"
     gridtolerance="10"
     guidetolerance="10"
     inkscape:pageopacity="0"
     inkscape:pageshadow="2"
     inkscape:window-width="1366"
     inkscape:window-height="703"
     id="namedview4"
     showgrid="false"
     inkscape:zoom="0.3337544"
     inkscape:cx="428.54046"
     inkscape:cy="502.04253"
     inkscape:window-x="0"
     inkscape:window-y="0"
     inkscape:window-maximized="1"
     inkscape:current-layer="g10" /><g
     id="g10"
     inkscape:groupmode="layer"
     inkscape:label="business_4"
     transform="matrix(1.25,0,0,-1.25,0,1000)"><g
       id="g156"
       transform="matrix(1.1073609,0,0,1.5435144,796.90953,67.714111)"><path
         d="m 0,0 c 0,7.455 -159.933,13.499 -357.221,13.499 -197.287,0 -357.221,-6.044 -357.221,-13.499 0,-7.455 159.934,-13.499 357.221,-13.499 C -159.933,-13.499 0,-7.455 0,0"
         style="fill:#36787f;fill-opacity:1;fill-rule:nonzero;stroke:none"
         id="path158"
         inkscape:connector-curvature="0" /></g><g
       id="g4588"
       transform="matrix(1.1674599,-1.0096901,1.0096901,1.1674599,-545.78136,80.583218)"><g
         style="fill:#686868;fill-opacity:1"
         transform="translate(308.5167,260.3625)"
         id="g176"><path
           inkscape:connector-curvature="0"
           id="path178"
           style="fill:#686868;fill-opacity:1;fill-rule:nonzero;stroke:none"
           d="M 0,0 -45.279,6.302 -11.044,20.706 -24.89,67.521 8.419,41.413 12.963,89.127 23.919,53.116 53.898,89.127 38.712,33.31 0,0 Z" /></g><g
         transform="translate(323.0032,453.3861)"
         id="g180"><path
           inkscape:connector-curvature="0"
           id="path182"
           style="fill:none;stroke:#f9e4b7;stroke-width:3;stroke-linecap:butt;stroke-linejoin:miter;stroke-miterlimit:10;stroke-dasharray:none;stroke-opacity:1"
           d="M 0,0 C 0,0 -1.584,-1.536 -4.105,-4.369" /></g><g
         style="stroke:#686868;stroke-opacity:1"
         transform="translate(311.6544,440.2145)"
         id="g184"><path
           inkscape:connector-curvature="0"
           id="path186"
           style="fill:none;stroke:#686868;stroke-width:3;stroke-linecap:butt;stroke-linejoin:miter;stroke-miterlimit:10;stroke-dasharray:11.405, 11.405;stroke-dashoffset:0;stroke-opacity:1"
           d="M 0,0 C -12.465,-16.33 -30.218,-46.093 -26.136,-79.251" /></g><g
         transform="translate(286.4213,355.3274)"
         id="g188"><path
           inkscape:connector-curvature="0"
           id="path190"
           style="fill:none;stroke:#f9e4b7;stroke-width:3;stroke-linecap:butt;stroke-linejoin:miter;stroke-miterlimit:10;stroke-dasharray:none;stroke-opacity:1"
           d="M 0,0 C 0.383,-1.937 0.844,-3.884 1.389,-5.837" /></g><g
         transform="translate(32.1316,317.0799)"
         id="g192"><path
           inkscape:connector-curvature="0"
           id="path194"
           style="fill:none;stroke:#f9e4b7;stroke-width:3;stroke-linecap:butt;stroke-linejoin:miter;stroke-miterlimit:10;stroke-dasharray:none;stroke-opacity:1"
           d="M 0,0 C 0,0 1.684,1.325 4.825,3.56" /></g><g
         style="stroke:#686868;stroke-opacity:1"
         transform="translate(46.7957,327.2949)"
         id="g196"><path
           inkscape:connector-curvature="0"
           id="path198"
           style="fill:none;stroke:#686868;stroke-width:3;stroke-linecap:butt;stroke-linejoin:miter;stroke-miterlimit:10;stroke-dasharray:11.881, 11.881;stroke-dashoffset:0;stroke-opacity:1"
           d="M 0,0 C 36.387,23.482 133.916,75.04 217.463,17.617" /></g><g
         transform="translate(269.0944,341.4539)"
         id="g200"><path
           inkscape:connector-curvature="0"
           id="path202"
           style="fill:none;stroke:#f9e4b7;stroke-width:3;stroke-linecap:butt;stroke-linejoin:miter;stroke-miterlimit:10;stroke-dasharray:none;stroke-opacity:1"
           d="M 0,0 C 1.589,-1.181 3.172,-2.404 4.749,-3.668" /></g><g
         transform="translate(472.606,640.1525)"
         id="g204"><path
           inkscape:connector-curvature="0"
           id="path206"
           style="fill:#f2c406;fill-opacity:1;fill-rule:nonzero;stroke:none"
           d="m 0,0 c 0,0 46.531,-10.977 62.036,-27.183 0,0 -9.634,-14.346 -19.406,-8.188 C 32.859,-29.214 -0.054,-6.944 0,0" /></g><g
         transform="translate(450.1572,639.5719)"
         id="g208"><path
           inkscape:connector-curvature="0"
           id="path210"
           style="fill:#898989;fill-opacity:1;fill-rule:nonzero;stroke:none"
           d="m 0,0 c 0,0 1.811,15.01 6.843,20.693 5.033,5.683 21.695,13.153 21.695,13.153 0,0 13.194,-18.685 16.889,-25.605 0,0 -18.948,-13.653 -28.124,-14.772 C 8.127,-7.65 0,0 0,0" /></g><g
         transform="translate(455.9669,645.8611)"
         id="g212"><path
           inkscape:connector-curvature="0"
           id="path214"
           style="fill:#d3e1e2;fill-opacity:1;fill-rule:nonzero;stroke:none"
           d="m 0,0 c 0,0 1.327,10.996 5.013,15.159 3.686,4.163 15.893,9.635 15.893,9.635 0,0 9.665,-13.687 12.372,-18.757 0,0 -13.88,-10.001 -20.602,-10.821 C 5.953,-5.604 0,0 0,0" /></g><g
         transform="translate(469.2471,668.7076)"
         id="g216"><path
           inkscape:connector-curvature="0"
           id="path218"
           style="fill:#464b4c;fill-opacity:1;fill-rule:nonzero;stroke:none"
           d="M 0,0 C 0,0 13.204,-20.483 19.09,-25.765 19.09,-25.765 3.058,-12.577 0,0" /></g><g
         transform="translate(442.7461,453.9573)"
         id="g220"><path
           inkscape:connector-curvature="0"
           id="path222"
           style="fill:#2a2d2d;fill-opacity:1;fill-rule:nonzero;stroke:none"
           d="m 0,0 c -1.83,-24.461 -23.142,-42.807 -47.603,-40.977 -24.46,1.829 -42.806,23.142 -40.977,47.602 1.83,24.461 23.142,42.807 47.603,40.978 C -16.517,45.773 1.83,24.461 0,0" /></g><g
         transform="translate(431.3308,454.8111)"
         id="g224"><path
           inkscape:connector-curvature="0"
           id="path226"
           style="fill:#9e9e9e;fill-opacity:1;fill-rule:nonzero;stroke:none"
           d="m 0,0 c -1.358,-18.156 -17.177,-31.774 -35.334,-30.416 -18.156,1.358 -31.773,17.178 -30.415,35.334 1.358,18.156 17.177,31.774 35.333,30.416 C -12.26,33.976 1.358,18.156 0,0" /></g><g
         transform="translate(426.6338,455.1624)"
         id="g228"><path
           inkscape:connector-curvature="0"
           id="path230"
           style="fill:#666666;fill-opacity:1;fill-rule:nonzero;stroke:none"
           d="m 0,0 c -1.164,-15.562 -14.723,-27.234 -30.285,-26.07 -15.562,1.164 -27.234,14.723 -26.07,30.285 1.164,15.562 14.723,27.234 30.285,26.07 C -10.508,29.121 1.164,15.562 0,0" /></g><g
         transform="translate(409.0247,456.4794)"
         id="g232"><path
           inkscape:connector-curvature="0"
           id="path234"
           style="fill:#9e9e9e;fill-opacity:1;fill-rule:nonzero;stroke:none"
           d="m 0,0 c -0.437,-5.837 -5.522,-10.215 -11.359,-9.778 -5.837,0.436 -10.215,5.522 -9.778,11.359 0.436,5.837 5.522,10.215 11.359,9.778 C -3.941,10.923 0.437,5.837 0,0" /></g><g
         transform="translate(372.3398,479.208)"
         id="g236"><path
           inkscape:connector-curvature="0"
           id="path238"
           style="fill:#9e9e9e;fill-opacity:1;fill-rule:nonzero;stroke:none"
           d="m 0,0 24.472,-25.822 6.563,5.757 L 7.506,6.18 0,0 Z" /></g><g
         transform="translate(404.4852,456.819)"
         id="g240"><path
           inkscape:connector-curvature="0"
           id="path242"
           style="fill:#d1d1d1;fill-opacity:1;fill-rule:nonzero;stroke:none"
           d="m 0,0 c -0.249,-3.33 -3.15,-5.827 -6.48,-5.578 -3.33,0.249 -5.827,3.15 -5.578,6.48 0.249,3.33 3.15,5.827 6.48,5.578 C -2.248,6.231 0.249,3.33 0,0" /></g><g
         transform="translate(612.5429,576.8502)"
         id="g244"><path
           inkscape:connector-curvature="0"
           id="path246"
           style="fill:#2a2d2d;fill-opacity:1;fill-rule:nonzero;stroke:none"
           d="m 0,0 c -1.83,-24.461 -23.142,-42.807 -47.603,-40.977 -24.46,1.829 -42.806,23.142 -40.977,47.602 1.83,24.461 23.142,42.807 47.603,40.978 C -16.517,45.773 1.83,24.461 0,0" /></g><g
         transform="translate(601.1277,577.7039)"
         id="g248"><path
           inkscape:connector-curvature="0"
           id="path250"
           style="fill:#9e9e9e;fill-opacity:1;fill-rule:nonzero;stroke:none"
           d="m 0,0 c -1.358,-18.156 -17.177,-31.774 -35.334,-30.416 -18.156,1.358 -31.773,17.178 -30.415,35.334 1.358,18.156 17.177,31.774 35.333,30.416 C -12.26,33.976 1.358,18.156 0,0" /></g><g
         transform="translate(596.4307,578.0552)"
         id="g252"><path
           inkscape:connector-curvature="0"
           id="path254"
           style="fill:#666666;fill-opacity:1;fill-rule:nonzero;stroke:none"
           d="m 0,0 c -1.164,-15.562 -14.723,-27.234 -30.285,-26.07 -15.562,1.164 -27.234,14.723 -26.07,30.285 1.164,15.562 14.723,27.234 30.285,26.07 C -10.508,29.121 1.164,15.562 0,0" /></g><g
         transform="translate(578.8215,579.3723)"
         id="g256"><path
           inkscape:connector-curvature="0"
           id="path258"
           style="fill:#9e9e9e;fill-opacity:1;fill-rule:nonzero;stroke:none"
           d="m 0,0 c -0.437,-5.837 -5.522,-10.215 -11.359,-9.778 -5.837,0.436 -10.215,5.522 -9.778,11.359 0.436,5.837 5.522,10.215 11.359,9.778 C -3.941,10.922 0.437,5.837 0,0" /></g><g
         transform="translate(542.1367,602.1009)"
         id="g260"><path
           inkscape:connector-curvature="0"
           id="path262"
           style="fill:#9e9e9e;fill-opacity:1;fill-rule:nonzero;stroke:none"
           d="m 0,0 24.472,-25.822 6.563,5.757 L 7.506,6.18 0,0 Z" /></g><g
         transform="translate(574.282,579.7119)"
         id="g264"><path
           inkscape:connector-curvature="0"
           id="path266"
           style="fill:#d1d1d1;fill-opacity:1;fill-rule:nonzero;stroke:none"
           d="m 0,0 c -0.249,-3.33 -3.15,-5.827 -6.48,-5.578 -3.33,0.249 -5.827,3.15 -5.578,6.48 0.249,3.33 3.15,5.827 6.48,5.578 C -2.248,6.231 0.249,3.33 0,0" /></g><g
         transform="translate(390.2883,546.2258)"
         id="g268"><path
           inkscape:connector-curvature="0"
           id="path270"
           style="fill:#e2a60e;fill-opacity:1;fill-rule:nonzero;stroke:none"
           d="m 0,0 c 0,0 12.524,-2.24 18.522,-7.503 5.998,-5.264 33.365,-39.209 36.062,-40.615 2.696,-1.405 54.336,37.226 59.805,45.964 5.468,8.738 2.801,77.627 -63.52,91.389 0,0 -8.023,0.788 -6.114,8.138 1.908,7.349 11.264,-0.843 11.264,-0.843 0,0 49.114,-5.167 81.343,-40.99 0,0 3.635,-47.964 2.118,-52.146 -1.516,-4.182 -74.19,-60.739 -91.673,-72.07 0,0 -14.933,12.552 -30.798,10.73 -15.866,-1.823 -54.325,-0.752 -59.388,3.84 -5.064,4.591 -21.291,30.568 -13.298,44.633 C -47.684,4.593 0,0 0,0" /></g><g
         transform="translate(355.6567,524.3024)"
         id="g272"><path
           inkscape:connector-curvature="0"
           id="path274"
           style="fill:#f2c406;fill-opacity:1;fill-rule:nonzero;stroke:none"
           d="m 0,0 c -12.008,-4.217 -34.504,-44.025 -22.752,-71.987 0,0 7.516,-8.989 14.741,-6.52 7.224,2.469 67.917,43.069 72.66,49.335 C 69.392,-22.906 54.304,19.071 0,0" /></g><g
         transform="translate(402.0399,550.6642)"
         id="g276"><path
           inkscape:connector-curvature="0"
           id="path278"
           style="fill:#1f2323;fill-opacity:1;fill-rule:nonzero;stroke:none"
           d="m 0,0 c -3.241,3.873 -49.863,0.919 -66.414,-0.35 -16.552,-1.269 -23.108,2.9 -25.992,-2.97 -3.556,-7.238 10.08,-19.399 24.172,-21.362 14.091,-1.963 62.522,7.474 67.175,10.527 C 3.595,-11.102 4.1,-4.899 0,0" /></g><g
         transform="translate(526.6838,550.5518)"
         id="g280"><path
           inkscape:connector-curvature="0"
           id="path282"
           style="fill:#f2c406;fill-opacity:1;fill-rule:nonzero;stroke:none"
           d="m 0,0 c 0,0 -10.081,40.313 -3.822,51.572 6.259,11.259 17.133,30.17 40.303,31.892 15.633,1.162 29.706,-5.953 35.691,-14.443 0,0 -22.495,-18.347 -34.509,-26.077 C 25.65,35.215 8.332,23.727 13.204,8.403 13.204,8.403 10.303,3.531 0,0" /></g><g
         transform="translate(445.881,472.0912)"
         id="g284"><path
           inkscape:connector-curvature="0"
           id="path286"
           style="fill:#295d60;fill-opacity:1;fill-rule:nonzero;stroke:none"
           d="m 0,0 c 3.741,-5.57 3.739,-12.081 3.744,-18.554 0.002,-2.418 3.752,-2.418 3.75,0 C 7.489,-11.43 7.344,-4.221 3.238,1.893 1.898,3.889 -1.352,2.014 0,0" /></g><g
         transform="translate(454.381,472.0912)"
         id="g288"><path
           inkscape:connector-curvature="0"
           id="path290"
           style="fill:#295d60;fill-opacity:1;fill-rule:nonzero;stroke:none"
           d="m 0,0 c 2.226,-3.851 2.241,-8.227 2.244,-12.554 0.002,-2.418 3.752,-2.418 3.75,0 C 5.99,-7.545 5.806,-2.551 3.238,1.893 2.029,3.985 -1.212,2.098 0,0" /></g><g
         transform="translate(346.381,433.5912)"
         id="g292"><path
           inkscape:connector-curvature="0"
           id="path294"
           style="fill:#295d60;fill-opacity:1;fill-rule:nonzero;stroke:none"
           d="m 0,0 c 3.16,-6.026 8.276,-10.436 13.293,-14.879 1.803,-1.597 4.466,1.045 2.652,2.651 C 11.166,-7.996 6.25,-3.85 3.238,1.893 2.115,4.035 -1.122,2.139 0,0" /></g><g
         transform="translate(341.381,426.5912)"
         id="g296"><path
           inkscape:connector-curvature="0"
           id="path298"
           style="fill:#295d60;fill-opacity:1;fill-rule:nonzero;stroke:none"
           d="m 0,0 c 2.226,-3.363 4.311,-6.816 7.673,-9.173 1.985,-1.391 3.856,1.862 1.892,3.238 -2.781,1.95 -4.49,5.053 -6.327,7.828 C 1.91,3.899 -1.339,2.023 0,0" /></g><g
         transform="translate(537.0536,536.9185)"
         id="g300"><path
           inkscape:connector-curvature="0"
           id="path302"
           style="fill:#295d60;fill-opacity:1;fill-rule:nonzero;stroke:none"
           d="m 0,0 c 3.661,-2.09 7.352,-4.094 11.448,-5.189 2.339,-0.625 3.331,2.992 0.997,3.616 C 8.652,-0.559 5.28,1.304 1.893,3.238 -0.211,4.439 -2.099,1.198 0,0" /></g><g
         transform="translate(535.0536,528.4185)"
         id="g304"><path
           inkscape:connector-curvature="0"
           id="path306"
           style="fill:#295d60;fill-opacity:1;fill-rule:nonzero;stroke:none"
           d="M 0,0 C 2.627,-1.494 5.514,-2.108 8.448,-2.689 10.809,-3.157 11.816,0.457 9.445,0.927 6.844,1.442 4.224,1.912 1.893,3.238 -0.213,4.435 -2.101,1.195 0,0" /></g><g
         transform="translate(615.381,599.0912)"
         id="g308"><path
           inkscape:connector-curvature="0"
           id="path310"
           style="fill:#295d60;fill-opacity:1;fill-rule:nonzero;stroke:none"
           d="m 0,0 c 1.882,-3.528 2.214,-7.622 2.244,-11.554 0.018,-2.417 3.768,-2.419 3.75,0 C 5.959,-6.942 5.438,-2.231 3.238,1.893 2.099,4.027 -1.138,2.133 0,0" /></g><g
         transform="translate(623.692,602.0391)"
         id="g312"><path
           inkscape:connector-curvature="0"
           id="path314"
           style="fill:#295d60;fill-opacity:1;fill-rule:nonzero;stroke:none"
           d="m 0,0 c 1.432,-3.54 1.898,-7.203 1.933,-11.002 0.022,-2.417 3.772,-2.419 3.75,0 C 5.646,-6.898 5.164,-2.83 3.616,0.997 2.722,3.209 -0.907,2.243 0,0" /></g><g
         transform="translate(443.4153,578.0812)"
         id="g316"><path
           inkscape:connector-curvature="0"
           id="path318"
           style="fill:#281d12;fill-opacity:1;fill-rule:nonzero;stroke:none"
           d="m 0,0 c 0,0 8.486,-1.349 11.682,-0.714 3.196,0.636 10.539,10.109 12.418,11.347 1.88,1.239 8.607,-6.763 8.607,-6.763 0,0 -19.719,-16.009 -23.523,-17.58 l -4.593,0.28 -2.805,-1.632 c 0,0 -8.402,-1.573 -9.885,0.604 -1.483,2.177 0.8,13.097 0.8,13.097 0,0 4.603,1.526 7.299,1.361" /></g><g
         transform="translate(368.6796,587.536)"
         id="g320"><path
           inkscape:connector-curvature="0"
           id="path322"
           style="fill:#464b4c;fill-opacity:1;fill-rule:nonzero;stroke:none"
           d="m 0,0 c 0,0 31.575,29.64 50.308,26.241 18.734,-3.4 24.669,-24.365 27.124,-35.861 0,0 -7.046,-4.601 -10.613,-3.932 0,0 -3.495,31.375 -17.099,30.155 C 36.116,15.382 4.929,-8.025 2.122,-9.629 -0.686,-11.233 -40.061,-4.964 0,0" /></g><g
         transform="translate(459.9215,538.218)"
         id="g324"><path
           inkscape:connector-curvature="0"
           id="path326"
           style="fill:#281d12;fill-opacity:1;fill-rule:nonzero;stroke:none"
           d="m 0,0 c 0,0 7.803,2.229 9.82,5.714 2.016,3.485 3.656,15.561 1.207,19.769 0,0 10.746,6.108 14.121,2.294 0,0 1.92,-27.626 -7.56,-35.165 l -4.044,0.247 c 0,0 2.367,-5.556 -0.439,-7.189 -2.806,-1.632 -13.414,-5.494 -14.313,-5.439 0,0 -6.312,9.845 -7.918,12.994 C -10.732,-3.627 0,0 0,0" /></g><g
         transform="translate(359.4661,581.6054)"
         id="g328"><path
           inkscape:connector-curvature="0"
           id="path330"
           style="fill:#464b4c;fill-opacity:1;fill-rule:nonzero;stroke:none"
           d="m 0,0 c 0,0 74.215,6.921 100.455,-43.387 0,0 -6.701,-6.356 -8.214,-8.969 0,0 -16.805,49.732 -95.862,40.129 -2.219,0.587 -26.172,-12.587 -31.928,1.5 C -44.024,10.015 0,0 0,0" /></g><g
         transform="translate(439.0715,673.0349)"
         id="g332"><path
           inkscape:connector-curvature="0"
           id="path334"
           style="fill:#ffdcb8;fill-opacity:1;fill-rule:nonzero;stroke:none"
           d="m 0,0 c -0.176,2.223 -1.032,6.172 -2.257,10.978 -20.67,-21.938 -31.499,5.692 -31.499,5.692 2.385,0.416 20.174,5.635 27.761,7.874 -0.389,1.342 -0.784,2.69 -1.182,4.037 7.223,-0.299 8.828,9.133 3.46,6.708 -3.968,-1.793 -5.812,1.526 -6.505,3.381 -0.116,0.379 -0.232,0.755 -0.346,1.128 l -0.001,10e-4 C -13.522,49.39 -15.94,56.837 -15.94,56.837 -44.673,81.139 -57.794,40.736 -56.143,35.876 -54.491,31.017 -46.966,3.969 -39.556,-3.603 -32.145,-11.175 0.809,-10.233 0,0" /></g><g
         transform="translate(392.2029,690.2517)"
         id="g336"><path
           inkscape:connector-curvature="0"
           id="path338"
           style="fill:#725c2b;fill-opacity:1;fill-rule:nonzero;stroke:none"
           d="m 0,0 c 0,0 10.369,18.909 -6.882,29.603 0,0 30.537,1.814 25.976,5.155 -3.958,2.9 -7.429,2.992 -7.429,2.992 0,0 24.928,-3.437 26.907,4.427 2.181,8.666 -4.877,-1.144 -4.877,-1.144 0,0 4.758,27.571 -6.992,29.376 -11.749,1.806 -4.251,-11.737 -4.251,-11.737 0,0 -5.43,10.581 -19.175,12.622 -13.746,2.042 -9.549,-9.594 -1.486,-12.081 0,0 -21.15,-2.659 -27.942,-15.433 0,0 -11.123,1.932 -11.837,-4.065 -0.714,-5.997 7.125,-1.456 7.125,-1.456 0,0 -7.234,-5.259 -4.152,-7.127 3.081,-1.869 4.428,2.634 4.428,2.634 0,0 -1.558,-22.704 15.016,-27.129 0,0 -4.078,-7.015 -1.822,-8.5 2.256,-1.485 4.284,2.408 4.284,2.408 0,0 -2.536,-8.948 2.108,-6.615 C -6.357,-3.738 -1.568,-3.745 0,0" /></g><g
         transform="translate(408.8362,683.428)"
         id="g340"><path
           inkscape:connector-curvature="0"
           id="path342"
           style="fill:#da9089;fill-opacity:1;fill-rule:nonzero;stroke:none"
           d="M 0,0 C 3.936,-5.485 11.14,-11.616 21.44,-5.004 16.296,4.059 5.709,1.975 0,0" /></g><g
         transform="translate(433.0768,697.5789)"
         id="g344"><path
           inkscape:connector-curvature="0"
           id="path346"
           style="fill:#753427;fill-opacity:1;fill-rule:nonzero;stroke:none"
           d="m 0,0 c -7.587,-2.239 -25.376,-7.458 -27.761,-7.874 0,0 1.186,-3.024 3.52,-6.277 5.709,1.975 16.297,4.059 21.441,-5.004 2.056,1.32 4.235,3.146 6.537,5.589 C 2.698,-9.491 1.393,-4.802 0,0" /></g><g
         transform="translate(421.2642,710.5711)"
         id="g348"><path
           inkscape:connector-curvature="0"
           id="path350"
           style="fill:#190f08;fill-opacity:1;fill-rule:nonzero;stroke:none"
           d="M 0,0 C 0.691,-2.525 0.253,-4.845 -0.978,-5.182 -2.209,-5.519 -3.767,-3.745 -4.458,-1.22 -5.149,1.305 -4.711,3.625 -3.48,3.962 -2.249,4.299 -0.691,2.525 0,0" /></g><g
         transform="translate(397.3835,692.3914)"
         id="g352"><path
           inkscape:connector-curvature="0"
           id="path354"
           style="fill:#ffdcb8;fill-opacity:1;fill-rule:nonzero;stroke:none"
           d="M 0,0 C 0,0 -3.806,8.892 -11.215,6.264 -18.624,3.636 -14.514,-2.841 -11.538,-5.878 -8.562,-8.914 0.938,-10.856 0,0" /></g><g
         transform="translate(418.7314,722.3264)"
         id="g356"><path
           inkscape:connector-curvature="0"
           id="path358"
           style="fill:#3a2b12;fill-opacity:1;fill-rule:nonzero;stroke:none"
           d="M 0,0 C 0,0 -6.869,5.469 -9.895,-2.681 -9.895,-2.681 -8.42,9.46 0,0" /></g><g
         transform="translate(390.2087,670.8783)"
         id="g360"><path
           inkscape:connector-curvature="0"
           id="path362"
           style="fill:#ffffff;fill-opacity:1;fill-rule:nonzero;stroke:none"
           d="m 0,0 c 0,0 2.208,-2.171 2.473,-6.091 l -1.515,2.562 -2.802,-1.612 c 0,0 -1.92,4.344 1.844,5.141" /></g><g
         transform="translate(410.3655,669.4334)"
         id="g364"><path
           inkscape:connector-curvature="0"
           id="path366"
           style="fill:#ffdcb8;fill-opacity:1;fill-rule:nonzero;stroke:none"
           d="m 0,0 c 0,0 -14.522,1.714 -20.231,0.392 0,0 -7.06,-1.393 -7.242,4.473 -0.182,5.866 9.877,5.34 17.493,8.828 L 0,0 Z" /></g><g
         transform="translate(379.248,679.3409)"
         id="g368"><path
           inkscape:connector-curvature="0"
           id="path370"
           style="fill:#464b4c;fill-opacity:1;fill-rule:nonzero;stroke:none"
           d="m 0,0 c 0,0 -18.625,4.515 -38.853,-16.232 -20.229,-20.747 -29.501,-69.18 -19.256,-86.041 0,0 49.907,4.839 54.532,16.505 0,0 -13.987,26.609 -0.731,44.289 C 11.318,-20.76 6.266,-14.984 8.053,-9.622 6.253,-3.199 9.282,-3.088 0,0" /></g><g
         id="g372"><g
           clip-path="url(#clipPath376)"
           id="g374"><g
             transform="translate(381.5125,681.3447)"
             id="g380"><path
               inkscape:connector-curvature="0"
               id="path382"
               style="fill:#a3a3a3;fill-opacity:1;fill-rule:nonzero;stroke:none"
               d="m 0,0 c 0,0 -1.761,-27.798 -2.397,-30.633 -0.636,-2.835 -2.957,-4.667 -2.957,-4.667 0,0 -5.329,-10.385 -3.279,-15.584 2.051,-5.199 17.806,25.745 16.886,32.792 -0.921,7.046 -7.738,18.061 -7.738,18.061" /></g></g></g><g
         id="g384"><g
           clip-path="url(#clipPath388)"
           id="g386"><g
             transform="translate(337.9407,578.9673)"
             id="g392"><path
               inkscape:connector-curvature="0"
               id="path394"
               style="fill:#676b6b;fill-opacity:1;fill-rule:nonzero;stroke:none"
               d="m 0,0 c 0,0 -16.317,-8.715 -29.875,5.575 0,0 9.675,-4.838 9.291,5.142 0,0 2.342,-12.603 20.584,-10.717" /></g><g
             transform="translate(387.7084,667.3492)"
             id="g396"><path
               inkscape:connector-curvature="0"
               id="path398"
               style="fill:#141414;fill-opacity:1;fill-rule:nonzero;stroke:none"
               d="m 0,0 c 0,0 -2.22,10.789 -17.742,15.079 -15.523,4.29 -35.142,-14.202 -51.599,4.315 l -20.895,-2.45 c 0,0 3.343,-19.103 5.847,-22.412 0,0 16.956,-9.978 29.654,-1.812 23.38,15.035 39.225,22.895 54.82,3.044 L 0,0 Z" /></g><g
             transform="translate(391.7509,669.8385)"
             id="g400"><path
               inkscape:connector-curvature="0"
               id="path402"
               style="fill:#bababa;fill-opacity:1;fill-rule:nonzero;stroke:none"
               d="m 0,0 -3.387,-4.101 c 0,0 -4.873,1.761 -4.465,4.101 C -7.444,2.34 0,0 0,0" /></g><g
             transform="translate(387.7084,667.3492)"
             id="g404"><path
               inkscape:connector-curvature="0"
               id="path406"
               style="fill:#141414;fill-opacity:1;fill-rule:nonzero;stroke:none"
               d="m 0,0 c 0,0 1.406,-1.013 0.607,-4.346 -0.799,-3.334 -1.57,0.095 -1.57,0.095 L 0,0 Z" /></g><g
             transform="translate(379.0104,648.9922)"
             id="g408"><path
               inkscape:connector-curvature="0"
               id="path410"
               style="fill:#676b6b;fill-opacity:1;fill-rule:nonzero;stroke:none"
               d="m 0,0 c 0,0 -6.674,1.774 -12.907,7.116 0,0 -6.483,-34.257 4.366,-47.629 0,0 -2.674,17.388 8.541,40.513" /></g><g
             transform="translate(382.3388,674.2294)"
             id="g412"><path
               inkscape:connector-curvature="0"
               id="path414"
               style="fill:#676b6b;fill-opacity:1;fill-rule:nonzero;stroke:none"
               d="m 0,0 c 0,0 -7.081,-4.524 -13.52,-2.124 0,0 5.731,-17.579 10.192,-23.113 0,0 7.832,13.725 3.328,25.237" /></g><g
             transform="translate(378.2881,681.5536)"
             id="g416"><path
               inkscape:connector-curvature="0"
               id="path418"
               style="fill:#ffffff;fill-opacity:1;fill-rule:nonzero;stroke:none"
               d="m 0,0 7.071,-0.686 6.392,-11.029 -9.17,-4.101 c 0,0 -5.418,10.254 -4.293,15.816" /></g><g
             transform="translate(342.6328,580.1628)"
             id="g420"><path
               inkscape:connector-curvature="0"
               id="path422"
               style="fill:#232728;fill-opacity:1;fill-rule:nonzero;stroke:none"
               d="m 0,0 c 0,0 28.644,7.553 31.829,11.277 l -1.125,2.543 2.476,-0.743 c 0,0 -3.482,2.701 -4.217,2.926 l 0,-4.501 C 28.963,11.502 8.927,1.379 0,0" /></g><g
             transform="translate(372.8864,674.2294)"
             id="g424"><path
               inkscape:connector-curvature="0"
               id="path426"
               style="fill:#464b4c;fill-opacity:1;fill-rule:nonzero;stroke:none"
               d="m 0,0 c 5.421,-1.111 -12.911,-26.538 -2.43,-45.78 9.006,-16.533 35.681,-3.569 55.953,7.874 0,0 3.589,-6.082 8.435,-7.28 0,0 -52.495,-31.989 -70.722,-11.8 C -30.31,-33.121 -8.969,1.838 0,0" /></g><g
             transform="translate(365.488,670.8783)"
             id="g428"><path
               inkscape:connector-curvature="0"
               id="path430"
               style="fill:#232728;fill-opacity:1;fill-rule:nonzero;stroke:none"
               d="m 0,0 c 0,0 -27.547,-31.387 1.802,-56.408 0,0 -26.151,18.482 -1.802,56.408" /></g><g
             transform="translate(426.4095,636.3232)"
             id="g432"><path
               inkscape:connector-curvature="0"
               id="path434"
               style="fill:#ffdcb8;fill-opacity:1;fill-rule:nonzero;stroke:none"
               d="m 0,0 c 0,0 -0.797,12.075 3.43,14.823 0,0 3.823,2.172 6.331,-0.387 0,0 7.276,1.66 8.377,-2.466 0,0 7.556,-1.814 5.264,-9.792 0,0 -2.383,-2.109 -4.016,0.697 C 17.754,5.68 13.819,9.077 12.912,4.623 12.005,0.169 14.427,-5.842 8.435,-7.28 2.443,-8.718 0.039,-3.635 0,0" /></g><g
             transform="translate(446.933,639.813)"
             id="g436"><path
               inkscape:connector-curvature="0"
               id="path438"
               style="fill:#464b4c;fill-opacity:1;fill-rule:nonzero;stroke:none"
               d="m 0,0 c -0.324,-4.334 -4.1,-7.584 -8.434,-7.26 -4.333,0.324 -7.584,4.1 -7.26,8.434 0.324,4.334 4.1,7.584 8.434,7.26 C -2.926,8.11 0.324,4.334 0,0" /></g><g
             transform="translate(444.0112,640.0316)"
             id="g440"><path
               inkscape:connector-curvature="0"
               id="path442"
               style="fill:#727b7c;fill-opacity:1;fill-rule:nonzero;stroke:none"
               d="m 0,0 c -0.203,-2.72 -2.573,-4.76 -5.293,-4.557 -2.72,0.204 -4.76,2.574 -4.557,5.294 0.203,2.72 2.573,4.76 5.293,4.556 C -1.837,5.09 0.203,2.72 0,0" /></g><g
             transform="translate(247.6674,638.0239)"
             id="g444"><path
               inkscape:connector-curvature="0"
               id="path446"
               style="fill:#1f2323;fill-opacity:1;fill-rule:nonzero;stroke:none"
               d="m 0,0 -16.078,12.789 c -1.676,1.332 -4.114,1.055 -5.447,-0.621 L -24.538,8.38 c -1.332,-1.675 -1.054,-4.113 0.621,-5.446 l 0.144,-0.114 c 0.077,0.667 0.342,1.347 0.816,1.944 l 2.677,3.366 c 1.185,1.488 3.168,1.881 4.43,0.877 l 12.114,-9.635 c 1.262,-1.004 1.326,-3.025 0.141,-4.514 l -2.677,-3.366 c -0.474,-0.596 -1.078,-1.007 -1.71,-1.233 l 0.143,-0.114 c 1.676,-1.333 4.114,-1.055 5.447,0.621 l 3.013,3.787 C 1.953,-3.771 1.675,-1.333 0,0" /></g><g
             transform="translate(245.8472,639.4718)"
             id="g448"><path
               inkscape:connector-curvature="0"
               id="path450"
               style="fill:#313535;fill-opacity:1;fill-rule:nonzero;stroke:none"
               d="m 0,0 -16.078,12.789 c -1.676,1.332 -4.114,1.055 -5.447,-0.621 L -24.538,8.38 c -1.332,-1.675 -1.054,-4.113 0.621,-5.446 l 0.144,-0.114 c 0.077,0.667 0.342,1.347 0.816,1.944 l 2.677,3.366 c 1.185,1.488 3.168,1.881 4.43,0.877 l 12.114,-9.635 c 1.262,-1.004 1.326,-3.025 0.141,-4.514 l -2.677,-3.366 c -0.474,-0.596 -1.078,-1.007 -1.71,-1.233 l 0.143,-0.114 c 1.676,-1.333 4.114,-1.055 5.447,0.621 l 3.013,3.787 C 1.953,-3.771 1.675,-1.333 0,0" /></g><g
             transform="translate(235.3821,554.4172)"
             id="g452"><path
               inkscape:connector-curvature="0"
               id="path454"
               style="fill:#1f2323;fill-opacity:1;fill-rule:nonzero;stroke:none"
               d="m 0,0 c -1.333,-1.675 -3.771,-1.953 -5.447,-0.621 l -63.868,50.802 c -1.675,1.333 -1.953,3.771 -0.62,5.447 l 37.618,47.294 c 1.333,1.675 3.771,1.953 5.447,0.62 L 36.998,52.741 c 1.675,-1.333 1.953,-3.772 0.621,-5.447 L 0,0 Z" /></g><g
             transform="translate(230.6906,558.1489)"
             id="g456"><path
               inkscape:connector-curvature="0"
               id="path458"
               style="fill:#1f2323;fill-opacity:1;fill-rule:nonzero;stroke:none"
               d="m 0,0 c -1.333,-1.675 -3.688,-2.02 -5.26,-0.769 l -59.549,47.366 c -1.573,1.251 -1.767,3.624 -0.435,5.299 l 37.619,47.294 c 1.332,1.676 3.687,2.02 5.26,0.769 L 37.184,52.593 c 1.573,-1.251 1.767,-3.623 0.435,-5.299 L 0,0 Z" /></g><g
             transform="translate(230.6906,558.1489)"
             id="g460"><path
               inkscape:connector-curvature="0"
               id="path462"
               style="fill:none;stroke:#657272;stroke-width:1;stroke-linecap:butt;stroke-linejoin:miter;stroke-miterlimit:10;stroke-dasharray:none;stroke-opacity:1"
               d="m 0,0 c -1.333,-1.675 -3.688,-2.02 -5.26,-0.769 l -59.549,47.366 c -1.573,1.251 -1.767,3.624 -0.435,5.299 l 37.619,47.294 c 1.332,1.676 3.687,2.02 5.26,0.769 L 37.184,52.593 c 1.573,-1.251 1.767,-3.623 0.435,-5.299 L 0,0 Z" /></g><g
             transform="translate(224.7396,562.8824)"
             id="g464"><path
               inkscape:connector-curvature="0"
               id="path466"
               style="fill:#313535;fill-opacity:1;fill-rule:nonzero;stroke:none"
               d="m 0,0 c -1.333,-1.675 -3.698,-2.012 -5.283,-0.751 l -60.065,47.777 c -1.585,1.26 -1.789,3.641 -0.457,5.316 l 37.619,47.294 c 1.333,1.676 3.698,2.012 5.283,0.751 L 37.162,52.61 c 1.585,-1.26 1.789,-3.64 0.456,-5.316 L 0,0 Z" /></g><g
             transform="translate(221.6512,569.5115)"
             id="g468"><path
               inkscape:connector-curvature="0"
               id="path470"
               style="fill:#464b4c;fill-opacity:1;fill-rule:nonzero;stroke:none"
               d="m 0,0 c -1.189,-1.494 -3.298,-1.794 -4.712,-0.67 l -52.87,42.054 c -1.414,1.124 -1.596,3.247 -0.407,4.742 l 33.553,42.183 c 1.188,1.494 3.298,1.794 4.712,0.669 l 52.87,-42.053 c 1.413,-1.125 1.596,-3.248 0.407,-4.742 L 0,0 Z" /></g><g
             transform="translate(276.881,609.5912)"
             id="g472"><path
               inkscape:connector-curvature="0"
               id="path474"
               style="fill:#295d60;fill-opacity:1;fill-rule:nonzero;stroke:none"
               d="m 0,0 c 0.878,-1.388 1.219,-2.923 1.244,-4.554 0.038,-2.415 3.788,-2.419 3.75,0 C 4.959,-2.289 4.459,-0.037 3.238,1.893 1.949,3.93 -1.297,2.05 0,0" /></g><g
             transform="translate(283.192,610.0391)"
             id="g476"><path
               inkscape:connector-curvature="0"
               id="path478"
               style="fill:#295d60;fill-opacity:1;fill-rule:nonzero;stroke:none"
               d="m 0,0 c 0.362,-1.16 0.432,-2.294 0.433,-3.502 0.002,-2.418 3.752,-2.418 3.75,0 C 4.182,-1.983 4.07,-0.46 3.616,0.997 2.899,3.298 -0.722,2.315 0,0" /></g><g
             transform="translate(145.381,618.4839)"
             id="g480"><path
               inkscape:connector-curvature="0"
               id="path482"
               style="fill:#295d60;fill-opacity:1;fill-rule:nonzero;stroke:none"
               d="M 0,0 C -1.695,-3.743 -1.232,-7.252 0.5,-10.893 1.538,-13.076 4.771,-11.172 3.738,-9 2.642,-6.696 2.148,-4.3 3.238,-1.893 4.228,0.292 0.997,2.2 0,0" /></g><g
             transform="translate(137.625,616.5375)"
             id="g484"><path
               inkscape:connector-curvature="0"
               id="path486"
               style="fill:#295d60;fill-opacity:1;fill-rule:nonzero;stroke:none"
               d="M 0,0 C 0.001,-2.528 0.097,-5.008 0.567,-7.498 1.015,-9.873 4.629,-8.865 4.183,-6.502 3.777,-4.348 3.751,-2.185 3.75,0 3.749,2.418 -0.001,2.418 0,0" /></g></g></g></g></g></svg>