<?xml version="1.0" encoding="UTF-8"?>
<session version="1.0">
<refactoring comment="Copy element &apos;RabbitMQMessagingConfiguration.java&apos; to &apos;loan-service/src/main/java/com.digisafari.plms.loan.config&apos;&#x0D;&#x0A;- Original project: &apos;authentication-service&apos;&#x0D;&#x0A;- Destination element: &apos;loan-service/src/main/java/com.digisafari.plms.loan.config&apos;&#x0D;&#x0A;- Original element: &apos;com.digisafari.plms.authentication.config.RabbitMQMessagingConfiguration.java&apos;" description="Copy compilation unit" destination="=loan-service/src\/main\/java=/optional=/true=/=/maven.pomderived=/true=/&lt;com.digisafari.plms.loan.config" element1="/src\/main\/java=/optional=/true=/=/maven.pomderived=/true=/&lt;com.digisafari.plms.authentication.config{RabbitMQMessagingConfiguration.java" files="0" flags="589830" folders="0" id="org.eclipse.jdt.ui.copy" policy="org.eclipse.jdt.ui.copyResources" stamp="1588317178424" units="1" version="1.0"/>
</session>