<?xml version="1.0" encoding="UTF-8"?>
<session version="1.0">
<refactoring comment="Delete resource &apos;user-service&apos;" deleteContents="true" description="Delete resource &apos;user-service&apos;" element1="/user-service" flags="7" id="org.eclipse.ltk.core.refactoring.delete.resources" resources="1" stamp="1588012643581"/>
</session>