1,LightStream,../../../../assets/images/bank.png,5000,100000,4.99,15.69,660,48,100,4.9,9
2,Sofi,../../../../assets/images/bank.png,4000,50000,5.99,18.69,680,60,150,4.5,15
3,Marcus,../../../../assets/images/bank.png,3500,40000,6.99,25.69,660,60,120,4.7,14
4,Upgrade,../../../../assets/images/bank.png,2000,35000,9.55,15.69,580,48,150,4,7
