{
  "project_info": {
    "project_number": "98615545676",
    "project_id": "building-54211",
    "storage_bucket": "building-54211.appspot.com"
  },
  "client": [
    {
      "client_info": {
        "mobilesdk_app_id": "1:98615545676:android:59f811cad638a5c92ec9e9",
        "android_client_info": {
          "package_name": "com.digaBuilding"
        }
      },
      "oauth_client": [
        {
          "client_id": "98615545676-j3nelqeaofjp78dvied6ub3p88827f7i.apps.googleusercontent.com",
          "client_type": 3
        }
      ],
      "api_key": [
        {
          "current_key": "AIzaSyCHqxFwgMNr9xRUovoBEmjr4ateOt678Wk"
        }
      ],
      "services": {
        "appinvite_service": {
          "other_platform_oauth_client": [
            {
              "client_id": "98615545676-j3nelqeaofjp78dvied6ub3p88827f7i.apps.googleusercontent.com",
              "client_type": 3
            }
          ]
        }
      }
    },
    {
      "client_info": {
        "mobilesdk_app_id": "1:98615545676:android:07048c53201379942ec9e9",
        "android_client_info": {
          "package_name": "com.digabuilding"
        }
      },
      "oauth_client": [
        {
          "client_id": "98615545676-j3nelqeaofjp78dvied6ub3p88827f7i.apps.googleusercontent.com",
          "client_type": 3
        }
      ],
      "api_key": [
        {
          "current_key": "AIzaSyCHqxFwgMNr9xRUovoBEmjr4ateOt678Wk"
        }
      ],
      "services": {
        "appinvite_service": {
          "other_platform_oauth_client": [
            {
              "client_id": "98615545676-j3nelqeaofjp78dvied6ub3p88827f7i.apps.googleusercontent.com",
              "client_type": 3
            }
          ]
        }
      }
    }
  ],
  "configuration_version": "1"
}