{
  "buildCommand": "mvn deploy -DskipTests -DaltDeploymentRepository=releaseRepository::default::file://DIFFBLUE_SECURITY_DEPLOY_DIR",
  "commandArguments": {
    "entryPoints": [
      "com.diffblue.VertxXss.handle:(Lio/vertx/core/http/HttpServerRequest;)V"
    ],
    "syntheticEntryPoints": true,
    "buildDependencies": ["/root/.m2/repository/io/vertx/vertx-core/3.0.0/vertx-core-3.0.0.jar"]
  }
}
