{
  "namespace": "com.diffblue.security",
  "rules": [
      {
        "comment": "Input tainted byte array",
        "class": "dragonstone.demo.EntryPoint",
        "method": "getTaintedBytes:()[B",
        "result": {
          "location": "returnValue",
          "taint": "Tainted String"
        }
      },
      {
        "comment": "Storing a tainted String to S3",
        "class": "com.amazonaws.services.s3.AmazonS3",
	"method": "putObject:(Ljava/lang/String;Ljava/lang/String;Ljava/lang/String;)Lcom/amazonaws/services/s3/model/PutObjectResult;",
	"sinkTarget": {
	  "location": "arg3",
	  "taint": "Tainted String"
	}
      },
      {
        "comment": "Base64 encoding a tainted String",
        "class": "java.util.Base64$Encoder",
        "method": "encodeToString:([B)Ljava/lang/String;",
        "input": {
          "location": "arg1",
          "taint": "Tainted String"
        },
        "result": {
          "location": "returnValue",
          "taint": "Tainted String"
        }
      }
  ]
}
