{
  "commandArguments": {
    "entryPoints": [
      "dragonstone.demo.TestCipher.Example1",
      "dragonstone.demo.TestCipher.Example2",
      "dragonstone.demo.TestCipher.Example3",
      "dragonstone.demo.TestCipher.Example4",
      "dragonstone.demo.TestCipher.Example6",
      "dragonstone.demo.TestCipher.Example7",
      "dragonstone.demo.TestCipher.Example8",
      "dragonstone.demo.TestCipher.LongExample"
    ],
    "timeout": 2,
    "unwind": 1000000
  },
  "onlyShowNewIssues": true
}
