<?xml version="1.0" encoding="utf-8"?>
<!-- Generator: Adobe Illustrator 22.0.1, SVG Export Plug-In . SVG Version: 6.00 Build 0)  -->
<svg version="1.1" id="Layer_1" xmlns="http://www.w3.org/2000/svg" xmlns:xlink="http://www.w3.org/1999/xlink" x="0px" y="0px"
	 viewBox="0 0 223 228.4" style="enable-background:new 0 0 223 228.4;" xml:space="preserve">
<style type="text/css">
	.st0{fill:none;stroke:#000000;stroke-width:21;stroke-miterlimit:10;}
	.st1{fill:#ECECEC;}
	.st2{fill:#F4ECD3;}
	.st3{fill:#F27149;}
	.st4{fill:#EF4E23;}
	.st5{fill:#221F1F;}
	.st6{fill:#F8DA02;}
</style>
<g>
	<path class="st0" d="M45.9,192.9"/>
	<g>
		<path class="st1" d="M67.2,202.4c0.2-0.1,0.3-0.2,0.4-0.3c0.1-0.2,0.1-0.4,0-0.5c-0.1-0.2-0.2-0.3-0.3-0.4l-6.1-3.2
			c-0.2-0.1-0.4-0.1-0.5-0.1c-0.2,0.1-0.3,0.2-0.4,0.3c-0.1,0.2-0.1,0.4-0.1,0.5c0.1,0.2,0.2,0.3,0.3,0.4l2.4,1.3l-4.3,8.2
			c-0.1,0.2-0.1,0.4-0.1,0.5c0.1,0.2,0.2,0.3,0.3,0.4c0.1,0.1,0.2,0.1,0.3,0.1c0.1,0,0.1,0,0.2,0c0.2-0.1,0.3-0.2,0.4-0.3l4.3-8.2
			l2.4,1.3C66.9,202.4,67.1,202.4,67.2,202.4z"/>
		<path class="st1" d="M75.2,206.1c0.2,0.1,0.4,0.1,0.5,0c0.2-0.1,0.3-0.2,0.4-0.4c0.1-0.2,0.1-0.4,0-0.5c-0.1-0.2-0.2-0.3-0.4-0.4
			l-5.5-2.3c-0.2-0.1-0.4-0.1-0.5,0c-0.2,0.1-0.3,0.2-0.4,0.4l-3.8,9.2c-0.1,0.2-0.1,0.4,0,0.5c0.1,0.2,0.2,0.3,0.4,0.4l5.5,2.3
			c0.1,0,0.2,0.1,0.3,0.1c0.1,0,0.2,0,0.3-0.1c0.2-0.1,0.3-0.2,0.4-0.4c0.1-0.2,0.1-0.4,0-0.5c-0.1-0.2-0.2-0.3-0.4-0.4l-4.9-2.1
			l1.4-3.3l3.6,1.5c0.2,0.1,0.4,0.1,0.5,0c0.2-0.1,0.3-0.2,0.4-0.4c0.1-0.2,0.1-0.4,0-0.5c-0.1-0.2-0.2-0.3-0.4-0.4l-3.6-1.5
			l1.4-3.3L75.2,206.1z"/>
		<path class="st1" d="M82.4,207l-3.3-1c-0.2-0.1-0.4,0-0.5,0c-0.2,0.1-0.3,0.2-0.3,0.4l-2.9,9.5c-0.1,0.2,0,0.4,0.1,0.5
			c0.1,0.2,0.2,0.3,0.4,0.3c0.2,0.1,0.4,0,0.5,0c0.2-0.1,0.3-0.2,0.3-0.4l1.2-4.1l2,0.6l0.8,5.1c0,0.3,0.2,0.5,0.5,0.6
			c0.1,0,0.1,0,0.2,0c0,0,0.1,0,0.1,0c0.2,0,0.3-0.1,0.5-0.3c0.1-0.2,0.2-0.3,0.1-0.5l-0.7-4.5c0.7,0,1.3-0.1,1.9-0.5
			c0.7-0.4,1.2-1,1.4-1.7c0.3-0.8,0.2-1.7-0.3-2.5C84,207.8,83.3,207.3,82.4,207z M83.4,210.6c-0.1,0.5-0.4,0.8-0.9,1
			c-0.5,0.2-1,0.3-1.5,0.1l-2.7-0.8l1-3.4l2.6,0.8c0.5,0.2,0.9,0.5,1.2,0.9C83.5,209.7,83.6,210.2,83.4,210.6z"/>
		<path class="st1" d="M96.3,220.2l-4.6-0.7l1.5-9.1c0-0.2,0-0.4-0.1-0.5c-0.1-0.2-0.3-0.3-0.5-0.3h0c-0.2,0-0.4,0-0.5,0.1
			c-0.2,0.1-0.2,0.3-0.3,0.5l-1.6,9.8c0,0.2,0,0.4,0.1,0.5c0.1,0.1,0.3,0.2,0.5,0.3l5.3,0.8c0,0,0.1,0,0.1,0c0.1,0,0.3,0,0.4-0.1
			c0.2-0.1,0.3-0.3,0.3-0.5c0-0.2,0-0.4-0.1-0.5C96.7,220.3,96.5,220.2,96.3,220.2z"/>
		<path class="st1" d="M107.5,211.2c-0.2,0-0.4,0-0.5,0.2c-0.1,0.1-0.2,0.3-0.2,0.5l-0.4,6.7c0,0.7-0.3,1.3-0.9,1.8
			c-0.5,0.5-1.2,0.7-1.9,0.6c-0.7,0-1.3-0.3-1.8-0.9c-0.5-0.5-0.7-1.2-0.6-1.9l0.4-6.7c0-0.2,0-0.4-0.2-0.5
			c-0.1-0.1-0.3-0.2-0.5-0.2c-0.2,0-0.4,0-0.5,0.2c-0.1,0.1-0.2,0.3-0.2,0.5l-0.4,6.7c-0.1,1.1,0.3,2.1,1,2.9
			c0.7,0.8,1.6,1.3,2.7,1.3c0.1,0,0.2,0,0.3,0c1,0,1.8-0.3,2.6-1c0.8-0.7,1.3-1.6,1.3-2.7l0.4-6.7c0-0.2,0-0.4-0.2-0.5
			C107.9,211.3,107.7,211.2,107.5,211.2z"/>
		<path class="st1" d="M118.9,211c-0.2-0.1-0.3-0.2-0.5-0.1c-0.2,0-0.3,0.1-0.5,0.3l-3.1,4.2l-3.4-4c-0.1-0.1-0.3-0.2-0.5-0.2
			c-0.2,0-0.4,0-0.5,0.2c-0.1,0.1-0.2,0.3-0.2,0.5c0,0.2,0.1,0.4,0.2,0.5l3.9,4.5l0.2,4.9c0,0.2,0.1,0.4,0.2,0.5
			c0.1,0.1,0.3,0.2,0.5,0.2c0,0,0,0,0,0c0.2,0,0.4-0.1,0.5-0.2c0.1-0.1,0.2-0.3,0.2-0.5l-0.2-4.9l3.5-4.8c0.1-0.1,0.2-0.3,0.1-0.5
			C119.2,211.3,119.1,211.2,118.9,211L118.9,211z"/>
		<path class="st1" d="M130.8,214.2c-0.2-0.1-0.3-0.2-0.5-0.1l-4.2,0.6c-0.2,0-0.4,0.1-0.5,0.3c-0.1,0.2-0.2,0.3-0.1,0.5
			c0,0.2,0.1,0.4,0.3,0.5c0.2,0.1,0.3,0.1,0.5,0.1l3.5-0.5l0.4,2.8c-0.7,0.8-1.5,1.2-2.6,1.4c-1.2,0.2-2.2-0.1-3.2-0.8
			c-0.9-0.7-1.5-1.6-1.7-2.8s0.1-2.2,0.8-3.2c0.7-1,1.6-1.5,2.8-1.7c0.9-0.1,1.9,0,2.7,0.5c0.2,0.1,0.4,0.1,0.5,0.1
			c0.2-0.1,0.3-0.2,0.4-0.3c0.1-0.2,0.1-0.4,0.1-0.5c-0.1-0.2-0.2-0.3-0.3-0.4c-1.1-0.6-2.3-0.8-3.6-0.6c-1.5,0.2-2.8,1-3.7,2.3
			c-0.9,1.3-1.3,2.7-1,4.2c0.2,1.5,1,2.8,2.3,3.7c1,0.7,2.1,1.1,3.3,1.1c0.3,0,0.6,0,0.9-0.1c1-0.2,1.9-0.5,2.6-1.1
			c0,0.2,0.1,0.3,0.3,0.4l0,0c0.2,0.1,0.3,0.2,0.5,0.1c0.2,0,0.4-0.1,0.5-0.3c0.1-0.2,0.2-0.3,0.1-0.5l-0.8-5.2
			C131.1,214.5,131,214.3,130.8,214.2z"/>
		<path class="st1" d="M141.2,207.2c-0.1-0.2-0.2-0.3-0.3-0.4c-0.2-0.1-0.4-0.1-0.5-0.1c-0.2,0.1-0.3,0.2-0.4,0.3
			c-0.1,0.2-0.1,0.3-0.1,0.5l1.1,4.1l-5.5,1.5l-1.1-4.1c-0.1-0.2-0.2-0.3-0.3-0.4c-0.2-0.1-0.4-0.1-0.5-0.1
			c-0.2,0.1-0.3,0.2-0.4,0.3c-0.1,0.2-0.1,0.4-0.1,0.5l2.6,9.6c0.1,0.2,0.2,0.3,0.3,0.4c0.1,0.1,0.2,0.1,0.4,0.1c0.1,0,0.1,0,0.2,0
			c0.2-0.1,0.3-0.2,0.4-0.3c0.1-0.2,0.1-0.3,0.1-0.5l-1.1-4.1l5.5-1.5l1.1,4.1c0.1,0.2,0.2,0.3,0.3,0.4c0.2,0.1,0.4,0.1,0.5,0.1v0
			c0.2-0.1,0.3-0.2,0.4-0.3c0.1-0.2,0.1-0.4,0.1-0.5L141.2,207.2z"/>
		<path class="st1" d="M154.1,212.4c-0.2-0.1-0.4-0.1-0.5,0l-4.9,2l-1.3-3.3l3.6-1.4c0.2-0.1,0.3-0.2,0.4-0.4c0.1-0.2,0.1-0.4,0-0.5
			c-0.1-0.2-0.2-0.3-0.4-0.4c-0.2-0.1-0.4-0.1-0.5,0l-3.6,1.4l-1.3-3.3l4.9-1.9c0.2-0.1,0.3-0.2,0.4-0.4c0.1-0.2,0.1-0.4,0-0.5
			c-0.1-0.2-0.2-0.3-0.4-0.4c-0.2-0.1-0.4-0.1-0.5,0l-5.6,2.2c-0.2,0.1-0.3,0.2-0.4,0.4c-0.1,0.2-0.1,0.4,0,0.5l3.6,9.3
			c0.1,0.2,0.2,0.3,0.4,0.4c0.1,0,0.2,0.1,0.3,0.1c0.1,0,0.2,0,0.3,0l5.6-2.2c0.2-0.1,0.3-0.2,0.4-0.4c0.1-0.2,0.1-0.4,0-0.5
			C154.4,212.6,154.3,212.5,154.1,212.4z"/>
		<path class="st1" d="M167.4,206.1l-4.7-8.8c-0.2-0.3-0.4-0.4-0.8-0.3c-0.3,0.1-0.5,0.3-0.5,0.7L161,206l-7.1-4.2
			c-0.3-0.2-0.6-0.1-0.8,0.1c-0.2,0.2-0.3,0.5-0.1,0.8l4.7,8.8c0.1,0.2,0.2,0.3,0.4,0.4c0.1,0,0.1,0,0.2,0c0.1,0,0.2,0,0.3-0.1
			c0.2-0.1,0.3-0.2,0.3-0.4c0-0.2,0-0.4-0.1-0.5l-3.5-6.5l5.7,3.4l-0.3,0.1l0.7,0.1l0,0.1l0.2-0.1c0,0,0,0,0,0c0,0,0,0,0.1,0
			c0,0,0.1,0,0.1,0c0,0,0,0,0,0c0,0,0.1,0,0.1,0c0,0,0,0,0.1-0.1c0,0,0,0,0,0c0,0,0,0,0.1,0c0,0,0,0,0,0c0,0,0,0,0,0c0,0,0,0,0-0.1
			l0.1-0.2l0,0l0-0.1l0,0l0.3-6.9l3.5,6.5c0.1,0.2,0.2,0.3,0.4,0.3c0.2,0,0.4,0,0.5-0.1c0.2-0.1,0.3-0.2,0.3-0.4
			C167.5,206.5,167.5,206.3,167.4,206.1z"/>
		<path class="st1" d="M64.2,191.6L64.2,191.6C64.2,191.7,64.2,191.7,64.2,191.6C64.2,191.7,64.2,191.7,64.2,191.6
			c0,0.1,0,0.1,0,0.1c0,0,0,0,0,0c0,0,0,0,0,0l0,0l0,0c0,0,0,0,0,0c0,0,0,0,0,0c0,0,0,0,0,0c0,0,0,0,0,0c0,0,0,0,0,0c0,0,0,0,0,0
			c0,0,0,0,0,0l0,0l0,0c0,0,0,0,0,0c0,0,0,0,0,0c0,0,0,0,0,0c0,0,0,0,0,0c0,0,0,0,0.1,0c0,0,0,0,0,0c0,0,0,0,0,0c0,0,0,0,0,0
			c0,0,0,0,0,0l5.4-4.6c0.1-0.1,0.1-0.1,0.1-0.2c0-0.1,0-0.2-0.1-0.2c-0.1-0.1-0.1-0.1-0.1-0.1s0,0-0.1,0c-0.1,0-0.2,0-0.2,0.1
			l-4.8,4l1.2-6.1c0-0.1,0-0.2,0-0.2c0-0.1-0.1-0.1-0.2-0.1c-0.1,0-0.2,0-0.2,0c-0.1,0-0.1,0.1-0.1,0.2L64.2,191.6
			C64.2,191.5,64.2,191.5,64.2,191.6C64.2,191.6,64.2,191.6,64.2,191.6C64.2,191.6,64.2,191.6,64.2,191.6L64.2,191.6z"/>
		<path class="st1" d="M69.9,192.5l-1.4,1.2c-0.1,0.1-0.1,0.1-0.1,0.2c0,0.1,0,0.2,0.1,0.2c0,0,0,0,0,0s0,0,0.1,0
			c0.1,0.1,0.2,0,0.3,0l1.2-1.1l3.3,1.6l-0.1,1.6c0,0.1,0,0.2,0.2,0.3c0,0,0.1,0,0.1,0c0.1,0,0.2,0,0.2-0.1c0.1-0.1,0.1-0.1,0.1-0.2
			l0.1-1.9l0,0l0.3-5.4c0,0,0,0,0-0.1c0,0,0,0,0,0c0,0,0,0,0,0c0,0,0,0,0,0l0,0c0,0,0-0.1-0.1-0.1c0,0,0,0,0,0c0,0,0,0,0,0
			c0,0,0,0,0,0l0,0c0,0-0.1,0-0.1,0c0,0,0,0,0,0c0,0,0,0,0,0c0,0,0,0,0,0l0,0c0,0,0,0,0,0L69.9,192.5L69.9,192.5z M73.8,189.9
			l-0.2,4.2l-2.9-1.4L73.8,189.9z"/>
		<path class="st1" d="M76.3,197.7c0.1,0,0.2,0,0.2,0c0.1,0,0.1-0.1,0.2-0.2l0.7-1.8l1.2-0.6l1.7,4c0,0.1,0.1,0.1,0.2,0.2
			c0.1,0,0.2,0,0.2,0c0.1,0,0.1-0.1,0.2-0.2c0-0.1,0-0.2,0-0.2l-1.7-4.1l3.8-1.8c0.1,0,0.1-0.1,0.2-0.2c0-0.1,0-0.2,0-0.2
			s-0.1-0.1-0.2-0.2c-0.1,0-0.2,0-0.2,0l-5,2.4l1.4-3.6c0-0.1,0-0.2,0-0.2c0-0.1-0.1-0.1-0.2-0.2c-0.1,0-0.2,0-0.2,0
			c-0.1,0-0.1,0.1-0.2,0.2l-2.4,6.2c0,0.1,0,0.2,0,0.2C76.1,197.7,76.2,197.7,76.3,197.7z"/>
		<path class="st1" d="M88.3,199.6l-0.6-5.4c0,0,0,0,0-0.1c0,0,0,0,0,0c0,0,0,0,0,0c0,0,0,0,0,0l0,0c0,0-0.1-0.1-0.1-0.1
			c0,0,0,0,0,0c0,0,0,0,0,0c0,0,0,0,0,0l0,0c0,0-0.1,0-0.1,0c0,0,0,0,0,0c0,0,0,0,0,0c0,0,0,0,0,0l0,0c0,0,0,0,0,0l-3.4,4.2l0,0
			l-1.2,1.5c-0.1,0.1-0.1,0.1-0.1,0.2c0,0.1,0,0.2,0.1,0.2c0,0,0,0,0,0s0,0,0.1,0c0.1,0,0.2,0,0.3-0.1l1-1.3l3.6,1l0.2,1.6
			c0,0.1,0.1,0.2,0.2,0.3c0,0,0.1,0,0.1,0c0.1,0,0.2,0,0.2-0.1c0.1-0.1,0.1-0.1,0.1-0.2L88.3,199.6L88.3,199.6z M84.6,198.3l2.6-3.3
			l0.5,4.2L84.6,198.3z"/>
		<path class="st1" d="M97.4,196.2c-0.1,0-0.2,0-0.2,0.1c-0.1,0-0.1,0.1-0.1,0.2l-1.1,5.7l-3.5-6.8c-0.1-0.1-0.2-0.2-0.3-0.2
			c-0.1,0-0.2,0.1-0.3,0.2l-1.2,6.6c0,0.1,0,0.2,0.1,0.2c0,0.1,0.1,0.1,0.2,0.1c0.1,0,0.2,0,0.2-0.1c0.1,0,0.1-0.1,0.1-0.2l1.1-5.7
			l3.5,6.8l0,0l0,0c0,0,0,0,0,0s0,0,0,0c0,0,0,0,0,0c0,0,0,0,0,0c0,0,0,0,0,0c0,0,0,0,0,0l0,0c0,0,0,0,0.1,0c0,0,0,0,0.1,0
			c0,0,0,0,0,0c0,0,0,0,0,0c0,0,0,0,0,0c0,0,0,0,0,0c0,0,0,0,0,0c0,0,0,0,0,0c0,0,0,0,0,0c0,0,0,0,0,0c0,0,0,0,0,0c0,0,0,0,0,0
			c0,0,0,0,0,0c0,0,0,0,0,0c0,0,0,0,0,0c0,0,0,0,0,0c0,0,0,0,0,0c0,0,0,0,0,0l1.2-6.6c0-0.1,0-0.2,0-0.2
			C97.6,196.2,97.5,196.2,97.4,196.2z"/>
		<path class="st1" d="M100.9,203.7c0,0.1,0,0.2,0.1,0.2c0.1,0.1,0.1,0.1,0.2,0.1c0.1,0,0.2,0,0.2-0.1c0.1-0.1,0.1-0.1,0.1-0.2
			l0.7-6.4l2,0.2c0.1,0,0.2,0,0.2-0.1c0.1-0.1,0.1-0.1,0.1-0.2c0-0.1,0-0.2-0.1-0.2c-0.1-0.1-0.1-0.1-0.2-0.1l-4.6-0.5
			c-0.1,0-0.2,0-0.2,0.1c-0.1,0.1-0.1,0.1-0.1,0.2c0,0.1,0,0.2,0.1,0.2c0.1,0.1,0.1,0.1,0.2,0.1l2,0.2L100.9,203.7z"/>
		<path class="st1" d="M106,204.4c0.1,0,0.2,0,0.2-0.1c0.1-0.1,0.1-0.1,0.1-0.2l0.3-6.7c0-0.1,0-0.2-0.1-0.2
			c-0.1-0.1-0.1-0.1-0.2-0.1c-0.1,0-0.2,0-0.2,0.1c-0.1,0.1-0.1,0.1-0.1,0.2l-0.3,6.7c0,0.1,0,0.2,0.1,0.2
			C105.9,204.4,105.9,204.4,106,204.4z"/>
		<path class="st1" d="M113.8,204.4c0.1-0.1,0.1-0.1,0.1-0.2c0-0.1,0-0.2-0.1-0.2c-0.1-0.1-0.1-0.1-0.2-0.1l-3.7,0.1l0-2.8l2.8,0
			c0.1,0,0.2,0,0.2-0.1c0.1-0.1,0.1-0.1,0.1-0.2c0-0.1,0-0.2-0.1-0.2c-0.1-0.1-0.1-0.1-0.2-0.1l-2.8,0l0-2.8l3.7-0.1
			c0.1,0,0.2,0,0.2-0.1c0.1-0.1,0.1-0.1,0.1-0.2c0-0.1,0-0.2-0.1-0.2c-0.1-0.1-0.1-0.1-0.2-0.1l-4,0.1c-0.1,0-0.2,0-0.2,0.1
			c-0.1,0.1-0.1,0.1-0.1,0.2l0.1,6.7c0,0.1,0,0.2,0.1,0.2c0.1,0.1,0.1,0.1,0.2,0.1l4-0.1C113.7,204.5,113.7,204.5,113.8,204.4z"/>
		<path class="st1" d="M122.9,203.6C122.9,203.6,122.9,203.6,122.9,203.6C123,203.6,123,203.6,122.9,203.6
			C123,203.6,123,203.6,122.9,203.6L122.9,203.6C123,203.6,123,203.6,122.9,203.6c0.1,0.1,0.1,0.1,0.1,0.1c0,0,0,0,0,0c0,0,0,0,0,0
			c0,0,0,0,0,0c0,0,0,0,0,0c0,0,0,0,0,0c0,0,0,0,0,0c0,0,0,0,0,0c0,0,0,0,0,0c0,0,0,0,0,0c0,0,0,0,0,0c0,0,0,0,0,0c0,0,0,0,0,0
			c0,0,0,0,0,0l0,0c0,0,0,0,0,0c0,0,0,0,0,0c0,0,0,0,0,0c0,0,0,0,0,0c0,0,0,0,0,0l0,0l0,0c0,0,0,0,0,0c0,0,0,0,0,0c0,0,0,0,0,0
			l1.6-7c0-0.1,0-0.2,0-0.2c0-0.1-0.1-0.1-0.2-0.1c-0.1,0-0.1,0-0.1,0s0,0-0.1,0.1c-0.1,0-0.1,0.1-0.1,0.2l-1.4,6.1l-2.7-5.7
			c0,0,0,0,0,0c0,0,0,0,0,0c0,0,0,0,0,0c0,0,0,0,0,0c0,0,0,0,0,0c0,0,0,0,0,0c0,0,0,0,0,0c0,0,0,0,0,0c0,0,0,0,0,0c0,0,0,0,0,0l0,0
			c0,0,0,0,0,0c0,0,0,0,0,0c0,0,0,0,0,0c0,0,0,0,0,0c0,0,0,0,0,0c0,0,0,0,0,0c0,0,0,0,0,0c0,0,0,0,0,0c0,0,0,0,0,0c0,0,0,0,0,0
			c0,0,0,0,0,0c0,0,0,0,0,0c0,0,0,0,0,0c0,0,0,0,0,0c0,0,0,0,0,0c0,0,0,0,0,0c0,0,0,0,0,0c0,0,0,0,0,0l-1.4,6.1l-2.7-5.7
			c0-0.1-0.1-0.1-0.2-0.2c-0.1,0-0.2,0-0.2,0c-0.1,0-0.1,0.1-0.2,0.2c0,0.1,0,0.2,0,0.2l3.1,6.4c0,0,0,0,0,0c0,0,0,0,0,0
			c0,0,0,0,0,0l0,0c0,0,0,0,0,0c0,0,0,0,0,0c0,0,0,0,0,0c0,0,0,0,0,0c0,0,0,0,0,0c0,0,0,0,0,0l0,0l0,0c0,0,0,0,0,0c0,0,0,0,0,0
			c0,0,0,0,0,0c0,0,0,0,0,0c0,0,0,0,0,0c0,0,0,0,0,0c0,0,0,0,0,0l0,0l0,0c0,0,0,0,0,0c0,0,0,0,0,0c0,0,0,0,0,0c0,0,0,0,0,0
			c0,0,0,0,0,0l0,0l0,0c0,0,0,0,0,0c0,0,0,0,0,0c0,0,0,0,0,0l1.4-6.1L122.9,203.6C122.9,203.5,122.9,203.6,122.9,203.6z"/>
		<path class="st1" d="M128.6,201.7c0.9,0.5,1.8,0.7,2.8,0.5c1-0.2,1.7-0.8,2.3-1.6s0.7-1.8,0.5-2.8c-0.2-1-0.8-1.7-1.6-2.3
			c-0.9-0.5-1.8-0.7-2.8-0.5c-1,0.2-1.7,0.8-2.3,1.6c-0.5,0.9-0.7,1.8-0.5,2.8C127.2,200.4,127.8,201.2,128.6,201.7z M128,197
			c0.4-0.7,1.1-1.2,1.9-1.4c0.8-0.2,1.6-0.1,2.3,0.4c0.7,0.4,1.2,1.1,1.4,1.9c0.2,0.8,0.1,1.6-0.4,2.3c-0.4,0.7-1.1,1.2-1.9,1.4
			c-0.8,0.2-1.6,0.1-2.3-0.4c-0.7-0.4-1.2-1.1-1.4-1.9C127.4,198.5,127.5,197.7,128,197z"/>
		<path class="st1" d="M137.5,200.3c0,0.1,0.1,0.1,0.2,0.2c0.1,0,0.2,0,0.2,0c0.1,0,0.1-0.1,0.2-0.2c0-0.1,0-0.2,0-0.2l-1.9-5.5
			l6.3,4.2l0,0l0,0c0,0,0,0,0,0s0,0,0,0c0,0,0,0,0,0c0,0,0,0,0,0c0,0,0,0,0,0c0,0,0,0,0,0l0,0c0,0,0,0,0.1,0c0,0,0,0,0.1,0
			c0,0,0,0,0,0c0,0,0,0,0,0c0,0,0,0,0,0c0,0,0,0,0,0c0,0,0,0,0,0c0,0,0,0,0,0c0,0,0,0,0,0c0,0,0,0,0,0c0,0,0,0,0,0c0,0,0,0,0,0
			c0,0,0,0,0,0c0,0,0,0,0,0c0,0,0,0,0,0c0,0,0,0,0,0c0,0,0,0,0,0c0,0,0,0,0,0l-2.2-6.4c0-0.1-0.1-0.1-0.2-0.2c-0.1,0-0.2,0-0.2,0
			c-0.1,0-0.1,0.1-0.2,0.2c0,0.1,0,0.2,0,0.2l1.9,5.5l-6.3-4.2c-0.1-0.1-0.2-0.1-0.4,0c-0.1,0.1-0.1,0.2-0.1,0.3L137.5,200.3z"/>
		<path class="st1" d="M145.7,197.5c0.1,0,0.2,0,0.2,0c0.1,0,0.1-0.1,0.2-0.2c0-0.1,0-0.2,0-0.2l-2.6-6.2c0-0.1-0.1-0.1-0.2-0.2
			c-0.1,0-0.2,0-0.2,0c-0.1,0-0.1,0.1-0.2,0.2c0,0.1,0,0.2,0,0.2l2.6,6.2C145.6,197.4,145.7,197.5,145.7,197.5z"/>
		<path class="st1" d="M148.8,196c0,0.1,0.1,0.1,0.2,0.2c0.1,0,0.2,0,0.2,0c0.1,0,0.1-0.1,0.2-0.2c0-0.1,0-0.2,0-0.2l-2.6-5.2
			l6.8,3.3l0,0l0,0c0,0,0,0,0,0s0,0,0,0c0,0,0,0,0,0c0,0,0,0,0,0c0,0,0,0,0,0c0,0,0,0,0,0l0,0c0,0,0,0,0.1,0c0,0,0,0,0,0
			c0,0,0,0,0,0c0,0,0,0,0,0c0,0,0,0,0,0c0,0,0,0,0,0c0,0,0,0,0,0c0,0,0,0,0,0c0,0,0,0,0,0c0,0,0,0,0,0c0,0,0,0,0,0c0,0,0,0,0,0
			c0,0,0,0,0,0c0,0,0,0,0,0c0,0,0,0,0,0c0,0,0,0,0,0c0,0,0,0,0,0c0,0,0,0,0,0l-3-6c0-0.1-0.1-0.1-0.2-0.2c-0.1,0-0.2,0-0.2,0
			c-0.1,0-0.1,0.1-0.2,0.2c0,0.1,0,0.2,0,0.2l2.6,5.2l-6.8-3.3c-0.1-0.1-0.2,0-0.4,0.1c-0.1,0.1-0.1,0.2-0.1,0.4L148.8,196z"/>
		<path class="st1" d="M156.7,191c1,0.2,1.9,0.1,2.8-0.5c0.6-0.4,1.1-0.9,1.4-1.6l0.2,0.3c0,0.1,0.1,0.1,0.2,0.1c0.1,0,0.2,0,0.2,0
			c0.1,0,0.1-0.1,0.1-0.2c0-0.1,0-0.2,0-0.2l-1.9-3c0-0.1-0.1-0.1-0.2-0.1c-0.1,0-0.2,0-0.2,0l-2.4,1.5c-0.1,0-0.1,0.1-0.1,0.2
			c0,0.1,0,0.2,0,0.2c0,0.1,0.1,0.1,0.2,0.1c0.1,0,0.2,0,0.2,0l2.2-1.4l1.1,1.8c-0.2,0.7-0.6,1.3-1.3,1.7c-0.7,0.4-1.5,0.6-2.3,0.4
			c-0.8-0.2-1.4-0.6-1.9-1.4c-0.4-0.7-0.6-1.5-0.4-2.3c0.2-0.8,0.6-1.5,1.4-1.9c0.6-0.4,1.2-0.5,1.9-0.4c0.1,0,0.2,0,0.2-0.1
			c0.1-0.1,0.1-0.1,0.1-0.2c0-0.1,0-0.2-0.1-0.2c-0.1-0.1-0.1-0.1-0.2-0.1c-0.8-0.1-1.6,0.1-2.3,0.5c-0.9,0.5-1.4,1.3-1.6,2.3
			c-0.2,1-0.1,1.9,0.5,2.8C155,190.2,155.8,190.7,156.7,191z"/>
	</g>
	<g>
		<path class="st2" d="M133.1,48.1c-7,0.2-15.4,2.9-21.1,7.9c-13.2-2.1-30-8.1-42.3-7.8c-15,0.4-23.7,8.2-23.3,21.2
			c0.3,10.5,7.8,16.7,18.5,16.4c4.1-0.1,8.6-1.3,12.6-3.2c0.9-0.5,1.3-1.3,1.3-2.2c0-0.9-0.8-2.4-2.4-2.4c-0.5,0-0.8,0.1-1.1,0.3
			c-3.3,1.6-6.9,2.6-10.4,2.7c-7.9,0.2-13.3-3.6-13.6-11.7c-0.3-9.8,6.6-15.8,18.4-16.1c13-0.3,28.2,5.1,38.3,7.1
			c-0.7,1.1-1.4,2.1-2,3.2c-4.6,8.4-8.3,21.2-10.9,30.7c-7.4,24.3-11,46.8-30.5,47.1c-6.2,0.2-11.5-3-14-8.7c0,0,0,0,0,0
			c-0.6-1.4-1-2.9-1.3-4.5c-0.2-1.4-1.4-2.2-2.7-2c-1.4,0.2-2.2,1.4-2,2.8c0.2,1.7,0.7,3.3,1.3,4.9c0,0,0,0,0,0
			c3,7.6,9.9,12.6,18.9,12.4c20.3-0.2,25.8-16.7,35-50.6c2.6-9.2,6.2-21.9,10.5-29.7c1-1.6,2.1-3.2,3.4-4.6c7.3,1.2,14.4,1.9,20,1.8
			c8-0.2,13.4-2.1,13.5-7.3C147.1,50.4,139.8,47.9,133.1,48.1z M133.6,58.1c-3.8,0.1-9.1-0.3-14.6-1.1c3.8-2.3,9.7-3.9,14.1-4.1
			c3.3-0.1,9.1,1,9.1,2.8C142.3,57.3,139,58,133.6,58.1z"/>
		<path class="st2" d="M207.3,68.3c-5.7-12.5-13.6-23.7-23.5-33.2c-10-9.5-21.5-16.9-34.2-21.9c-13.2-5.2-27.1-7.6-41.4-7.3
			s-28,3.5-40.9,9.4C54.9,21.1,43.8,29,34.3,39c-9.5,10-16.8,21.6-21.8,34.4C7.4,86.6,4.9,100.6,5.3,115c0.8,30.8,14.6,59.4,38.1,79
			c1.2-1.1,2.5-2.2,3.8-3.2c-22.8-18.7-36.3-46.2-37-75.9C8.7,59,52.8,12.3,108.4,10.9s102,42.8,103.5,98.7
			c0.6,22.9-6.6,45.6-20.4,63.8c-2.4,2.6-6.6,4.1-11.1,4.2c-10.4,0.3-21-10.3-30.7-19.6c-3.3-3-6.5-6.1-9.7-8.9
			c2-3.3,3.6-6.9,5.1-10.9c2-5.5,4.4-13.3,7.8-25.5c2-7.6,4.4-16.2,7-23.2c8.1-2.4,16.2-7,16.1-12.4c-0.1-3.7-2.9-6.2-6.9-6.1
			c-5.9,0.2-10.6,7.8-13,14.5l-9.7,1.8c-17.2,3.1-35.7,6.5-37.4,22.6c-0.1,0.6-0.1,1.3-0.1,1.8c0,3.7,1,7.2,3.1,9.8
			c2.1,2.8,5.3,4.7,9.3,5.2c0.5,0.1,1,0.1,1.6,0.1c1.4,0,2.5-1.1,2.5-2.4c0.1-1.4-1-2.5-2.4-2.5l-1.2-0.1c-2.7-0.3-4.6-1.5-6.1-3.3
			c-1.4-1.8-2.2-4.2-2.1-6.8c0-0.5,0-0.9,0.1-1.4c1.4-12.5,18.2-15.6,33.5-18.4c2.3-0.4,4.7-0.8,7-1.3c-2.2,6.6-4.3,14.1-6.1,20.6
			c-4,14.3-5.6,19.4-7.6,25.1c-1.3,3.4-2.7,6.7-4.3,9.6c-5.4-4.4-10.9-7.2-15.8-7.1c-6.7,0.2-12.1,4.9-12.3,13
			c0.2,6.8,4.3,10.4,12.2,10.8c6.1-0.2,12.1-3.3,16-8.2c0.3-0.4,0.7-0.8,1-1.3c2.9,2.5,5.9,5.4,8.9,8.2c10.3,9.8,21.9,21.4,34.1,21
			c4.9-0.1,10-1.7,13.6-4.9c0.3-0.2,0.7-0.4,0.9-0.7c7.2-9.5,12.8-20,16.5-31.2c3.9-11.7,5.6-23.9,5.3-36.3
			C216.3,95.1,213.2,81.2,207.3,68.3z M169.2,75.7c0.9,0,1.6,0.6,1.6,1.6c0,1.8-4,5.3-8.8,6.5C163.8,79.7,166.6,75.7,169.2,75.7z
			 M132.5,151.6c-3,3.7-7.8,6.2-12.4,6.3c-3.9,0.1-7.2-1.5-7.3-6c0.1-4.9,3.5-7.9,7.5-8.1c3.9-0.1,8.3,2.6,13.3,6.3
			C133.2,150.6,132.9,151.1,132.5,151.6z"/>
		<g>
			<path class="st3" d="M31.5,185.2c0,0-9.6,4.6-12.9,1.9c-3.3-2.7-6.4-0.2-7.4-1.7s-0.2-6.2,1.9-9.2s7.3-6,8.6-8.8
				c1.3-2.7,6.7-0.5,8.7-3.2s5.2-2.8,6.8-2.8c1.6,0,9.7,0.9,9.7,3.5c0,2.6-3,8.9-4.5,11.7c-1.5,2.8-7,9.2-7,9.2L31.5,185.2z"/>
			<path class="st3" d="M26,181.7c0,0-5,5.7-7.4,8.2s-3.1,6.2-1.2,8.8s6.2,6,8.7,6.1c2.5,0.2,7,1.2,8.4,0.7c1.4-0.5,8-1,9.5-3.9
				c1.5-2.9,3.7-4,5.7-5.6c2-1.6,3.8-5.3,4.4-8.4c0.6-3,1.8-9.9,0.3-11.6c-1.5-1.7-5.8-6.8-7.5-7.4c-1.7-0.6-6.8,0.3-7.4,0.3
				C38.9,168.9,26,181.7,26,181.7z"/>
			<path class="st4" d="M36.1,186.2c0,0,8.8,5.6,5.9,10.1c-2.9,4.5-2.9,9.5-6.4,8.3c-3.5-1.2-4.7-2.2-7.7-2.9
				c-3-0.7-7.2-2.4-7.9-5.6c-0.7-3.2-1.6-4.7-3.6-7s-0.6-3.2-1.4-6.3c-0.8-3.1,1.3-6.1,2.5-7.6c1.2-1.5,2.1-0.8,3.9-2.6
				c1.8-1.8,5.8,4.6,6.9,4.1C29.5,176.2,31.7,187.4,36.1,186.2z"/>
			<path class="st4" d="M31.2,179.9c0,0-7-7.8-3-11.3s5.3-8.4,8.3-6.3c3.1,2.1,4,3.4,6.7,4.9c2.7,1.5,6.3,4.2,6.1,7.5
				c-0.2,3.2,0.3,5,1.7,7.7s-0.3,3.3-0.3,6.5c0,3.2-2.9,5.6-4.4,6.7c-1.6,1.1-2.3,0.2-4.5,1.5c-2.2,1.3-4.3-6-5.5-5.8
				C35,191.3,35.8,179.9,31.2,179.9z"/>
			<path class="st3" d="M33.9,186.5c-0.2,0.1,0.6,4,0.4,4c-0.2,0-0.9-3-1.1-3c-0.3,0-0.3,1.4-0.5,1.4c-0.3,0-0.2-2.2-0.4-2.2
				c-0.2,0-1.1,4.1-1.4,4.1c-0.2-0.1-0.4-0.6-0.7-0.7c-0.2-0.1-0.4-0.4-0.7-0.5c-0.2-0.1-0.7,0.2-0.9,0c-0.2-0.1-0.9,0.2-1.1,0
				c-0.2-0.1-0.9,0-1.1-0.1c-0.2-0.2,2.5-3.2,2.3-3.4c-0.2-0.2-1.7,0.8-1.9,0.6c-0.1-0.2-1,0-1.1-0.2c-0.1-0.2,3.3-2.1,3.2-2.3
				c-0.1-0.2-3.7,1-3.8,0.7c-0.1-0.2-1.5-0.3-1.6-0.5c0-0.2,0.8-0.8,0.8-1.1c0-0.3-0.5-0.6-0.5-0.9c0-0.3,1.3-0.5,1.3-0.8
				c0-0.3,0.8-0.4,0.8-0.6c0.1-0.2,1.8,0.1,1.9-0.1c0.1-0.2-3.6-2-3.5-2.2c0.1-0.2,0.2-0.7,0.3-0.9c0.1-0.2,0.6-0.5,0.8-0.7
				c0.1-0.2,1-0.1,1.2-0.2c0.2-0.2,2.8,2.2,2.9,2c0.2-0.2,0-0.5,0.2-0.7c0.2-0.1-0.7-1.9-0.5-2c0.2-0.1,1.6,2.6,1.9,2.5
				c0.2-0.1-1.3-4.9-1.1-4.9c0.2-0.1,1.6,4.1,1.8,4.1c0.2,0,0-3.3,0.2-3.3c0.3,0,0.6-1.1,0.9-1.1c0.3,0,0.7,0.2,0.9,0.2
				c0.2,0,0.6,0.4,0.9,0.4c0.2,0.1,0.8-0.3,1-0.2c0.2,0.1-1,3.8-0.8,3.9c0.2,0.1,0.4-0.1,0.6,0.1c0.2,0.1,2-2.1,2.2-1.9
				c0.2,0.1-2,3.1-1.8,3.3c0.2,0.2,2.7-2,2.8-1.9c0.2,0.2,1.9-0.6,2-0.4c0.1,0.2-3.7,3-3.6,3.2c0.1,0.2,1.8-0.5,1.9-0.2
				c0.1,0.2,2.1-0.2,2.2,0.1c0.1,0.2-2.8,1.3-2.7,1.5c0,0.2,0.7,0.3,0.7,0.6c0,0.3,0.5,0.4,0.5,0.7c0,0.3-0.7,0.4-0.7,0.7
				c0,0.3,0.1,0.4,0,0.7c-0.1,0.2-1.4,0-1.5,0.2c-0.1,0.2,3.1,1.7,3,2c-0.1,0.2-0.9,0.2-1.1,0.4c-0.1,0.2-3-1.5-3.2-1.3
				c-0.1,0.2-0.3,0-0.5,0.2c-0.2,0.2,2.9,3.7,2.7,3.8c-0.2,0.2-0.6,0.3-0.8,0.4c-0.2,0.1-1.7-1.6-1.9-1.5c-0.2,0.1,0.6,2.4,0.3,2.5
				C35.9,190.8,34.1,186.5,33.9,186.5z"/>
			<path class="st5" d="M37.7,181.1c0.1,0.2,0.4,0.3,0.4,0.5c0,0.2,0.2,0.4,0.2,0.6c0,0.2-0.6,0.4-0.6,0.6c0,0.2,0.5,0.4,0.5,0.6
				c0,0.2-0.9,0.2-0.9,0.4c0,0.2,0.6,0.6,0.6,0.7c-0.1,0.2-0.8,0-0.9,0.2c-0.1,0.2,0.1,0.4,0,0.6c-0.1,0.2-0.2,0.3-0.3,0.5
				c-0.1,0.1,0.1,0.6,0,0.8c-0.1,0.1-0.3,0.3-0.4,0.4c-0.1,0.1-0.6-0.2-0.8-0.1c-0.2,0.1-0.3,0.2-0.4,0.3c-0.2,0.1-0.4-0.1-0.6-0.1
				c-0.2,0.1,0,1-0.2,1c-0.2,0.1-0.5-0.5-0.7-0.4c-0.2,0-0.3,0.3-0.5,0.3c-0.2,0-0.4,0-0.6,0c-0.2,0-0.4,0.2-0.6,0.2
				c-0.2,0-0.4,0.1-0.6,0c-0.2,0-0.2-0.7-0.4-0.7c-0.2-0.1-0.4,0-0.6-0.1c-0.2-0.1-0.2-0.4-0.4-0.5c-0.2-0.1-0.4,0-0.6-0.1
				c-0.1-0.1-0.3-0.3-0.4-0.4c-0.1-0.1-0.2-0.3-0.3-0.5c-0.1-0.1,0-0.4-0.1-0.6c-0.1-0.2-0.2-0.2-0.3-0.4c-0.1-0.2-0.9,0-1-0.2
				c-0.1-0.2,0.7-0.6,0.6-0.8c-0.1-0.2-0.3-0.3-0.4-0.5c0-0.2,0.1-0.4,0.1-0.6c0-0.2-0.6-0.4-0.6-0.6c0-0.2,0.1-0.4,0.1-0.6
				c0-0.2,0.3-0.3,0.4-0.5c0-0.2,0.1-0.4,0.2-0.5c0.1-0.2,0.5-0.2,0.6-0.3c0.1-0.2,0.2-0.3,0.2-0.5c0.1-0.2,0.3-0.2,0.4-0.4
				c0.1-0.1-0.1-0.6,0-0.7c0.1-0.1,0-0.6,0.2-0.7c0.1-0.1,0.4-0.1,0.6-0.2c0.2-0.1,0.6,0.3,0.8,0.2c0.2-0.1,0.3-0.1,0.5-0.2
				c0.2-0.1,0.2-0.6,0.3-0.7c0.2-0.1,0.4,0.2,0.6,0.2c0.2,0,0.3-0.3,0.5-0.3c0.2,0,0.4,0.5,0.5,0.5c0.2,0,0.4-0.6,0.6-0.6
				c0.2,0,0.3,0.6,0.4,0.6c0.2,0,0.3,0.1,0.5,0.2c0.2,0.1,0.7-0.6,0.8-0.5c0.2,0.1-0.1,0.9,0.1,1c0.2,0.1,0.7-0.4,0.9-0.3
				c0.1,0.1,0.4,0.2,0.5,0.3c0.1,0.1,0,0.6,0.1,0.7c0.1,0.1,0.2,0.3,0.3,0.5c0.1,0.2-0.1,0.5,0,0.6c0.1,0.2,0.1,0.3,0.1,0.5
				C37.2,180.9,37.7,180.9,37.7,181.1z"/>
			<path class="st6" d="M33.3,184.2c-0.1,0-0.1,0-0.2,0c-0.1,0-0.1,0-0.2,0c-0.1,0-0.1,0-0.2,0c-0.1,0-0.1,0-0.2,0
				c-0.1,0-0.1-0.1-0.2-0.1c-0.1,0-0.1,0-0.2,0c-0.1,0-0.1,0-0.2-0.1c-0.1,0-0.1,0-0.2-0.1c-0.1,0-0.1-0.1-0.1-0.2
				c-0.1,0-0.1-0.1-0.1-0.2c0-0.1-0.1-0.1-0.1-0.2c0-0.1-0.2,0-0.2-0.1c0-0.1,0-0.2,0-0.2c0-0.1,0-0.1,0-0.2c0-0.1,0-0.1,0-0.2
				c0-0.1-0.1-0.1-0.1-0.2c0-0.1,0-0.1,0-0.2c0-0.1,0-0.1,0-0.2c0-0.1,0.1-0.1,0.1-0.2c0-0.1,0-0.2,0-0.2c0-0.1,0.1-0.1,0.1-0.2
				c0-0.1,0.1-0.1,0.2-0.1c0-0.1,0.1-0.1,0.1-0.2c0.1,0,0.1-0.1,0.2-0.1c0.1,0,0.1-0.1,0.2-0.1c0.1,0,0.1-0.2,0.1-0.2
				c0.1,0,0.1,0,0.2-0.1c0.1,0,0.1,0,0.2,0c0.1,0,0.1,0,0.2,0c0.1,0,0.1-0.1,0.2-0.1c0.1,0,0.1,0,0.2,0.1c0.1,0,0.1,0.1,0.2,0.1
				c0.1,0,0.1,0,0.2,0c0.1,0,0.1,0.1,0.2,0.1c0.1,0,0.1,0,0.2,0.1c0.1,0,0.1,0.1,0.2,0.1c0,0.1,0,0.1,0.1,0.2c0,0.1,0,0.1,0.1,0.2
				c0,0.1,0.1,0.1,0.1,0.2c0,0.1,0,0.1,0,0.2c0,0.1,0,0.1,0.1,0.2c0,0.1,0.1,0.1,0.1,0.2c0,0.1,0,0.1,0,0.2c0,0.1,0,0.2,0,0.2
				c0,0.1-0.1,0.1-0.1,0.2c0,0.1,0,0.1-0.1,0.2c0,0.1-0.1,0.1-0.2,0.1c0,0.1-0.1,0.1-0.1,0.1c0,0.1-0.1,0.1-0.1,0.2
				c-0.1,0-0.1,0.1-0.1,0.2c-0.1,0-0.1,0-0.2,0.1C33.4,184.1,33.4,184.2,33.3,184.2z"/>
		</g>
	</g>
</g>
</svg>
