27/03/2023,08:01:12,,Invoke SumaPrecios workflow: Assign,Failed,System exception. Retry: 1. Column 'Amazon' does not belong to table DataTable. at Source: Invoke SumaPrecios workflow: Assign
27/03/2023,08:03:06,,Invoke SumaPrecios workflow: Assign,Failed,System exception. Retry: 2. Column 'Amazon' does not belong to table DataTable. at Source: Invoke SumaPrecios workflow: Assign
27/03/2023,08:05:01,,Invoke SumaPrecios workflow: Assign,Failed,System exception. Retry: 3. Column 'Amazon' does not belong to table DataTable. at Source: Invoke SumaPrecios workflow: Assign
27/03/2023,08:06:57,,Invoke SumaPrecios workflow: Assign,Failed,System exception. Retry: 0. Column 'Amazon' does not belong to table DataTable. at Source: Invoke SumaPrecios workflow: Assign
27/03/2023,08:15:20,,Invoke Workflow File: Click 'A  nav-logo-sprites',Failed,System exception. Retry: 1. Invalid UI node. at Source: Invoke Workflow File: Click 'A  nav-logo-sprites'
27/03/2023,08:50:01,,Invoke SumaPrecios workflow: Assign,Failed,"System exception. Retry: 1. Conversion from string ""$11,935.97"" to type 'Integer' is not valid. at Source: Invoke SumaPrecios workflow: Assign"
27/03/2023,08:52:33,,Invoke SumaPrecios workflow: Assign,Failed,"System exception. Retry: 2. Conversion from string ""$11,935.97"" to type 'Integer' is not valid. at Source: Invoke SumaPrecios workflow: Assign"
27/03/2023,08:54:47,,Invoke SumaPrecios workflow: Assign,Failed,"System exception. Retry: 3. Conversion from string ""$11,935.97"" to type 'Integer' is not valid. at Source: Invoke SumaPrecios workflow: Assign"
27/03/2023,08:56:58,,Invoke SumaPrecios workflow: Assign,Failed,"System exception. Retry: 0. Conversion from string ""$11,935.97"" to type 'Integer' is not valid. at Source: Invoke SumaPrecios workflow: Assign"
27/03/2023,09:02:16,,Invoke SumaPrecios workflow: Assign,Failed,"System exception. Retry: 1. Conversion from string ""$398.00"" to type 'Integer' is not valid. at Source: Invoke SumaPrecios workflow: Assign"
27/03/2023,11:39:44,,Invoke Workflow File: Open Browser,Failed,"System exception. Retry: 1. Cannot communicate with the browser, please check the UiPath extension. at Source: Invoke Workflow File: Open Browser"
27/03/2023,11:40:18,,Invoke Workflow File: Type Into 'INPUT  twotabsearchtext...',Failed,System exception. Retry: 2. Invalid UI node. at Source: Invoke Workflow File: Type Into 'INPUT  twotabsearchtext...'
