{
	"format_version": "1.12.0",
	"minecraft:geometry": [
		{
			"description": {
				"identifier": "geometry.pidgeotto",
				"texture_width": 64,
				"texture_height": 64,
				"visible_bounds_width": 4,
				"visible_bounds_height": 2.5,
				"visible_bounds_offset": [0, 0.75, 0]
			},
			"bones": [
				{
					"name": "pidgeotto",
					"pivot": [0, 0, 0]
				},
				{
					"name": "body",
					"parent": "pidgeotto",
					"pivot": [0, 7, -2]
				},
				{
					"name": "torso",
					"parent": "body",
					"pivot": [0, 5.5, 1.75],
					"rotation": [-15, 0, 0],
					"cubes": [
						{"origin": [-3.5, 3, -6], "size": [7, 7, 6], "uv": [0, 0]},
						{"origin": [-3, 3.5, 0], "size": [6, 6, 4], "uv": [32, 3]}
					]
				},
				{
					"name": "wing_left",
					"parent": "torso",
					"pivot": [3.5, 7, -3.75],
					"cubes": [
						{"origin": [3.5, 7, -7.25], "size": [5, 0, 7], "uv": [0, 27]}
					]
				},
				{
					"name": "wing_left2",
					"parent": "wing_left",
					"pivot": [8.5, 7, -0.25],
					"cubes": [
						{"origin": [8.5, 7, -7.25], "size": [5, 0, 7], "inflate": 0.01, "uv": [22, 20]}
					]
				},
				{
					"name": "wing_left3",
					"parent": "wing_left2",
					"pivot": [13.5, 7, -7.25],
					"cubes": [
						{"origin": [13.5, 7, -7.25], "size": [7, 0, 7], "uv": [14, 13]}
					]
				},
				{
					"name": "wing_right",
					"parent": "torso",
					"pivot": [-3.5, 7, -3.75],
					"cubes": [
						{"origin": [-8.5, 7, -7.25], "size": [5, 0, 7], "uv": [0, 20]}
					]
				},
				{
					"name": "wing_right2",
					"parent": "wing_right",
					"pivot": [-8.5, 7, -0.25],
					"cubes": [
						{"origin": [-13.5, 7, -7.25], "size": [5, 0, 7], "inflate": 0.01, "uv": [19, 0]}
					]
				},
				{
					"name": "wing_right3",
					"parent": "wing_right2",
					"pivot": [-13.5, 7, -7.25],
					"cubes": [
						{"origin": [-20.5, 7, -7.25], "size": [7, 0, 7], "uv": [0, 13]}
					]
				},
				{
					"name": "tail",
					"parent": "torso",
					"pivot": [0, 7.6, 4]
				},
				{
					"name": "tail_middle",
					"parent": "tail",
					"pivot": [-0.5, 3.7, -7],
					"cubes": [
						{"origin": [-1, 7.7, 4], "size": [2, 0, 9], "uv": [16, 20]}
					]
				},
				{
					"name": "tail_left",
					"parent": "tail",
					"pivot": [-0.5, 7.6, 4],
					"rotation": [0, 12.5, 0],
					"cubes": [
						{"origin": [-0.5, 7.6, 4], "size": [2, 0, 9], "uv": [12, 20]}
					]
				},
				{
					"name": "tail_right",
					"parent": "tail",
					"pivot": [0.5, 7.6, 4],
					"rotation": [0, -12.5, 0],
					"cubes": [
						{"origin": [-1.5, 7.6, 4], "size": [2, 0, 9], "uv": [8, 20]}
					]
				},
				{
					"name": "tail_left2",
					"parent": "tail",
					"pivot": [0, 7.5, 4],
					"rotation": [0, 27.5, 0],
					"cubes": [
						{"origin": [0, 7.5, 4], "size": [2, 0, 8], "uv": [31, 13]}
					]
				},
				{
					"name": "tail_right2",
					"parent": "tail",
					"pivot": [0, 7.5, 4],
					"rotation": [0, -27.5, 0],
					"cubes": [
						{"origin": [-2, 7.5, 4], "size": [2, 0, 8], "uv": [9, 29]}
					]
				},
				{
					"name": "neck",
					"parent": "torso",
					"pivot": [0, 5.75, -3.75],
					"rotation": [32.5, 0, 0],
					"cubes": [
						{"origin": [-2.5, 5.75, -6.25], "size": [5, 6, 5], "uv": [24, 27]}
					]
				},
				{
					"name": "head",
					"parent": "neck",
					"pivot": [0, 11.75, -3.75],
					"rotation": [-15, 0, 0],
					"cubes": [
						{"origin": [-2.5, 9.25, -6.25], "size": [5, 5, 5], "inflate": 0.01, "uv": [0, 34]}
					]
				},
				{
					"name": "beak",
					"parent": "head",
					"pivot": [0, 11.75, -6.25],
					"rotation": [5, 0, 0],
					"cubes": [
						{"origin": [-1, 10.75, -8.25], "size": [2, 1, 3], "inflate": 0.01, "uv": [39, 21]},
						{"origin": [-0.5, 10.25, -8.25], "size": [1, 1, 0], "uv": [4, 14]}
					]
				},
				{
					"name": "hair",
					"parent": "beak",
					"pivot": [-0.5, 11.5, -6.25],
					"rotation": [5, 0, 0],
					"cubes": [
						{"origin": [2.5, 12.5, -6.25], "size": [0, 2, 1], "pivot": [2.5, 13.5, -6.25], "rotation": [0, 15, 0], "uv": [19, 45]},
						{"origin": [-2.5, 11.5, -6.25], "size": [5, 3, 0], "uv": [0, 45]},
						{"origin": [-2.5, 12.5, -6.25], "size": [0, 2, 1], "pivot": [-2.5, 13.5, -6.25], "rotation": [0, -15, 0], "uv": [22, 45]}
					]
				},
				{
					"name": "hair2",
					"parent": "hair",
					"pivot": [-0.5, 14.5, -6.25],
					"rotation": [-70, 0, 0],
					"cubes": [
						{"origin": [-3, 14.5, -6.25], "size": [6, 3, 2], "inflate": 0.02, "uv": [0, 49]}
					]
				},
				{
					"name": "hair3",
					"parent": "hair2",
					"pivot": [-0.5, 17.5, -6.25],
					"rotation": [-45, 0, 0],
					"cubes": [
						{"origin": [-2.5, 17.5, -6.25], "size": [5, 4, 2], "inflate": 0.02, "uv": [17, 49]}
					]
				},
				{
					"name": "hair4",
					"parent": "hair3",
					"pivot": [-0.5, 21.5, -5.25],
					"rotation": [-40, 0, 0],
					"cubes": [
						{"origin": [-2, 21.5, -5.25], "size": [4, 3, 0], "uv": [10, 45]}
					]
				},
				{
					"name": "hairstrand",
					"parent": "beak",
					"pivot": [-0.5, 11.75, -6.25],
					"rotation": [10, 0, 0],
					"cubes": [
						{"origin": [-0.5, 11.75, -6.25], "size": [1, 1, 0], "uv": [0, 14]}
					]
				},
				{
					"name": "hairstrand2",
					"parent": "hairstrand",
					"pivot": [-0.5, 12.75, -6.25],
					"cubes": [
						{"origin": [-0.5, 12.75, -6.25], "size": [1, 3, 0], "uv": [26, 9]}
					]
				},
				{
					"name": "eye_left",
					"parent": "head",
					"pivot": [0.5, 8.75, -2.75],
					"cubes": [
						{"origin": [0.515, 12.75, -6.265], "size": [2, 1, 2], "inflate": 0.01, "uv": [56, 5]},
						{"origin": [1.01, 11.5, -6.265], "size": [1, 1, 1], "inflate": 0.01, "uv": [26, 7]},
						{"origin": [0.51, 11.25, -6.26], "size": [2, 2, 2], "inflate": 0.01, "uv": [43, 13]}
					]
				},
				{
					"name": "eyelid_left",
					"parent": "eye_left",
					"pivot": [-0.6, 8.75, -2.65],
					"cubes": [
						{"origin": [0.41, 11.25, -6.16], "size": [2, 2, 2], "inflate": 0.02, "uv": [48, 0]}
					]
				},
				{
					"name": "eye_right",
					"parent": "head",
					"pivot": [-0.5, 8.75, -2.75],
					"cubes": [
						{"origin": [-2.51, 11.25, -6.26], "size": [2, 2, 2], "inflate": 0.01, "uv": [38, 42]},
						{"origin": [-2.01, 11.5, -6.265], "size": [1, 1, 1], "inflate": 0.01, "uv": [0, 26]},
						{"origin": [-2.01, 11.5, -6.265], "size": [1, 1, 1], "inflate": 0.01, "uv": [0, 26]},
						{"origin": [-2.515, 12.75, -6.265], "size": [2, 1, 2], "inflate": 0.01, "uv": [56, 8], "mirror": true}
					]
				},
				{
					"name": "eyelid_right",
					"parent": "eye_right",
					"pivot": [-0.4, 8.75, -2.65],
					"cubes": [
						{"origin": [-2.41, 11.25, -6.16], "size": [2, 2, 2], "inflate": 0.02, "uv": [56, 0]}
					]
				},
				{
					"name": "jaw",
					"parent": "head",
					"pivot": [0, 10.5, -6.25],
					"rotation": [-7.5, 0, 0],
					"cubes": [
						{"origin": [-1, 10, -7.75], "size": [2, 1, 2], "uv": [39, 29]}
					]
				},
				{
					"name": "leg_left",
					"parent": "body",
					"pivot": [2.25, 4, -0.25],
					"rotation": [5, 0, 0],
					"cubes": [
						{"origin": [1.25, 2.75, -1.75], "size": [2, 3, 3], "inflate": 0.01, "uv": [30, 38]}
					]
				},
				{
					"name": "leg_left2",
					"parent": "leg_left",
					"pivot": [2.25, 2.75, 0.25],
					"rotation": [-15, 0, 0],
					"cubes": [
						{"origin": [1.75, 0.75, -0.75], "size": [1, 2, 1], "uv": [3, 24]}
					]
				},
				{
					"name": "foot_left",
					"parent": "leg_left2",
					"pivot": [2.25, 0.75, 0.25],
					"rotation": [10, 0, 0],
					"cubes": [
						{"origin": [1.25, -0.07635, -1.98481], "size": [2, 1, 3], "uv": [40, 38]}
					]
				},
				{
					"name": "toe_back_left",
					"parent": "foot_left",
					"pivot": [2.25, 0.92365, 1.01519],
					"cubes": [
						{"origin": [1.75, -0.07635, 1.01519], "size": [1, 1, 2], "inflate": 0.01, "uv": [20, 3]}
					]
				},
				{
					"name": "claw_back_left",
					"parent": "toe_back_left",
					"pivot": [2.25, 0.92365, 3.01519],
					"cubes": [
						{"origin": [2.25, -0.07635, 3.01519], "size": [0, 1, 1], "uv": [4, 12]}
					]
				},
				{
					"name": "toe_inner_left",
					"parent": "foot_left",
					"pivot": [2.25, 0.92365, -1.73481],
					"rotation": [0, 12.5, 0],
					"cubes": [
						{"origin": [1.25, -0.07635, -3.73481], "size": [1, 1, 2], "inflate": 0.01, "uv": [20, 0]}
					]
				},
				{
					"name": "claw_inner_left",
					"parent": "toe_inner_left",
					"pivot": [1.75, 0.92365, -3.73481],
					"cubes": [
						{"origin": [1.75, -0.07635, -4.73481], "size": [0, 1, 1], "uv": [0, 12]}
					]
				},
				{
					"name": "toe_outer_left",
					"parent": "foot_left",
					"pivot": [2.25, 0.92365, -1.73481],
					"rotation": [0, -12.5, 0],
					"cubes": [
						{"origin": [2.25, -0.07635, -3.73481], "size": [1, 1, 2], "inflate": 0.01, "uv": [0, 19]}
					]
				},
				{
					"name": "claw_outer_left",
					"parent": "toe_outer_left",
					"pivot": [2.75, 0.92365, -3.73481],
					"cubes": [
						{"origin": [2.75, -0.07635, -4.73481], "size": [0, 1, 1], "uv": [4, 3]}
					]
				},
				{
					"name": "leg_right",
					"parent": "body",
					"pivot": [-2.25, 4, -0.25],
					"rotation": [5, 0, 0],
					"cubes": [
						{"origin": [-3.25, 2.75, -1.75], "size": [2, 3, 3], "inflate": 0.01, "uv": [20, 38]}
					]
				},
				{
					"name": "leg_right2",
					"parent": "leg_right",
					"pivot": [-2.25, 2.75, 0.25],
					"rotation": [-15, 0, 0],
					"cubes": [
						{"origin": [-2.75, 0.75, -0.75], "size": [1, 2, 1], "uv": [0, 22]}
					]
				},
				{
					"name": "foot_right",
					"parent": "leg_right2",
					"pivot": [-2.25, 0.75, 0.25],
					"rotation": [10, 0, 0],
					"cubes": [
						{"origin": [-3.25, -0.07635, -1.98481], "size": [2, 1, 3], "uv": [39, 25]}
					]
				},
				{
					"name": "toe_back_right",
					"parent": "foot_right",
					"pivot": [-2.25, 0.92365, 1.01519],
					"cubes": [
						{"origin": [-2.75, -0.07635, 1.01519], "size": [1, 1, 2], "inflate": 0.01, "uv": [0, 16]}
					]
				},
				{
					"name": "claw_back_right",
					"parent": "toe_back_right",
					"pivot": [-2.25, 0.92365, 3.01519],
					"cubes": [
						{"origin": [-2.25, -0.07635, 3.01519], "size": [0, 1, 1], "uv": [4, 2]}
					]
				},
				{
					"name": "toe_inner_right",
					"parent": "foot_right",
					"pivot": [-2.25, 0.92365, -1.73481],
					"rotation": [0, -12.5, 0],
					"cubes": [
						{"origin": [-2.25, -0.07635, -3.73481], "size": [1, 1, 2], "inflate": 0.01, "uv": [0, 13]}
					]
				},
				{
					"name": "claw_inner_right",
					"parent": "toe_inner_right",
					"pivot": [-1.75, 0.92365, -3.73481],
					"cubes": [
						{"origin": [-1.75, -0.07635, -4.73481], "size": [0, 1, 1], "uv": [0, 3]}
					]
				},
				{
					"name": "toe_outer_right",
					"parent": "foot_right",
					"pivot": [-2.25, 0.92365, -1.73481],
					"rotation": [0, 12.5, 0],
					"cubes": [
						{"origin": [-3.25, -0.07635, -3.73481], "size": [1, 1, 2], "inflate": 0.01, "uv": [0, 3]}
					]
				},
				{
					"name": "claw_outer_right",
					"parent": "toe_outer_right",
					"pivot": [-2.75, 0.92365, -3.73481],
					"cubes": [
						{"origin": [-2.75, -0.07635, -4.73481], "size": [0, 1, 1], "uv": [0, 2]}
					]
				}
			]
		}
	]
}