{
	"format_version": "1.8.0",
	"animations": {
		"animation.sneasel.idle": {
			"loop": true,
			"animation_length": 4,
			"bones": {
				"torso": {
					"rotation": ["-5+0.25*(math.sin(q.anim_time*90*4-90)*1+1)", 0, 0]
				},
				"head": {
					"rotation": [5, 0, 0],
					"position": [0, "0.01*(math.sin(q.anim_time*90*4+45)*1+1)", "+0.02*(math.sin(q.anim_time*90*4+45)*1+1)"]
				},
				"arm_right": {
					"rotation": [0, 0, "-57.5+-.4*(math.sin(q.anim_time*90*4-90)*1+1)"],
					"position": ["-.01*(math.sin(q.anim_time*90*4-90)*1+1)", 0, 0]
				},
				"arm_right2": {
					"rotation": [0, -30, 0]
				},
				"wrist_right": {
					"rotation": [0, 0, -20]
				},
				"claw_right_front": {
					"rotation": [0, 0, "-9+4*(math.sin(q.anim_time*90*2)*1)+4*(math.sin(q.anim_time*90*2/2)*1)"]
				},
				"claw_right_front2": {
					"rotation": [0, 0, -35]
				},
				"claw_right_back": {
					"rotation": [0, 0, "5+6*(math.sin(q.anim_time*90*2)*1)+4*(math.sin(q.anim_time*90*2/2)*1)"]
				},
				"claw_right_back2": {
					"rotation": [0, 0, -20]
				},
				"arm_left": {
					"rotation": [0, 0, "57.5+.4*(math.sin(q.anim_time*90*4-90)*1+1)"],
					"position": ["-.01*(math.sin(q.anim_time*90*4-90)*1+1)", 0, 0]
				},
				"arm_left2": {
					"rotation": [0, 30, 0]
				},
				"claw_left_front": {
					"rotation": [0, 0, "9+-4*(math.sin(q.anim_time*90*2)*1)+4*(math.sin(q.anim_time*90*2/2)*1)"]
				},
				"claw_left_front2": {
					"rotation": [0, 0, 35]
				},
				"claw_left_back": {
					"rotation": [0, 0, "-5+-6*(math.sin(q.anim_time*90*2)*1)+4*(math.sin(q.anim_time*90*2/2)*1)"]
				},
				"claw_left_back2": {
					"rotation": [0, 0, 20]
				},
				"wrist_left": {
					"rotation": [0, 0, 20]
				}
			}
		},
		"animation.sneasel.pose": {
			"loop": true,
			"animation_length": 4,
			"bones": {
				"sneasel": {
					"rotation": [-2.5, -27.5, 1.5]
				},
				"torso": {
					"rotation": ["0.25*(math.sin(q.anim_time*90*4-90)*1+1)", 0, 0],
					"position": [0, "0.05*(math.sin(q.anim_time*90*4+45)*1+1)", 0]
				},
				"head": {
					"rotation": [2.5, 27.5, 0.5],
					"position": [0, "0.02*(math.sin(q.anim_time*90*4+45)*1+1)", "-0.7+0.03*(math.sin(q.anim_time*90*4+45)*1+1)"]
				},
				"arm_right": {
					"rotation": [-53.5, -14.5, "-36+-1*(math.sin(q.anim_time*90*4-90)*1+1)"],
					"position": [0, "-0.5+0.05*(math.sin(q.anim_time*90*4+45)*1+1)", 0]
				},
				"arm_right2": {
					"rotation": [0, -32.5, 0]
				},
				"claw_right_front": {
					"rotation": [0, 0, "-35+4*(math.sin(q.anim_time*90*2)*1)+4*(math.sin(q.anim_time*90*2/2)*1)"]
				},
				"claw_right_front2": {
					"rotation": [0, 0, -30]
				},
				"claw_right_back": {
					"rotation": [0, 0, "-15+3*(math.sin(q.anim_time*90*2)*1)+4*(math.sin(q.anim_time*90*2/2)*1)"]
				},
				"claw_right_back2": {
					"rotation": [0, 0, -27.5]
				},
				"arm_left": {
					"rotation": [13, -11, "47+-1*(math.sin(q.anim_time*90*4-90)*1+1)"],
					"position": [0, "-0.6+0.05*(math.sin(q.anim_time*90*4+45)*1+1)", 0]
				},
				"arm_left2": {
					"rotation": [0, 42.5, 0]
				},
				"claw_left_front": {
					"rotation": [0, 0, "30+4*(math.sin(q.anim_time*90*2)*1)+4*(math.sin(q.anim_time*90*2/2)*1)"]
				},
				"claw_left_front2": {
					"rotation": [0, 0, 15]
				},
				"claw_left_back": {
					"rotation": [0, 0, "12+3*(math.sin(q.anim_time*90*2)*1)+4*(math.sin(q.anim_time*90*2/2)*1)"]
				},
				"claw_left_back2": {
					"rotation": [0, 0, 15]
				},
				"leg_right": {
					"rotation": [7.5, 0, 0]
				},
				"foot_right": {
					"rotation": [-5, 7, -2]
				},
				"leg_left": {
					"rotation": [7.5, 0, 0]
				},
				"foot_left": {
					"rotation": [-5, -9.5, 2.5]
				},
				"wrist_right": {
					"rotation": [-37, -11, -31],
					"position": [0, 0, 0]
				},
				"wrist_left": {
					"rotation": [-24.5, 6.5, 13.5]
				}
			}
		},
		"animation.sneasel.blink": {
			"animation_length": 0.16667,
			"bones": {
				"eyelid_right": {
					"position": {
						"0.0": [-0.1, 0, -0.1],
						"0.125": [-0.1, 0, -0.1],
						"0.1667": [0, 0, 0]
					}
				},
				"eyelid_left": {
					"position": {
						"0.0": [0.1, 0, -0.1],
						"0.125": [0.1, 0, -0.1],
						"0.1667": [0, 0, 0]
					}
				}
			}
		}
	}
}