{
	"format_version": "1.12.0",
	"minecraft:geometry": [
		{
			"description": {
				"identifier": "geometry.electabuzz",
				"texture_width": 64,
				"texture_height": 64,
				"visible_bounds_width": 5,
				"visible_bounds_height": 3.5,
				"visible_bounds_offset": [0, 1.25, 0]
			},
			"bones": [
				{
					"name": "electabuzz",
					"pivot": [0, 0, 0]
				},
				{
					"name": "body",
					"parent": "electabuzz",
					"pivot": [0, 12.5, 0]
				},
				{
					"name": "torso",
					"parent": "body",
					"pivot": [0, 7, -0.5],
					"cubes": [
						{"origin": [-5.5, 7, -3.75], "size": [11, 9, 8], "uv": [0, 13]},
						{"origin": [-4.5, 15.5, -2.75], "size": [9, 3, 6], "uv": [34, 8]}
					]
				},
				{
					"name": "tail",
					"parent": "torso",
					"pivot": [0, 8.5, 4.25],
					"cubes": [
						{"origin": [-1, 7.5, 3], "size": [2, 2, 6], "uv": [0, 54]}
					]
				},
				{
					"name": "tail2",
					"parent": "tail",
					"pivot": [0, 8.5, 8.75],
					"cubes": [
						{"origin": [-1, 7.5, 8], "size": [2, 2, 6], "inflate": 0.01, "uv": [10, 52]}
					]
				},
				{
					"name": "tail3",
					"parent": "tail2",
					"pivot": [0, 8.5, 13.5],
					"cubes": [
						{"origin": [-1, 7.5, 13], "size": [2, 2, 6], "inflate": 0.02, "uv": [20, 50]}
					]
				},
				{
					"name": "tail4",
					"parent": "tail3",
					"pivot": [0, 8.5, 18.5],
					"cubes": [
						{"origin": [-1, 7.5, 18], "size": [2, 2, 6], "inflate": 0.1, "uv": [30, 52]}
					]
				},
				{
					"name": "arms",
					"parent": "torso",
					"pivot": [0, 18, 0]
				},
				{
					"name": "arm_left",
					"parent": "arms",
					"pivot": [4.5, 17, 0],
					"cubes": [
						{"origin": [4, 16, -0.5], "size": [8, 2, 2], "uv": [0, 30]}
					]
				},
				{
					"name": "arm_left2",
					"parent": "arm_left",
					"pivot": [12, 17, 1.5],
					"cubes": [
						{"origin": [12, 15.25, -1.5], "size": [7, 3, 4], "inflate": 0.01, "uv": [0, 38]}
					]
				},
				{
					"name": "arm_fur_left",
					"parent": "arm_left2",
					"pivot": [12.5, 18.4, 0.5],
					"rotation": [0, 0, 20],
					"cubes": [
						{"origin": [9.5, 18.25, -1], "size": [3, 0, 3], "uv": [17, 30]}
					]
				},
				{
					"name": "hand_left",
					"parent": "arm_left2",
					"pivot": [19, 18.25, 1],
					"cubes": [
						{"origin": [19, 16.25, -1.5], "size": [3, 2, 4], "inflate": 0.02, "uv": [22, 38], "mirror": true}
					]
				},
				{
					"name": "fingers_left",
					"parent": "hand_left",
					"pivot": [22, 18.25, 0.5]
				},
				{
					"name": "finger_pinky_left",
					"parent": "fingers_left",
					"pivot": [22, 18.25, 2],
					"cubes": [
						{"origin": [22, 17.25, 1.5], "size": [2, 1, 1], "inflate": 0.01, "uv": [32, 44], "mirror": true}
					]
				},
				{
					"name": "finger_pinky_left2",
					"parent": "finger_pinky_left",
					"pivot": [24, 18.25, 2],
					"cubes": [
						{"origin": [24, 17.25, 1.5], "size": [2, 1, 1], "uv": [37, 43], "mirror": true}
					]
				},
				{
					"name": "finger_ring_left",
					"parent": "fingers_left",
					"pivot": [22, 18.25, 1],
					"cubes": [
						{"origin": [22, 17.25, 0.5], "size": [2, 1, 1], "inflate": 0.01, "uv": [43, 43], "mirror": true}
					]
				},
				{
					"name": "finger_ring_left2",
					"parent": "finger_ring_left",
					"pivot": [24, 18.25, 1],
					"cubes": [
						{"origin": [24, 17.25, 0.5], "size": [2, 1, 1], "uv": [49, 43], "mirror": true}
					]
				},
				{
					"name": "finger_middle_left",
					"parent": "fingers_left",
					"pivot": [22, 18.25, 0],
					"cubes": [
						{"origin": [22, 17.25, -0.5], "size": [2, 1, 1], "inflate": 0.01, "uv": [55, 43], "mirror": true}
					]
				},
				{
					"name": "finger_middle_left2",
					"parent": "finger_middle_left",
					"pivot": [24, 18.25, 0],
					"cubes": [
						{"origin": [24, 17.25, -0.5], "size": [2, 1, 1], "uv": [55, 47], "mirror": true}
					]
				},
				{
					"name": "finger_index_left",
					"parent": "fingers_left",
					"pivot": [22, 18.25, -1],
					"cubes": [
						{"origin": [22, 17.25, -1.5], "size": [2, 1, 1], "inflate": 0.01, "uv": [37, 47], "mirror": true}
					]
				},
				{
					"name": "finger_index_left2",
					"parent": "finger_index_left",
					"pivot": [24, 18.25, -1],
					"cubes": [
						{"origin": [24, 17.25, -1.5], "size": [2, 1, 1], "uv": [43, 47], "mirror": true}
					]
				},
				{
					"name": "thumb_left",
					"parent": "hand_left",
					"pivot": [21, 16.75, -1.25],
					"cubes": [
						{"origin": [20.5, 16.25, -1.75], "size": [2, 1, 1], "inflate": 0.01, "uv": [49, 47], "mirror": true}
					]
				},
				{
					"name": "thumb_left2",
					"parent": "thumb_left",
					"pivot": [22.5, 16.75, -1.75],
					"cubes": [
						{"origin": [22.5, 16.25, -1.75], "size": [1, 1, 1], "uv": [60, 39], "mirror": true}
					]
				},
				{
					"name": "arm_right",
					"parent": "arms",
					"pivot": [-4.5, 17, 0],
					"cubes": [
						{"origin": [-12, 16, -0.5], "size": [8, 2, 2], "uv": [0, 34], "mirror": true}
					]
				},
				{
					"name": "arm_right2",
					"parent": "arm_right",
					"pivot": [-12, 17, 1.5],
					"cubes": [
						{"origin": [-19, 15.25, -1.5], "size": [7, 3, 4], "inflate": 0.01, "uv": [0, 45], "mirror": true}
					]
				},
				{
					"name": "arm_fur_right",
					"parent": "arm_right2",
					"pivot": [-12.5, 18.4, 0.5],
					"rotation": [0, 0, -20],
					"cubes": [
						{"origin": [-12.5, 18.25, -1], "size": [3, 0, 3], "uv": [17, 33], "mirror": true}
					]
				},
				{
					"name": "hand_right",
					"parent": "arm_right2",
					"pivot": [-19, 18.25, 1],
					"cubes": [
						{"origin": [-22, 16.25, -1.5], "size": [3, 2, 4], "inflate": 0.02, "uv": [22, 44]}
					]
				},
				{
					"name": "fingers_right",
					"parent": "hand_right",
					"pivot": [-22, 18.25, 0.5]
				},
				{
					"name": "finger_pinky_right",
					"parent": "fingers_right",
					"pivot": [-22, 18.25, 2],
					"cubes": [
						{"origin": [-24, 17.25, 1.5], "size": [2, 1, 1], "inflate": 0.01, "uv": [32, 46]}
					]
				},
				{
					"name": "finger_pinky_right2",
					"parent": "finger_pinky_right",
					"pivot": [-24, 18.25, 2],
					"cubes": [
						{"origin": [-26, 17.25, 1.5], "size": [2, 1, 1], "uv": [37, 45]}
					]
				},
				{
					"name": "finger_ring_right",
					"parent": "fingers_right",
					"pivot": [-22, 18.25, 1],
					"cubes": [
						{"origin": [-24, 17.25, 0.5], "size": [2, 1, 1], "inflate": 0.01, "uv": [43, 45]}
					]
				},
				{
					"name": "finger_ring_right2",
					"parent": "finger_ring_right",
					"pivot": [-24, 18.25, 1],
					"cubes": [
						{"origin": [-26, 17.25, 0.5], "size": [2, 1, 1], "uv": [49, 45]}
					]
				},
				{
					"name": "finger_middle_right",
					"parent": "fingers_right",
					"pivot": [-22, 18.25, 0],
					"cubes": [
						{"origin": [-24, 17.25, -0.5], "size": [2, 1, 1], "inflate": 0.01, "uv": [55, 45]}
					]
				},
				{
					"name": "finger_middle_right2",
					"parent": "finger_middle_right",
					"pivot": [-24, 18.25, 0],
					"cubes": [
						{"origin": [-26, 17.25, -0.5], "size": [2, 1, 1], "uv": [55, 49]}
					]
				},
				{
					"name": "finger_index_right",
					"parent": "fingers_right",
					"pivot": [-22, 18.25, -1],
					"cubes": [
						{"origin": [-24, 17.25, -1.5], "size": [2, 1, 1], "inflate": 0.01, "uv": [37, 49]}
					]
				},
				{
					"name": "finger_index_right2",
					"parent": "finger_index_right",
					"pivot": [-24, 18.25, -1],
					"cubes": [
						{"origin": [-26, 17.25, -1.5], "size": [2, 1, 1], "uv": [43, 49]}
					]
				},
				{
					"name": "thumb_right",
					"parent": "hand_right",
					"pivot": [-21, 16.75, -1.25],
					"cubes": [
						{"origin": [-22.5, 16.25, -1.75], "size": [2, 1, 1], "inflate": 0.01, "uv": [49, 49]}
					]
				},
				{
					"name": "thumb_right2",
					"parent": "thumb_right",
					"pivot": [-22.5, 16.75, -1.75],
					"cubes": [
						{"origin": [-23.5, 16.25, -1.75], "size": [1, 1, 1], "uv": [60, 41]}
					]
				},
				{
					"name": "head",
					"parent": "torso",
					"pivot": [0, 18.5, 3.25],
					"cubes": [
						{"origin": [-3.5, 18.5, -1.5], "size": [7, 1, 5], "inflate": 0.01, "uv": [38, 17]},
						{"origin": [-3.5, 19.5, -4.5], "size": [7, 5, 8], "inflate": 0.01, "uv": [0, 0]},
						{"origin": [-1.5, 19, -4.502], "size": [3, 1, 0], "inflate": 0.01, "uv": [42, 52]},
						{"origin": [-3, 19.48, -4.5], "size": [6, 0, 3], "uv": [28, 17]}
					]
				},
				{
					"name": "eyes",
					"parent": "head",
					"pivot": [0, 21.25, -4.5]
				},
				{
					"name": "eye_left",
					"parent": "eyes",
					"pivot": [1.9, 21.45, -4.52],
					"rotation": [0, 0, -3],
					"cubes": [
						{"origin": [0.9, 20.45, -4.52], "size": [2, 2, 0], "uv": [0, 0]},
						{"origin": [1.4, 20.7, -4.53], "size": [1, 1, 0], "uv": [0, 5]}
					]
				},
				{
					"name": "eyelid_left",
					"parent": "eye_left",
					"pivot": [1.9, 21.45, -4.42],
					"cubes": [
						{"origin": [0.9, 20.45, -4.42], "size": [2, 2, 1], "inflate": 0.01, "uv": [0, 2]}
					]
				},
				{
					"name": "eye_right",
					"parent": "eyes",
					"pivot": [-1.9, 21.45, -4.52],
					"rotation": [0, 0, 3],
					"cubes": [
						{"origin": [-2.9, 20.45, -4.52], "size": [2, 2, 0], "uv": [0, 0], "mirror": true},
						{"origin": [-2.4, 20.7, -4.53], "size": [1, 1, 0], "uv": [0, 6], "mirror": true}
					]
				},
				{
					"name": "eyelid_right",
					"parent": "eye_right",
					"pivot": [-1.9, 21.45, -4.42],
					"cubes": [
						{"origin": [-2.9, 20.45, -4.42], "size": [2, 2, 1], "inflate": 0.01, "uv": [0, 2], "mirror": true}
					]
				},
				{
					"name": "jaw",
					"parent": "head",
					"pivot": [0, 19.5, -1.5],
					"cubes": [
						{"origin": [-3, 18.5, -4.5], "size": [6, 1, 3], "uv": [46, 2]}
					]
				},
				{
					"name": "teeth",
					"parent": "head",
					"pivot": [0, 19.5, -4.5],
					"cubes": [
						{"origin": [1.5, 19, -4.501], "size": [1, 1, 0], "pivot": [2, 19.5, -4.5], "rotation": [0, 0, 45], "uv": [22, 3]},
						{"origin": [-2.5, 19, -4.501], "size": [1, 1, 0], "pivot": [-2, 19.5, -4.5], "rotation": [0, 0, -45], "uv": [24, 3], "mirror": true}
					]
				},
				{
					"name": "head_side_left",
					"parent": "head",
					"pivot": [4.2, 20.2, 1.85],
					"rotation": [7.5, 0, 0],
					"cubes": [
						{"origin": [0.7, 19.2, -0.55], "size": [4, 2, 4], "pivot": [4.2, 20.2, 1.85], "rotation": [0, -45, 0], "uv": [22, 0]}
					]
				},
				{
					"name": "head_side_right",
					"parent": "head",
					"pivot": [-4.2, 20.2, 1.85],
					"rotation": [7.5, 0, 0],
					"cubes": [
						{"origin": [-4.7, 19.2, -0.55], "size": [4, 2, 4], "pivot": [-4.2, 20.2, 1.85], "rotation": [0, 45, 0], "uv": [34, 2], "mirror": true}
					]
				},
				{
					"name": "antennae",
					"parent": "head",
					"pivot": [0, 15.5, -0.25]
				},
				{
					"name": "antenna_left",
					"parent": "antennae",
					"pivot": [3, 23.5, -0.5],
					"rotation": [0, 0, 40],
					"cubes": [
						{"origin": [2.5, 23.5, -0.5], "size": [1, 3, 0], "uv": [22, 0]},
						{"origin": [2, 26.5, -0.5], "size": [2, 2, 0], "uv": [34, 0]}
					]
				},
				{
					"name": "antenna_right",
					"parent": "antennae",
					"pivot": [-3, 23.5, -0.5],
					"rotation": [0, 0, -40],
					"cubes": [
						{"origin": [-3.5, 23.5, -0.5], "size": [1, 3, 0], "uv": [24, 0], "mirror": true},
						{"origin": [-4, 26.5, -0.5], "size": [2, 2, 0], "uv": [34, 2], "mirror": true}
					]
				},
				{
					"name": "hair",
					"parent": "head",
					"pivot": [0, 24.5, -1.25]
				},
				{
					"name": "hair_top",
					"parent": "hair",
					"pivot": [0, 24.5, -3.25],
					"rotation": [-2.5, 0, 0],
					"cubes": [
						{"origin": [0, 24, -3.25], "size": [0, 4, 2], "uv": [30, 4]}
					]
				},
				{
					"name": "hair_top2",
					"parent": "hair",
					"pivot": [0, 24.5, -1.25],
					"rotation": [-15, 0, 0],
					"cubes": [
						{"origin": [0, 24.5, -1.25], "size": [0, 5, 2], "uv": [30, 8]}
					]
				},
				{
					"name": "legs",
					"parent": "body",
					"pivot": [0, 6.5, 0]
				},
				{
					"name": "leg_left",
					"parent": "legs",
					"pivot": [3.25, 7, -1.25],
					"cubes": [
						{"origin": [1.75, 4.5, -1.25], "size": [3, 3, 3], "uv": [38, 23]}
					]
				},
				{
					"name": "leg_left2",
					"parent": "leg_left",
					"pivot": [3.25, 4.5, -1.25],
					"cubes": [
						{"origin": [1.75, 1.5, -1.25], "size": [3, 3, 3], "uv": [38, 29]}
					]
				},
				{
					"name": "foot_left",
					"parent": "leg_left2",
					"pivot": [3.25, 2, 0.25],
					"cubes": [
						{"origin": [1.25, 0, -3.75], "size": [4, 2, 6], "uv": [24, 30]}
					]
				},
				{
					"name": "claw_left",
					"parent": "foot_left",
					"pivot": [4.5, 2, -3.75],
					"cubes": [
						{"origin": [4.5, 0, -6.75], "size": [0, 2, 3], "uv": [52, 32]}
					]
				},
				{
					"name": "claw_left2",
					"parent": "foot_left",
					"pivot": [2, 2, -3.75],
					"cubes": [
						{"origin": [2, 0, -6.75], "size": [0, 2, 3], "uv": [58, 32]}
					]
				},
				{
					"name": "claw_back_left",
					"parent": "foot_left",
					"pivot": [3.25, 2, 2.25],
					"cubes": [
						{"origin": [3.25, 0, 2.25], "size": [0, 2, 2], "uv": [52, 37]}
					]
				},
				{
					"name": "leg_right",
					"parent": "legs",
					"pivot": [-3.25, 7, -1.25],
					"cubes": [
						{"origin": [-4.75, 4.5, -1.25], "size": [3, 3, 3], "uv": [50, 23], "mirror": true}
					]
				},
				{
					"name": "leg_right2",
					"parent": "leg_right",
					"pivot": [-3.25, 4.5, -1.25],
					"cubes": [
						{"origin": [-4.75, 1.5, -1.25], "size": [3, 3, 3], "uv": [50, 29], "mirror": true}
					]
				},
				{
					"name": "foot_right",
					"parent": "leg_right2",
					"pivot": [-3.25, 2, 0.25],
					"cubes": [
						{"origin": [-5.25, 0, -3.75], "size": [4, 2, 6], "uv": [38, 35], "mirror": true}
					]
				},
				{
					"name": "claw_right",
					"parent": "foot_right",
					"pivot": [-4.5, 2, -3.75],
					"cubes": [
						{"origin": [-4.5, 0, -6.75], "size": [0, 2, 3], "uv": [52, 34], "mirror": true}
					]
				},
				{
					"name": "claw_right2",
					"parent": "foot_right",
					"pivot": [-2, 2, -3.75],
					"cubes": [
						{"origin": [-2, 0, -6.75], "size": [0, 2, 3], "uv": [58, 34], "mirror": true}
					]
				},
				{
					"name": "claw_back_right",
					"parent": "foot_right",
					"pivot": [-3.25, 2, 2.25],
					"cubes": [
						{"origin": [-3.25, 0, 2.25], "size": [0, 2, 2], "uv": [56, 37], "mirror": true}
					]
				}
			]
		}
	]
}