{
	"credit": "Made with Blockbench",
	"textures": {
		"3": "block/maxpotion"
	},
	"elements": [
		{
			"from": [6, 0, 5],
			"to": [10, 2, 11],
			"faces": {
				"north": {"uv": [6, 8, 10, 10], "texture": "#3"},
				"east": {"uv": [16, 8, 10, 10], "texture": "#3"},
				"south": {"uv": [2, 8, 6, 10], "texture": "#3"},
				"west": {"uv": [10, 8, 16, 10], "texture": "#3"},
				"up": {"uv": [8, 10, 12, 16], "texture": "#3"},
				"down": {"uv": [4, 10, 8, 16], "texture": "#3"}
			}
		},
		{
			"from": [6, 2, 6],
			"to": [10, 6, 11],
			"faces": {
				"north": {"uv": [6, 4, 10, 8], "texture": "#3"},
				"east": {"uv": [16, 4, 11, 8], "texture": "#3"},
				"south": {"uv": [2, 4, 6, 8], "texture": "#3"},
				"west": {"uv": [11, 4, 16, 8], "texture": "#3"},
				"up": {"uv": [16, 16, 12, 11], "texture": "#3"},
				"down": {"uv": [9, 5, 5, 10], "texture": "#3"}
			}
		},
		{
			"from": [6.5, 2, 6.5],
			"to": [9.5, 6, 10.5],
			"faces": {
				"north": {"uv": [0, 12, 3, 16], "texture": "#3"},
				"east": {"uv": [0, 12, 4, 16], "texture": "#3"},
				"south": {"uv": [0, 12, 3, 16], "texture": "#3"},
				"west": {"uv": [0, 12, 4, 16], "texture": "#3"},
				"up": {"uv": [0, 12, 3, 16], "texture": "#3"},
				"down": {"uv": [0, 12, 3, 16], "texture": "#3"}
			}
		},
		{
			"from": [6, 6, 5],
			"to": [10, 8, 11],
			"faces": {
				"north": {"uv": [6, 2, 10, 4], "texture": "#3"},
				"east": {"uv": [16, 2, 10, 4], "texture": "#3"},
				"south": {"uv": [2, 2, 6, 4], "texture": "#3"},
				"west": {"uv": [10, 2, 16, 4], "texture": "#3"},
				"up": {"uv": [12, 10, 16, 16], "texture": "#3"},
				"down": {"uv": [8, 10, 12, 16], "texture": "#3"}
			}
		},
		{
			"from": [7, 8, 6],
			"to": [9, 10, 11],
			"faces": {
				"north": {"uv": [7, 0, 9, 2], "texture": "#3"},
				"east": {"uv": [11, 0, 16, 2], "texture": "#3"},
				"south": {"uv": [3, 0, 5, 2], "texture": "#3"},
				"west": {"uv": [11, 0, 16, 2], "texture": "#3"},
				"up": {"uv": [0, 5, 2, 10], "texture": "#3"},
				"down": {"uv": [0, 0, 2, 5], "texture": "#3"}
			}
		}
	],
	"display": {
		"thirdperson_righthand": {
			"translation": [-1.75, 1.75, 0]
		},
		"thirdperson_lefthand": {
			"translation": [-1.75, 1.75, 0]
		},
		"firstperson_righthand": {
			"translation": [0, 4.5, 0]
		},
		"firstperson_lefthand": {
			"translation": [0, 4.5, 0]
		},
		"ground": {
			"translation": [0, 4.5, 0]
		},
		"gui": {
			"rotation": [0, -90, 0],
			"translation": [0, 3.75, 0],
			"scale": [1.25, 1.25, 1.25]
		},
		"head": {
			"translation": [0, 13.5, 0]
		},
		"fixed": {
			"rotation": [0, 90, 0],
			"translation": [0, 3, 0]
		}
	},
	"groups": [
		{
			"name": "Max Potion",
			"origin": [0, 0, 0],
			"color": 0,
			"children": [0, 1, 2, 3, 4]
		}
	]
}