{
	"format_version": "1.12.0",
	"minecraft:geometry": [
		{
			"description": {
				"identifier": "geometry.raboot",
				"texture_width": 64,
				"texture_height": 64,
				"visible_bounds_width": 4,
				"visible_bounds_height": 3.5,
				"visible_bounds_offset": [0, 1.25, 0]
			},
			"bones": [
				{
					"name": "raboot",
					"pivot": [-1.5, 7, 0]
				},
				{
					"name": "body",
					"parent": "raboot",
					"pivot": [0, 0, 0]
				},
				{
					"name": "torso",
					"parent": "body",
					"pivot": [0, 7.6, 0],
					"cubes": [
						{"origin": [-3, 7, -2.5], "size": [6, 7, 5], "uv": [23, 19]}
					]
				},
				{
					"name": "neck",
					"parent": "torso",
					"pivot": [0, 13.5, 0],
					"cubes": [
						{"origin": [-2.5, 13, -2], "size": [5, 3, 4], "uv": [0, 29]}
					]
				},
				{
					"name": "head",
					"parent": "neck",
					"pivot": [0, 15, 0],
					"cubes": [
						{"origin": [-4, 15, -4], "size": [8, 3, 8], "uv": [0, 0]},
						{"origin": [-3.5, 16.5, -3.5], "size": [7, 6, 7], "uv": [0, 11]},
						{"origin": [-1, 18.75, -3.51], "size": [2, 1, 1], "uv": [37, 10]}
					]
				},
				{
					"name": "mouth_open",
					"parent": "head",
					"pivot": [0, 17.75, -3.41],
					"cubes": [
						{"origin": [-1.5, 17.25, -3.41], "size": [3, 1, 0], "uv": [6, 47]}
					]
				},
				{
					"name": "eye_left",
					"parent": "head",
					"pivot": [2.51, 19.25, -2.51],
					"cubes": [
						{"origin": [1.51, 17.75, -3.51], "size": [2, 3, 2], "uv": [28, 46]},
						{"origin": [2.01, 19.5, -3.515], "size": [1, 1, 1], "uv": [0, 24]}
					]
				},
				{
					"name": "eyelid_left",
					"parent": "eye_left",
					"pivot": [2.41, 19.25, -2.41],
					"cubes": [
						{"origin": [1.41, 17.75, -3.41], "size": [2, 3, 2], "inflate": 0.01, "uv": [20, 46]}
					]
				},
				{
					"name": "eye_right",
					"parent": "head",
					"pivot": [-2.51, 19.25, -2.51],
					"cubes": [
						{"origin": [-3.51, 17.75, -3.51], "size": [2, 3, 2], "uv": [45, 24]},
						{"origin": [-3.01, 19.5, -3.515], "size": [1, 1, 1], "uv": [19, 24]}
					]
				},
				{
					"name": "eyelid_right",
					"parent": "eye_right",
					"pivot": [-2.41, 19.25, -2.41],
					"cubes": [
						{"origin": [-3.41, 17.75, -3.41], "size": [2, 3, 2], "inflate": 0.01, "uv": [12, 44]}
					]
				},
				{
					"name": "hair",
					"parent": "head",
					"pivot": [0, 22.5, -2],
					"cubes": [
						{"origin": [-1.5, 21.5, -2], "size": [3, 4, 0], "uv": [0, 47]}
					]
				},
				{
					"name": "hair2",
					"parent": "hair",
					"pivot": [0, 25.5, -2],
					"cubes": [
						{"origin": [-1.5, 25.5, -2], "size": [3, 4, 0], "uv": [43, 46]}
					]
				},
				{
					"name": "hair_left",
					"parent": "head",
					"pivot": [1, 22.5, -1.5],
					"cubes": [
						{"origin": [0, 21.5, -1.5], "size": [3, 4, 0], "uv": [14, 29]}
					]
				},
				{
					"name": "hair_left2",
					"parent": "hair_left",
					"pivot": [1.5, 25.5, -1.5],
					"cubes": [
						{"origin": [0, 25.5, -1.5], "size": [3, 3, 0], "uv": [31, 31]}
					]
				},
				{
					"name": "hair_right",
					"parent": "head",
					"pivot": [-1, 22.5, -1.5],
					"cubes": [
						{"origin": [-3, 21.5, -1.5], "size": [3, 4, 0], "uv": [0, 11]}
					]
				},
				{
					"name": "hair_right2",
					"parent": "hair_right",
					"pivot": [-1.5, 25.5, -1.5],
					"cubes": [
						{"origin": [-3, 25.5, -1.5], "size": [3, 3, 0], "uv": [0, 15]}
					]
				},
				{
					"name": "ear_left",
					"parent": "head",
					"pivot": [3.5, 22, -0.5],
					"cubes": [
						{"origin": [3.5, 22, -2.5], "size": [7, 0, 5], "uv": [27, 5]}
					]
				},
				{
					"name": "ear_left2",
					"parent": "ear_left",
					"pivot": [10.5, 22, 0],
					"cubes": [
						{"origin": [10.5, 22, -2.5], "size": [8, 0, 5], "uv": [19, 0]}
					]
				},
				{
					"name": "ear_right",
					"parent": "head",
					"pivot": [-3.5, 22, -0.5],
					"cubes": [
						{"origin": [-10.5, 22, -2.5], "size": [7, 0, 5], "uv": [0, 24]}
					]
				},
				{
					"name": "ear_right2",
					"parent": "ear_right",
					"pivot": [-10.5, 22, 0],
					"cubes": [
						{"origin": [-18.5, 22, -2.5], "size": [8, 0, 5], "uv": [16, 11]}
					]
				},
				{
					"name": "shoulder_left",
					"parent": "torso",
					"pivot": [2.5, 14.1, -0.5],
					"rotation": [0, 20, -20],
					"cubes": [
						{"origin": [2, 14.1, -1.5], "size": [3, 0, 2], "uv": [25, 16]}
					]
				},
				{
					"name": "shoulder_left2",
					"parent": "torso",
					"pivot": [2.5, 14.1, 0.5],
					"rotation": [0, -20, -20],
					"cubes": [
						{"origin": [2, 14.1, -0.5], "size": [3, 0, 2], "inflate": 0.01, "uv": [22, 5]}
					]
				},
				{
					"name": "shoulder_right",
					"parent": "torso",
					"pivot": [-2.5, 14.1, -0.5],
					"rotation": [0, -20, 20],
					"cubes": [
						{"origin": [-5, 14.1, -1.5], "size": [3, 0, 2], "uv": [19, 16]}
					]
				},
				{
					"name": "shoulder_right2",
					"parent": "torso",
					"pivot": [-2.5, 14.1, 0.5],
					"rotation": [0, 20, 20],
					"cubes": [
						{"origin": [-5, 14.1, -0.5], "size": [3, 0, 2], "inflate": 0.01, "uv": [0, 6]}
					]
				},
				{
					"name": "tail",
					"parent": "torso",
					"pivot": [0, 9.6, 2.5],
					"cubes": [
						{"origin": [-1.5, 8.1, 2], "size": [3, 3, 3], "uv": [0, 41]}
					]
				},
				{
					"name": "pocket",
					"parent": "torso",
					"pivot": [0, 9.6, -2],
					"cubes": [
						{"origin": [-2.5, 7.6, -3.5], "size": [5, 4, 3], "uv": [18, 31]}
					]
				},
				{
					"name": "arm_left",
					"parent": "torso",
					"pivot": [2.5, 12.5, 0],
					"cubes": [
						{"origin": [2, 11.5, -1.5], "size": [5, 2, 3], "inflate": 0.01, "uv": [34, 13]}
					]
				},
				{
					"name": "arm_left2",
					"parent": "arm_left",
					"pivot": [7, 12.5, 1.5],
					"cubes": [
						{"origin": [7, 11.5, -1.5], "size": [5, 2, 3], "uv": [34, 31]}
					]
				},
				{
					"name": "arm_right",
					"parent": "torso",
					"pivot": [-2.5, 12.5, 0],
					"cubes": [
						{"origin": [-7, 11.5, -1.5], "size": [5, 2, 3], "inflate": 0.01, "uv": [31, 36]}
					]
				},
				{
					"name": "arm_right2",
					"parent": "arm_right",
					"pivot": [-7, 12.5, 1.5],
					"cubes": [
						{"origin": [-12, 11.5, -1.5], "size": [5, 2, 3], "uv": [0, 36]}
					]
				},
				{
					"name": "leg_left",
					"parent": "body",
					"pivot": [1.5, 7, 0],
					"cubes": [
						{"origin": [0.5, 4, -1], "size": [2, 4, 2], "uv": [35, 41]}
					]
				},
				{
					"name": "leg_left2",
					"parent": "leg_left",
					"pivot": [1.5, 4, -1],
					"cubes": [
						{"origin": [0.5, 1, -1], "size": [2, 3, 2], "inflate": 0.01, "uv": [44, 8]}
					]
				},
				{
					"name": "foot_left",
					"parent": "leg_left2",
					"pivot": [1.5, 1.5, 1],
					"cubes": [
						{"origin": [0, 0, -1.5], "size": [3, 2, 3], "uv": [23, 41]}
					]
				},
				{
					"name": "toe_left",
					"parent": "foot_left",
					"pivot": [1.5, 0, -1.5],
					"cubes": [
						{"origin": [0, 0, -5.5], "size": [3, 2, 4], "inflate": 0.01, "uv": [40, 18]}
					]
				},
				{
					"name": "leg_right",
					"parent": "body",
					"pivot": [-1.5, 7, 0],
					"cubes": [
						{"origin": [-2.5, 4, -1], "size": [2, 4, 2], "uv": [0, 0]}
					]
				},
				{
					"name": "leg_right2",
					"parent": "leg_right",
					"pivot": [-1.5, 4, -1],
					"cubes": [
						{"origin": [-2.5, 1, -1], "size": [2, 3, 2], "inflate": 0.01, "uv": [43, 41]}
					]
				},
				{
					"name": "foot_right",
					"parent": "leg_right2",
					"pivot": [-1.5, 1.5, 1],
					"cubes": [
						{"origin": [-3, 0, -1.5], "size": [3, 2, 3], "uv": [40, 0]}
					]
				},
				{
					"name": "toe_right",
					"parent": "foot_right",
					"pivot": [-1.5, 0, -1.5],
					"cubes": [
						{"origin": [-3, 0, -5.5], "size": [3, 2, 4], "inflate": 0.01, "uv": [12, 38]}
					]
				}
			]
		}
	]
}