<svg width="1514" height="456" viewBox="0 0 1514 456" fill="none" xmlns="http://www.w3.org/2000/svg">
<path d="M127.271 325.234C66.835 361.466 -19.3359 401.831 3.99972 432.5C21.5 455.5 669 455.5 669 455.5C669 455.5 1436.57 449.975 1498.41 424.261C1560.26 398.548 1419.42 228.33 1399.75 209.629C1334.53 151.657 1172.6 250.168 1134.19 261.856C1047.34 53.9814 956.95 219.135 903.405 225.639C849.86 232.143 749.084 59.6551 749.084 59.6551C664.755 -31.9781 544.351 1.99472 494.691 30.4353C386.749 92.1475 364 164.5 352.314 179.611C340.629 194.721 268 275 227.649 297.183C187.298 319.366 156.786 311.208 127.271 325.234Z" fill="#59BAE3"/>
</svg>
