{
  "kind": "collectionType",
  "collectionName": "groups",
  "info": {
    "singularName": "group",
    "pluralName": "groups",
    "displayName": "Group",
    "description": ""
  },
  "options": {
    "draftAndPublish": false
  },
  "pluginOptions": {},
  "attributes": {
    "name": {
      "type": "string"
    },
    "year": {
      "type": "relation",
      "relation": "manyToOne",
      "target": "api::year.year",
      "inversedBy": "groups"
    },
    "students": {
      "type": "relation",
      "relation": "manyToMany",
      "target": "api::student.student",
      "inversedBy": "groups"
    },
    "supervisors": {
      "type": "relation",
      "relation": "manyToOne",
      "target": "api::teacher.teacher",
      "inversedBy": "groups"
    }
  }
}
