{
  "kind": "collectionType",
  "collectionName": "courses",
  "info": {
    "singularName": "course",
    "pluralName": "courses",
    "displayName": "Course"
  },
  "options": {
    "draftAndPublish": false
  },
  "pluginOptions": {},
  "attributes": {
    "name": {
      "type": "string"
    }
  }
}
