[gd_scene load_steps=6 format=2]

[ext_resource path="res://WorldTileSet.tres" type="TileSet" id=1]
[ext_resource path="res://LevelEndGate.tscn" type="PackedScene" id=2]
[ext_resource path="res://Player.tscn" type="PackedScene" id=3]
[ext_resource path="res://Enemy.tscn" type="PackedScene" id=4]
[ext_resource path="res://Leader.tres" type="TileSet" id=5]

[node name="Level02" type="Node2D"]

[node name="TileMap" type="TileMap" parent="."]
tile_set = ExtResource( 1 )
format = 1
tile_data = PoolIntArray( -327617, 6, 0, -327616, 6, 0, -327615, 6, 0, -327614, 6, 0, -327613, 6, 0, -327612, 6, 0, -327611, 6, 0, -327610, 6, 0, -327609, 6, 0, -327608, 6, 0, -327607, 6, 0, -327606, 6, 0, -327605, 6, 0, -327604, 6, 0, -262111, 2, 0, -262110, 2, 0, -262082, 6, 0, -262081, 6, 0, -262068, 6, 0, -196577, 2, 0, -196576, 2, 0, -196575, 3, 0, -196574, 3, 0, -196546, 6, 0, -196532, 6, 0, -131043, 2, 0, -131042, 2, 0, -131041, 3, 0, -131040, 3, 0, -131039, 3, 0, -131038, 3, 0, -131010, 6, 0, -130996, 6, 0, -65509, 2, 0, -65508, 2, 0, -65507, 3, 0, -65506, 3, 0, -65505, 3, 0, -65504, 3, 0, -65503, 3, 0, -65502, 3, 0, -65474, 6, 0, -65460, 6, 0, 25, 2, 0, 26, 2, 0, 27, 3, 0, 28, 3, 0, 29, 3, 0, 30, 3, 0, 31, 3, 0, 32, 3, 0, 33, 3, 0, 34, 3, 0, 62, 6, 0, 76, 6, 0, 65559, 2, 0, 65560, 2, 0, 65561, 3, 0, 65562, 3, 0, 65563, 3, 0, 65564, 3, 0, 65565, 3, 0, 65566, 3, 0, 65567, 3, 0, 65568, 3, 0, 65569, 3, 0, 65570, 3, 0, 65579, 6, 0, 65580, 6, 0, 65581, 6, 0, 65582, 6, 0, 65583, 6, 0, 65584, 6, 0, 65585, 6, 0, 65586, 6, 0, 65587, 6, 0, 65590, 6, 0, 65591, 6, 0, 65592, 6, 0, 65593, 6, 0, 65594, 6, 0, 65595, 6, 0, 65596, 6, 0, 65597, 6, 0, 65598, 6, 0, 65612, 6, 0, 131093, 2, 0, 131094, 2, 0, 131095, 3, 0, 131096, 3, 0, 131097, 3, 0, 131098, 3, 0, 131099, 3, 0, 131100, 3, 0, 131101, 3, 0, 131102, 3, 0, 131103, 3, 0, 131104, 3, 0, 131105, 3, 0, 131106, 3, 0, 131114, 6, 0, 131148, 6, 0, 196611, 0, 0, 196612, 0, 0, 196613, 0, 0, 196614, 0, 0, 196615, 0, 0, 196616, 0, 0, 196617, 0, 0, 196618, 0, 0, 196627, 2, 0, 196628, 2, 0, 196629, 3, 0, 196630, 3, 0, 196631, 3, 0, 196632, 3, 0, 196633, 3, 0, 196634, 3, 0, 196635, 3, 0, 196636, 3, 0, 196637, 3, 0, 196638, 3, 0, 196639, 3, 0, 196640, 3, 0, 196641, 3, 0, 196642, 3, 0, 196650, 6, 0, 196684, 6, 0, 262161, 0, 0, 262162, 0, 0, 262163, 3, 0, 262164, 3, 0, 262165, 3, 0, 262166, 3, 0, 262167, 3, 0, 262168, 3, 0, 262169, 3, 0, 262170, 3, 0, 262171, 3, 0, 262172, 3, 0, 262173, 3, 0, 262174, 3, 0, 262175, 3, 0, 262176, 3, 0, 262177, 3, 0, 262178, 3, 0, 262186, 6, 0, 262220, 6, 0, 327696, 0, 0, 327697, 3, 0, 327698, 3, 0, 327699, 3, 0, 327700, 3, 0, 327701, 3, 0, 327702, 3, 0, 327703, 3, 0, 327704, 3, 0, 327705, 3, 0, 327706, 3, 0, 327707, 3, 0, 327708, 3, 0, 327709, 3, 0, 327710, 3, 0, 327711, 3, 0, 327712, 3, 0, 327713, 3, 0, 327714, 3, 0, 327722, 6, 0, 327754, 6, 0, 327755, 6, 0, 327756, 6, 0, 393230, 0, 0, 393231, 0, 0, 393232, 3, 0, 393233, 3, 0, 393234, 3, 0, 393235, 3, 0, 393236, 3, 0, 393237, 3, 0, 393238, 3, 0, 393239, 3, 0, 393240, 3, 0, 393241, 3, 0, 393242, 3, 0, 393243, 3, 0, 393244, 3, 0, 393245, 3, 0, 393246, 3, 0, 393247, 3, 0, 393248, 3, 0, 393249, 3, 0, 393250, 3, 0, 393258, 6, 0, 393290, 6, 0, 458752, 0, 0, 458753, 0, 0, 458754, 0, 0, 458755, 0, 0, 458756, 0, 0, 458757, 0, 0, 458758, 0, 0, 458759, 0, 0, 458764, 0, 0, 458765, 0, 0, 458766, 3, 0, 458767, 3, 0, 458768, 3, 0, 458769, 3, 0, 458770, 3, 0, 458771, 3, 0, 458772, 3, 0, 458773, 3, 0, 458774, 3, 0, 458775, 3, 0, 458776, 3, 0, 458777, 3, 0, 458778, 3, 0, 458779, 3, 0, 458780, 3, 0, 458781, 3, 0, 458782, 3, 0, 458783, 3, 0, 458784, 3, 0, 458785, 3, 0, 458786, 3, 0, 524288, 3, 0, 524289, 3, 0, 524290, 3, 0, 524291, 3, 0, 524292, 3, 0, 524293, 3, 0, 524294, 3, 0, 524295, 3, 0, 524296, 0, 0, 524297, 0, 0, 524298, 0, 0, 524299, 0, 0, 524300, 3, 0, 524301, 3, 0, 524302, 3, 0, 524303, 3, 0, 524304, 3, 0, 524305, 3, 0, 524306, 3, 0, 524307, 3, 0, 524308, 3, 0, 524309, 3, 0, 524310, 3, 0, 524311, 3, 0, 524312, 3, 0, 524313, 3, 0, 524314, 3, 0, 524315, 3, 0, 524316, 3, 0, 524317, 3, 0, 524318, 3, 0, 524319, 3, 0, 524320, 3, 0, 524321, 3, 0, 524322, 3, 0, 589824, 3, 0, 589825, 3, 0, 589826, 3, 0, 589827, 3, 0, 589828, 3, 0, 589829, 3, 0, 589830, 3, 0, 589831, 3, 0, 589832, 3, 0, 589833, 3, 0, 589834, 3, 0, 589835, 3, 0, 589836, 3, 0, 589837, 3, 0, 589838, 3, 0, 589839, 3, 0, 589840, 3, 0, 589841, 3, 0, 589842, 3, 0, 589843, 3, 0, 589844, 3, 0, 589845, 3, 0, 589846, 3, 0, 589847, 3, 0, 589848, 3, 0, 589849, 3, 0, 589850, 3, 0, 589851, 3, 0, 589852, 3, 0, 589853, 3, 0, 589854, 3, 0, 589855, 3, 0, 589856, 3, 0, 589857, 3, 0, 589858, 3, 0, 589859, 0, 0, 589860, 0, 0, 589861, 0, 0, 589862, 0, 0, 589863, 0, 0, 589864, 0, 0, 589865, 0, 0, 589866, 0, 0, 589867, 0, 0, 589868, 0, 0, 589869, 0, 0, 589870, 0, 0, 589871, 0, 0, 589872, 0, 0, 589873, 0, 0, 589874, 0, 0, 589875, 0, 0, 589876, 0, 0, 589877, 0, 0, 589878, 0, 0, 589879, 0, 0, 589880, 0, 0, 589881, 0, 0, 589882, 0, 0, 589883, 0, 0, 589884, 0, 0, 589885, 0, 0, 589886, 0, 0, 589887, 0, 0, 589888, 0, 0, 589889, 0, 0, 589890, 0, 0, 589891, 0, 0, 589892, 0, 0, 589893, 0, 0, 589894, 0, 0, 589895, 0, 0, 589896, 0, 0, 589897, 0, 0, 589898, 0, 0, 589899, 0, 0, 589900, 0, 0, 589901, 0, 0, 589902, 0, 0, 589903, 0, 0, 589904, 0, 0, 589905, 0, 0, 589906, 0, 0, 589907, 0, 0, 589908, 0, 0, 589909, 0, 0, 16318724, 6, 0 )

[node name="LevelEndGate" parent="." instance=ExtResource( 2 )]
position = Vector2( 5347.75, 507.757 )
scale = Vector2( 1.06915, 1.27663 )
nextLevel = NodePath("res://Levels/Level01.tscn")

[node name="Player" parent="." instance=ExtResource( 3 )]
position = Vector2( 160, 352 )

[node name="Camera2D" type="Camera2D" parent="Player"]
current = true
limit_left = -64
limit_bottom = 640
drag_margin_left = 0.5
drag_margin_right = 0.5
editor_draw_limits = true
editor_draw_drag_margin = true

[node name="Enemy" parent="." instance=ExtResource( 4 )]
position = Vector2( 288, 160 )

[node name="Enemy2" parent="." instance=ExtResource( 4 )]
position = Vector2( 608, 352 )

[node name="Enemy3" parent="." instance=ExtResource( 4 )]
position = Vector2( 928, 352 )

[node name="Enemy4" parent="." instance=ExtResource( 4 )]
position = Vector2( 1248, 160 )

[node name="TileMapLeader" type="TileMap" parent="."]
tile_set = ExtResource( 5 )
collision_layer = 2
collision_mask = 2
format = 1
tile_data = PoolIntArray( -327645, 0, 0, -262109, 0, 0, -196573, 0, 0, -131037, 0, 0, -65501, 0, 0, 0, -1073739780, 0, 35, 0, 0, 65571, 0, 0, 131107, 0, 0, 196643, 0, 0, 262179, 0, 0, 327715, 0, 0, 393251, 0, 0, 458787, 0, 0, 524323, 0, 0 )

[node name="DangerTileMap" type="TileMap" parent="."]
tile_set = ExtResource( 1 )
format = 1
tile_data = PoolIntArray( 589835, 5, 0, 589836, 5, 0, 589837, 5, 0, 589838, 5, 0, 589859, 3, 0, 589860, 0, 0, 589863, 0, 0, 589864, 0, 0, 589865, 0, 0, 589866, 0, 0, 589867, 0, 0, 589868, 0, 0, 589869, 0, 0, 589870, 0, 0, 589871, 0, 0, 589872, 0, 0, 589873, 0, 0, 589874, 0, 0, 589877, 0, 0, 589878, 0, 0, 589879, 0, 0, 589880, 0, 0, 589881, 0, 0, 589882, 0, 0, 589883, 0, 0, 589884, 0, 0, 589889, 0, 0, 589890, 0, 0, 589891, 0, 0, 589892, 0, 0, 589896, 0, 0, 589897, 0, 0, 589898, 0, 0, 589899, 0, 0, 589900, 0, 0, 589901, 0, 0, 589902, 0, 0, 655395, 3, 0, 655396, 3, 0, 655397, 3, 0, 655398, 3, 0, 655399, 3, 0, 655400, 3, 0, 655401, 3, 0, 655402, 3, 0, 655403, 3, 0, 655404, 3, 0, 655405, 3, 0, 655406, 3, 0, 655407, 3, 0, 655408, 3, 0, 655409, 3, 0, 655410, 3, 0, 655411, 3, 0, 655412, 3, 0, 655413, 3, 0, 655414, 3, 0, 655415, 3, 0, 655416, 3, 0, 655417, 3, 0, 655418, 3, 0, 655419, 3, 0, 655420, 3, 0, 655421, 3, 0, 655422, 3, 0, 655423, 3, 0, 655424, 3, 0, 655425, 3, 0, 655426, 3, 0, 655427, 3, 0, 655428, 3, 0, 655429, 3, 0, 655430, 3, 0, 655431, 3, 0, 655432, 3, 0, 655433, 3, 0, 655434, 3, 0, 655435, 3, 0, 655436, 3, 0, 655437, 3, 0, 655438, 3, 0, 655439, 3, 0, 655440, 3, 0, 655441, 3, 0, 655442, 3, 0, 655443, 3, 0, 655444, 3, 0, 655445, 3, 0, 720931, 3, 0, 720932, 3, 0, 720933, 3, 0, 720934, 3, 0, 720935, 3, 0, 720936, 3, 0, 720937, 3, 0, 720938, 3, 0, 720939, 3, 0, 720940, 3, 0, 720941, 3, 0, 720942, 3, 0, 720943, 3, 0, 720944, 3, 0, 720945, 3, 0, 720946, 3, 0, 720947, 3, 0, 720948, 3, 0, 720949, 3, 0, 720950, 3, 0, 720951, 3, 0, 720952, 3, 0, 720953, 3, 0, 720954, 3, 0, 720955, 3, 0, 720956, 3, 0, 720957, 3, 0, 720958, 3, 0, 720959, 3, 0, 720960, 3, 0, 720961, 3, 0, 720962, 3, 0, 720963, 3, 0, 720964, 3, 0, 720965, 3, 0, 720966, 3, 0, 720967, 3, 0, 720968, 3, 0, 720969, 3, 0, 720970, 3, 0, 720971, 3, 0, 720972, 3, 0, 720973, 3, 0, 720974, 3, 0, 720975, 3, 0, 720976, 3, 0, 720977, 3, 0, 720978, 3, 0, 720979, 3, 0, 720980, 3, 0, 720981, 3, 0 )

