{
  "kind": "collectionType",
  "collectionName": "courses",
  "info": {
    "name": "Course"
  },
  "options": {
    "increments": true,
    "timestamps": true,
    "draftAndPublish": true
  },
  "attributes": {
    "name": {
      "type": "string"
    },
    "description": {
      "type": "text"
    },
    "subjects": {
      "collection": "subject",
      "via": "course"
    }
  }
}
