{
  "kind": "collectionType",
  "collectionName": "learning_units",
  "info": {
    "name": "LearningUnit",
    "description": ""
  },
  "options": {
    "increments": true,
    "timestamps": true,
    "draftAndPublish": true
  },
  "attributes": {
    "name": {
      "type": "string"
    },
    "case_goals": {
      "collection": "case-goal",
      "via": "learning_unit"
    },
    "knowledge": {
      "type": "richtext"
    },
    "skills": {
      "type": "richtext"
    },
    "essentialQuestions": {
      "type": "richtext"
    },
    "understandings": {
      "type": "richtext"
    },
    "transferResults": {
      "type": "richtext"
    },
    "textGoals": {
      "type": "richtext"
    }
  }
}
