module example.com/gofiles/v2

go 1.17

require (
	github.com/jbenet/go-random v0.0.0-20190219211222-123a90aedc0c // indirect
	github.com/jbenet/go-random-files v0.0.0-20190219210431-31b3f20ebded // indirect
)
