41 63 61 62 61 6d 6f 73 20 6e 75 65 73 74 72 6f 20 65 6a 65 72 63 69 63 69
6f 20 63 6f 6e 20 75 6e 20 72 65 74 6f 20 64 65 20 74 72 61 6e 73 66 6f 72
6d 61 63 69 f3 6e 20 64 65 20 69 6e 66 6f 72 6d 61 63 69 f3 6e 2e 0a 45 6e
20 65 73 74 65 20 63 61 73 6f 20 65 6c 20 72 65 74 6f 20 74 69 65 6e 65 20
70 6f 63 6f 20 6d 69 73 74 65 72 69 6f 2c 20 70 65 72 6f 20 73 65 20 74 72
61 74 61 20 64 65 20 73 61 62 65 72 20 69 6e 74 65 72 70 72 65 74 61 72 20
6c 61 20 69 6e 66 6f 72 6d 61 63 69 f3 6e 20 79 20 75 73 61 72 20 6c 61 73
20 68 65 72 72 61 6d 69 65 6e 74 61 73 20 6e 65 63 65 73 61 72 69 61 73 2e
0a 41 68 ed 20 74 69 65 6e 65 73 20 65 6c 20 66 6c 61 67 3a 20 69 64 65 6f
7b 74 65 78 74 5f 69 73 5f 6a 75 73 74 5f 6e 75 6d 62 65 72 73 7d