"id","name","model_id/id","group_id/id","perm_read","perm_write","perm_create","perm_unlink"
activity_programming_scouter,"Activity programming",model_scout_activity_programming,scout_association.group_scout_scouter,1,1,1,0
activity_programming_coordinator,"Activity programming",model_scout_activity_programming,scout_association.group_scout_coordinator,1,1,1,1
programming_attendance_coordinator,"Programming attendance",model_scout_activity_programming_attendance,scout_association.group_scout_scouter,1,1,1,1
programming_objective,"Programming objective",model_scout_activity_programming_objective,scout_association.group_scout_scouter,1,1,1,1
programming_evaluation,"Programming evaluation",model_scout_activity_programming_evaluation,scout_association.group_scout_scouter,1,1,1,1
programming_objective,"Programming objective",model_scout_activity_programming_objective,scout_association.group_scout_scouter,1,1,1,1
programming_objective,"Programming objective",model_scout_activity_programming_objective,scout_association.group_scout_scouter,1,1,1,1
programming_objective,"Programming objective",model_scout_activity_programming_objective,scout_association.group_scout_scouter,1,1,1,1
scout_annual_plan_scouter,"Annual plan",model_scout_annual_plan,scout_association.group_scout_scouter,1,1,1,0
scout_annual_plan_coordinator,"Annual plan",model_scout_annual_plan,scout_association.group_scout_coordinator,1,1,1,1
annual_plan_objective,"Annual plan objective",model_scout_annual_plan_objective,scout_association.group_scout_scouter,1,1,1,1
annual_plan_evaluation,"Annual plan evaluation",model_scout_annual_plan_evaluation,scout_association.group_scout_scouter,1,1,1,1
scout_activity_programming_evaluation,"Programming evaluation",model_scout_activity_programming_evaluation,scout_association.group_scout_scouter,1,1,1,1
res_partner,"Rest partner",base.model_res_partner,scout_association.group_scout_scouter,1,1,1,1
scout_evaluation_template_scouter, "Evaluation template scouter",model_scout_evaluation_template,scout_association.group_scout_scouter,1,1,1,0
scout_evaluation_template_coordinator, "Evaluation template coordinator",model_scout_evaluation_template,scout_association.group_scout_coordinator,1,1,1,1
scout_evaluation_item, "Evaluation item",model_scout_evaluation_item,scout_association.group_scout_scouter,1,1,1,1
scout_evaluation_item_value, "Evaluation item value",model_scout_evaluation_item_value,scout_association.group_scout_scouter,1,1,1,1
