"id","name","model_id/id","group_id/id","perm_read","perm_write","perm_create","perm_unlink"
"scouters_coordinator","Scouters coordinator","model_scout_scouter","scout_association.group_scout_coordinator",1,1,1,1
"scouters_scouter","Scouters scouter","model_scout_scouter","scout_association.group_scout_scouter",1,1,0,0
"scouters_training","Scouter training","model_scout_scouter_training","scout_association.group_scout_scouter",1,1,1,0
"scouters_achievement","Scouter achievement","model_scout_scouter_achievement","scout_association.group_scout_scouter",1,1,1,0