,Province/State,Country/Region,Last Update,Confirmed,Suspected,Recovered,Death,lat,lon
0,Hubei,China,2020-01-31 19:00:00,7153.0,0.0,169.0,249.0,30.7378118,112.2384017
1,Zhejiang,China,2020-01-31 19:00:00,537.0,0.0,14.0,0.0,29.1416432,119.7889248
2,Guangdong,China,2020-01-31 19:00:00,436.0,0.0,10.0,0.0,23.3790333,113.7632828
3,Henan,China,2020-01-31 19:00:00,352.0,0.0,3.0,2.0,34.2904302,113.3823545
4,Hunan,China,2020-01-31 19:00:00,332.0,0.0,3.0,0.0,27.6252995,111.8568586
5,Jiangxi,China,2020-01-31 19:00:00,240.0,0.0,7.0,0.0,27.0874564,114.9042208
6,Chongqing,China,2020-01-31 19:00:00,238.0,0.0,1.0,1.0,29.4315861,106.912251
7,Anhui,China,2020-01-31 19:00:00,237.0,0.0,3.0,0.0,30.6006773,117.9249002
8,Shandong,China,2020-01-31 19:00:00,184.0,0.0,2.0,0.0,35.8939566,117.9249002
9,Sichuan,China,2020-01-31 19:00:00,177.0,0.0,1.0,1.0,30.26380319999999,102.8054753
10,Jiangsu,China,2020-01-31 19:00:00,168.0,0.0,5.0,0.0,33.1401715,119.7889248
11,Shanghai,China,2020-01-31 19:00:00,153.0,0.0,9.0,1.0,31.230416,121.473701
12,Beijing,China,2020-01-31 19:00:00,139.0,0.0,5.0,1.0,39.90419989999999,116.4073963
13,Fujian,China,2020-01-31 19:00:00,120.0,0.0,0.0,0.0,26.4836842,117.9249002
14,Hebei,China,2020-01-31 19:00:00,96.0,0.0,0.0,1.0,37.8956594,114.9042208
15,Guangxi,China,2020-01-31 19:00:00,88.0,0.0,2.0,0.0,23.7247599,108.8076195
16,Shaanxi,China,2020-01-31 19:00:00,87.0,0.0,0.0,0.0,35.3939908,109.1880047
17,Yunnan,China,2020-01-31 19:00:00,83.0,0.0,1.0,0.0,24.4752847,101.3431058
18,Liaoning,China,2020-01-31 19:00:00,60.0,0.0,1.0,0.0,41.9436543,122.5290376
19,Heilongjiang,China,2020-01-31 19:00:00,59.0,0.0,0.0,2.0,47.12164720000001,128.738231
20,Hainan,China,2020-01-31 19:00:00,58.0,0.0,1.0,1.0,19.5663947,109.949686
21,Shanxi,China,2020-01-31 19:00:00,47.0,0.0,1.0,0.0,37.2425649,111.8568586
22,Gansu,China,2020-01-31 19:00:00,35.0,0.0,0.0,0.0,35.7518326,104.2861116
23,Tianjin,China,2020-01-31 19:00:00,32.0,0.0,0.0,0.0,39.3433574,117.3616476
24,Guizhou,China,2020-01-31 19:00:00,29.0,0.0,2.0,0.0,26.8429645,107.2902839
25,Ningxia,China,2020-01-31 19:00:00,21.0,0.0,1.0,0.0,37.198731,106.1580937
26,Inner Mongolia,China,2020-01-31 19:00:00,20.0,0.0,0.0,0.0,43.37822,115.0594815
27,Xinjiang,China,2020-01-31 19:00:00,17.0,0.0,0.0,0.0,42.5246357,87.5395855
28,Jilin,China,2020-01-31 19:00:00,14.0,0.0,1.0,0.0,43.1520105,126.4371385
29,Hong Kong,Hong Kong,2020-01-31 19:00:00,13.0,0.0,0.0,0.0,22.3193039,114.1693611
30,Taiwan,Taiwan,2020-01-31 19:00:00,10.0,0.0,0.0,0.0,23.69781,120.960515
31,Qinghai,China,2020-01-31 19:00:00,8.0,0.0,0.0,0.0,35.744798,96.4077358
32,Macau,Macau,2020-01-31 19:00:00,7.0,0.0,0.0,0.0,22.198745,113.543873
33,Tibet,China,2020-01-31 19:00:00,1.0,0.0,0.0,0.0,30.1533605,88.7878678
34,Washington,United States,2020-01-31 19:00:00,1.0,0.0,0.0,0.0,47.7510741,-120.7401385
35,Illinois,United States,2020-01-31 19:00:00,2.0,0.0,0.0,0.0,40.6331249,-89.3985283
36,California,United States,2020-01-31 19:00:00,3.0,0.0,0.0,0.0,36.778261,-119.4179324
37,Arizona,United States,2020-01-31 19:00:00,1.0,0.0,0.0,0.0,34.0489281,-111.0937311
38,0,Japan,2020-01-31 19:00:00,17.0,0.0,1.0,0.0,36.204824,138.252924
39,0,Thailand,2020-01-31 19:00:00,19.0,0.0,7.0,0.0,15.870032,100.992541
40,0,South Korea,2020-01-31 19:00:00,11.0,0.0,0.0,0.0,35.907757,127.766922
41,0,Singapore,2020-01-31 19:00:00,16.0,0.0,0.0,0.0,1.352083,103.819836
42,0,Vietnam,2020-01-31 19:00:00,2.0,0.0,0.0,0.0,14.058324,108.277199
43,0,France,2020-01-31 19:00:00,6.0,0.0,0.0,0.0,46.227638,2.213749
44,0,Nepal,2020-01-31 19:00:00,1.0,0.0,0.0,0.0,28.394857,84.12400799999999
45,0,Malaysia,2020-01-31 19:00:00,8.0,0.0,0.0,0.0,4.210484,101.975766
46,Ontario,Canada,2020-01-31 19:00:00,2.0,0.0,0.0,0.0,51.253775,-85.323214
47,British Columbia,Canada,2020-01-31 19:00:00,1.0,0.0,0.0,0.0,53.7266683,-127.6476205
48,0,Cambodia,2020-01-31 19:00:00,1.0,0.0,0.0,0.0,12.565679,104.990963
49,0,Sri Lanka,2020-01-31 19:00:00,1.0,0.0,0.0,0.0,7.873053999999999,80.77179699999999
50,New South Wales,Australia,2020-01-31 19:00:00,4.0,0.0,2.0,0.0,-31.2532183,146.921099
51,Victoria,Australia,2020-01-31 19:00:00,2.0,0.0,0.0,0.0,-37.4713077,144.7851531
52,Queensland,Australia,2020-01-31 19:00:00,3.0,0.0,0.0,0.0,-20.9175738,142.7027956
53,Bavaria,Germany,2020-01-31 19:00:00,7.0,0.0,0.0,0.0,48.7904472,11.4978895
54,0,Finland,2020-01-31 19:00:00,1.0,0.0,0.0,0.0,61.92410999999999,25.7481511
55,0,United Arab Emirates,2020-01-31 19:00:00,4.0,0.0,0.0,0.0,23.424076,53.847818
56,0,Philippines,2020-01-31 19:00:00,1.0,0.0,0.0,0.0,12.879721,121.774017
57,0,India,2020-01-31 19:00:00,1.0,0.0,0.0,0.0,20.593684,78.96288
58,0,Italy,2020-01-31 19:00:00,2.0,0.0,0.0,0.0,41.87194,12.56738
59,0,Sweden,2020-01-31 19:00:00,1.0,0.0,0.0,0.0,60.12816100000001,18.643501
60,0,Russia,2020-01-31 19:00:00,2.0,0.0,0.0,0.0,61.52401,105.318756
61,0,Spain,2020-01-31 19:00:00,1.0,0.0,0.0,0.0,40.46366700000001,-3.74922
62,0,UK,2020-01-31 19:00:00,2.0,0.0,0.0,0.0,55.378051,-3.435973
63,Hubei,China,2020-01-31 14:00:00,5806.0,0.0,141.0,204.0,30.7378118,112.2384017
64,Zhejiang,China,2020-01-31 14:00:00,538.0,0.0,14.0,0.0,29.1416432,119.7889248
65,Guangdong,China,2020-01-31 14:00:00,436.0,0.0,11.0,0.0,23.3790333,113.7632828
66,Henan,China,2020-01-31 14:00:00,352.0,0.0,3.0,2.0,34.2904302,113.3823545
67,Hunan,China,2020-01-31 14:00:00,332.0,0.0,2.0,0.0,27.6252995,111.8568586
68,Jiangxi,China,2020-01-31 14:00:00,240.0,0.0,7.0,0.0,27.0874564,114.9042208
69,Anhui,China,2020-01-31 14:00:00,237.0,0.0,3.0,0.0,30.6006773,117.9249002
70,Chongqing,China,2020-01-31 14:00:00,211.0,0.0,1.0,0.0,29.4315861,106.912251
71,Shandong,China,2020-01-31 14:00:00,184.0,0.0,2.0,0.0,35.8939566,117.9249002
72,Sichuan,China,2020-01-31 14:00:00,177.0,0.0,1.0,1.0,30.26380319999999,102.8054753
73,Jiangsu,China,2020-01-31 14:00:00,168.0,0.0,5.0,0.0,33.1401715,119.7889248
74,Beijing,China,2020-01-31 14:00:00,139.0,0.0,5.0,1.0,39.90419989999999,116.4073963
75,Shanghai,China,2020-01-31 14:00:00,135.0,0.0,9.0,1.0,31.230416,121.473701
76,Fujian,China,2020-01-31 14:00:00,120.0,0.0,0.0,0.0,26.4836842,117.9249002
77,Guangxi,China,2020-01-31 14:00:00,87.0,0.0,2.0,0.0,23.7247599,108.8076195
78,Shaanxi,China,2020-01-31 14:00:00,87.0,0.0,0.0,0.0,35.3939908,109.1880047
79,Yunnan,China,2020-01-31 14:00:00,83.0,0.0,1.0,0.0,24.4752847,101.3431058
80,Hebei,China,2020-01-31 14:00:00,82.0,0.0,0.0,1.0,37.8956594,114.9042208
81,Heilongjiang,China,2020-01-31 14:00:00,59.0,0.0,0.0,2.0,47.12164720000001,128.738231
82,Hainan,China,2020-01-31 14:00:00,52.0,0.0,1.0,1.0,19.5663947,109.949686
83,Liaoning,China,2020-01-31 14:00:00,48.0,0.0,1.0,0.0,41.9436543,122.5290376
84,Shanxi,China,2020-01-31 14:00:00,39.0,0.0,1.0,0.0,37.2425649,111.8568586
85,Tianjin,China,2020-01-31 14:00:00,32.0,0.0,0.0,0.0,39.3433574,117.3616476
86,Guizhou,China,2020-01-31 14:00:00,29.0,0.0,2.0,0.0,26.8429645,107.2902839
87,Gansu,China,2020-01-31 14:00:00,29.0,0.0,0.0,0.0,35.7518326,104.2861116
88,Ningxia,China,2020-01-31 14:00:00,21.0,0.0,0.0,0.0,37.198731,106.1580937
89,Inner Mongolia,China,2020-01-31 14:00:00,20.0,0.0,1.0,0.0,43.37822,115.0594815
90,Xinjiang,China,2020-01-31 14:00:00,17.0,0.0,0.0,0.0,42.5246357,87.5395855
91,Jilin,China,2020-01-31 14:00:00,14.0,0.0,1.0,0.0,43.1520105,126.4371385
92,Hong Kong,Hong Kong,2020-01-31 14:00:00,12.0,0.0,0.0,0.0,22.3193039,114.1693611
93,Taiwan,Taiwan,2020-01-31 14:00:00,10.0,0.0,0.0,0.0,23.69781,120.960515
94,Qinghai,China,2020-01-31 14:00:00,8.0,0.0,0.0,0.0,35.744798,96.4077358
95,Macau,Macau,2020-01-31 14:00:00,7.0,0.0,0.0,0.0,22.198745,113.543873
96,Tibet,China,2020-01-31 14:00:00,1.0,0.0,0.0,0.0,30.1533605,88.7878678
97,0,Thailand,2020-01-31 14:00:00,19.0,0.0,5.0,0.0,15.870032,100.992541
98,0,Japan,2020-01-31 14:00:00,15.0,0.0,1.0,0.0,36.204824,138.252924
99,0,Singapore,2020-01-31 14:00:00,13.0,0.0,0.0,0.0,1.352083,103.819836
100,0,South Korea,2020-01-31 14:00:00,11.0,0.0,0.0,0.0,35.907757,127.766922
101,0,Malaysia,2020-01-31 14:00:00,8.0,0.0,0.0,0.0,4.210484,101.975766
102,0,France,2020-01-31 14:00:00,5.0,0.0,0.0,0.0,46.227638,2.213749
103,Bavaria,Germany,2020-01-31 14:00:00,5.0,0.0,0.0,0.0,48.7904472,11.4978895
104,New South Wales,Australia,2020-01-31 14:00:00,4.0,0.0,2.0,0.0,-31.2532183,146.921099
105,0,United Arab Emirates,2020-01-31 14:00:00,4.0,0.0,0.0,0.0,23.424076,53.847818
106,Victoria,Australia,2020-01-31 14:00:00,3.0,0.0,0.0,0.0,-37.4713077,144.7851531
107,Illinois,United States,2020-01-31 14:00:00,2.0,0.0,0.0,0.0,40.6331249,-89.3985283
109,0,Vietnam,2020-01-31 14:00:00,2.0,0.0,0.0,0.0,14.058324,108.277199
110,Ontario,Canada,2020-01-31 14:00:00,2.0,0.0,0.0,0.0,51.253775,-85.323214
111,Queensland,Australia,2020-01-31 14:00:00,2.0,0.0,0.0,0.0,-20.9175738,142.7027956
112,0,Italy,2020-01-31 14:00:00,2.0,0.0,0.0,0.0,41.87194,12.56738
113,0,UK,2020-01-31 14:00:00,2.0,0.0,0.0,0.0,55.378051,-3.435973
114,0,Russia,2020-01-31 14:00:00,2.0,0.0,0.0,0.0,61.52401,105.318756
115,Washington,United States,2020-01-31 14:00:00,1.0,0.0,0.0,0.0,47.7510741,-120.7401385
116,Arizona,United States,2020-01-31 14:00:00,1.0,0.0,0.0,0.0,34.0489281,-111.0937311
117,0,Nepal,2020-01-31 14:00:00,1.0,0.0,0.0,0.0,28.394857,84.12400799999999
118,British Columbia,Canada,2020-01-31 14:00:00,1.0,0.0,0.0,0.0,53.7266683,-127.6476205
119,0,Cambodia,2020-01-31 14:00:00,1.0,0.0,0.0,0.0,12.565679,104.990963
120,0,Sri Lanka,2020-01-31 14:00:00,1.0,0.0,0.0,0.0,7.873053999999999,80.77179699999999
121,0,Finland,2020-01-31 14:00:00,1.0,0.0,0.0,0.0,61.92410999999999,25.7481511
122,0,Philippines,2020-01-31 14:00:00,1.0,0.0,0.0,0.0,12.879721,121.774017
123,0,India,2020-01-31 14:00:00,1.0,0.0,0.0,0.0,20.593684,78.96288
124,0,Sweden,2020-01-31 14:00:00,1.0,0.0,0.0,0.0,60.12816100000001,18.643501
125,Hubei,China,2020-01-30 21:30:00,5806.0,0.0,116.0,204.0,30.7378118,112.2384017
126,Zhejiang,China,2020-01-30 21:30:00,537.0,0.0,9.0,0.0,29.1416432,119.7889248
127,Guangdong,China,2020-01-30 21:30:00,393.0,0.0,11.0,0.0,23.3790333,113.7632828
128,Henan,China,2020-01-30 21:30:00,352.0,0.0,3.0,2.0,34.2904302,113.3823545
129,Hunan,China,2020-01-30 21:30:00,332.0,0.0,2.0,0.0,27.6252995,111.8568586
130,Jiangxi,China,2020-01-30 21:30:00,240.0,0.0,7.0,0.0,27.0874564,114.9042208
131,Anhui,China,2020-01-30 21:30:00,237.0,0.0,3.0,0.0,30.6006773,117.9249002
132,Chongqing,China,2020-01-30 21:30:00,206.0,0.0,1.0,0.0,29.4315861,106.912251
133,Shandong,China,2020-01-30 21:30:00,178.0,0.0,2.0,0.0,35.8939566,117.9249002
134,Sichuan,China,2020-01-30 21:30:00,177.0,0.0,1.0,1.0,30.26380319999999,102.8054753
135,Jiangsu,China,2020-01-30 21:30:00,168.0,0.0,2.0,0.0,33.1401715,119.7889248
136,Shanghai,China,2020-01-30 21:30:00,128.0,0.0,9.0,1.0,31.230416,121.473701
137,Beijing,China,2020-01-30 21:30:00,121.0,0.0,5.0,1.0,39.90419989999999,116.4073963
138,Fujian,China,2020-01-30 21:30:00,101.0,0.0,0.0,0.0,26.4836842,117.9249002
139,Guangxi,China,2020-01-30 21:30:00,87.0,0.0,2.0,0.0,23.7247599,108.8076195
140,Hebei,China,2020-01-30 21:30:00,82.0,0.0,0.0,1.0,37.8956594,114.9042208
141,Yunnan,China,2020-01-30 21:30:00,76.0,0.0,0.0,0.0,24.4752847,101.3431058
142,Shaanxi,China,2020-01-30 21:30:00,87.0,0.0,0.0,0.0,35.3939908,109.1880047
143,Heilongjiang,China,2020-01-30 21:30:00,59.0,0.0,0.0,2.0,47.12164720000001,128.738231
144,Hainan,China,2020-01-30 21:30:00,50.0,0.0,1.0,1.0,19.5663947,109.949686
145,Liaoning,China,2020-01-30 21:30:00,45.0,0.0,1.0,0.0,41.9436543,122.5290376
146,Shanxi,China,2020-01-30 21:30:00,39.0,0.0,1.0,0.0,37.2425649,111.8568586
147,Tianjin,China,2020-01-30 21:30:00,32.0,0.0,0.0,0.0,39.3433574,117.3616476
148,Gansu,China,2020-01-30 21:30:00,29.0,0.0,0.0,0.0,35.7518326,104.2861116
149,Ningxia,China,2020-01-30 21:30:00,21.0,0.0,1.0,0.0,37.198731,106.1580937
150,Inner Mongolia,China,2020-01-30 21:30:00,20.0,0.0,0.0,0.0,43.37822,115.0594815
151,Xinjiang,China,2020-01-30 21:30:00,17.0,0.0,0.0,0.0,42.5246357,87.5395855
152,Guizhou,China,2020-01-30 21:30:00,15.0,0.0,1.0,0.0,26.8429645,107.2902839
153,Jilin,China,2020-01-30 21:30:00,14.0,0.0,1.0,0.0,43.1520105,126.4371385
154,Hong Kong,Hong Kong,2020-01-30 21:30:00,12.0,0.0,0.0,0.0,22.3193039,114.1693611
155,Taiwan,Taiwan,2020-01-30 21:30:00,9.0,0.0,0.0,0.0,23.69781,120.960515
156,Qinghai,China,2020-01-30 21:30:00,8.0,0.0,0.0,0.0,35.744798,96.4077358
157,Macau,Macau,2020-01-30 21:30:00,7.0,0.0,0.0,0.0,22.198745,113.543873
158,Tibet,China,2020-01-30 21:30:00,1.0,0.0,0.0,0.0,30.1533605,88.7878678
159,Washington,United States,2020-01-30 21:30:00,1.0,0.0,0.0,0.0,47.7510741,-120.7401385
160,Illinois,United States,2020-01-30 21:30:00,2.0,0.0,0.0,0.0,40.6331249,-89.3985283
161,California,United States,2020-01-30 21:30:00,2.0,0.0,0.0,0.0,36.778261,-119.4179324
162,Arizona,United States,2020-01-30 21:30:00,1.0,0.0,0.0,0.0,34.0489281,-111.0937311
163,0,Japan,2020-01-30 21:30:00,11.0,0.0,1.0,0.0,36.204824,138.252924
164,0,Thailand,2020-01-30 21:30:00,14.0,0.0,5.0,0.0,15.870032,100.992541
165,0,South Korea,2020-01-30 21:30:00,6.0,0.0,0.0,0.0,35.907757,127.766922
166,0,Singapore,2020-01-30 21:30:00,10.0,0.0,0.0,0.0,1.352083,103.819836
167,0,Vietnam,2020-01-30 21:30:00,2.0,0.0,0.0,0.0,14.058324,108.277199
168,0,France,2020-01-30 21:30:00,5.0,0.0,0.0,0.0,46.227638,2.213749
169,0,Nepal,2020-01-30 21:30:00,1.0,0.0,0.0,0.0,28.394857,84.12400799999999
170,0,Malaysia,2020-01-30 21:30:00,8.0,0.0,0.0,0.0,4.210484,101.975766
171,Ontario,Canada,2020-01-30 21:30:00,2.0,0.0,0.0,0.0,51.253775,-85.323214
172,British Columbia,Canada,2020-01-30 21:30:00,1.0,0.0,0.0,0.0,53.7266683,-127.6476205
173,0,Cambodia,2020-01-30 21:30:00,1.0,0.0,0.0,0.0,12.565679,104.990963
174,0,Sri Lanka,2020-01-30 21:30:00,1.0,0.0,0.0,0.0,7.873053999999999,80.77179699999999
175,New South Wales,Australia,2020-01-30 21:30:00,4.0,0.0,2.0,0.0,-31.2532183,146.921099
176,Victoria,Australia,2020-01-30 21:30:00,2.0,0.0,0.0,0.0,-37.4713077,144.7851531
177,Queensland,Australia,2020-01-30 21:30:00,3.0,0.0,0.0,0.0,-20.9175738,142.7027956
178,Bavaria,Germany,2020-01-30 21:30:00,4.0,0.0,0.0,0.0,48.7904472,11.4978895
179,0,Finland,2020-01-30 21:30:00,1.0,0.0,0.0,0.0,61.92410999999999,25.7481511
180,0,United Arab Emirates,2020-01-30 21:30:00,4.0,0.0,0.0,0.0,23.424076,53.847818
181,0,Philippines,2020-01-30 21:30:00,1.0,0.0,0.0,0.0,12.879721,121.774017
182,0,India,2020-01-30 21:30:00,1.0,0.0,0.0,0.0,20.593684,78.96288
183,0,Italy,2020-01-30 21:30:00,2.0,0.0,0.0,0.0,41.87194,12.56738
184,Hubei,China,2020-01-30 11:00:00,4903.0,0.0,90.0,162.0,30.7378118,112.2384017
185,Zhejiang,China,2020-01-30 11:00:00,428.0,0.0,4.0,0.0,29.1416432,119.7889248
186,Guangdong,China,2020-01-30 11:00:00,354.0,0.0,10.0,0.0,23.3790333,113.7632828
187,Henan,China,2020-01-30 11:00:00,278.0,0.0,2.0,2.0,34.2904302,113.3823545
188,Hunan,China,2020-01-30 11:00:00,277.0,0.0,2.0,0.0,27.6252995,111.8568586
189,Anhui,China,2020-01-30 11:00:00,200.0,0.0,2.0,0.0,30.6006773,117.9249002
190,Chongqing,China,2020-01-30 11:00:00,182.0,0.0,1.0,0.0,29.4315861,106.912251
191,Jiangxi,China,2020-01-30 11:00:00,162.0,0.0,5.0,0.0,27.0874564,114.9042208
192,Shandong,China,2020-01-30 11:00:00,158.0,0.0,1.0,0.0,35.8939566,117.9249002
193,Sichuan,China,2020-01-30 11:00:00,142.0,0.0,1.0,1.0,30.26380319999999,102.8054753
194,Jiangsu,China,2020-01-30 11:00:00,129.0,0.0,1.0,0.0,33.1401715,119.7889248
195,Beijing,China,2020-01-30 11:00:00,114.0,0.0,4.0,1.0,39.90419989999999,116.4073963
196,Shanghai,China,2020-01-30 11:00:00,112.0,0.0,5.0,1.0,31.230416,121.473701
197,Fujian,China,2020-01-30 11:00:00,101.0,0.0,0.0,0.0,26.4836842,117.9249002
198,Guangxi,China,2020-01-30 11:00:00,78.0,0.0,2.0,0.0,23.7247599,108.8076195
199,Yunnan,China,2020-01-30 11:00:00,70.0,0.0,0.0,0.0,24.4752847,101.3431058
200,Hebei,China,2020-01-30 11:00:00,65.0,0.0,0.0,1.0,37.8956594,114.9042208
201,Shaanxi,China,2020-01-30 11:00:00,63.0,0.0,0.0,0.0,35.3939908,109.1880047
202,Hainan,China,2020-01-30 11:00:00,46.0,0.0,1.0,1.0,19.5663947,109.949686
203,Heilongjiang,China,2020-01-30 11:00:00,44.0,0.0,0.0,2.0,47.12164720000001,128.738231
204,Liaoning,China,2020-01-30 11:00:00,41.0,0.0,1.0,0.0,41.9436543,122.5290376
205,Shanxi,China,2020-01-30 11:00:00,35.0,0.0,1.0,0.0,37.2425649,111.8568586
206,Tianjin,China,2020-01-30 11:00:00,31.0,0.0,0.0,0.0,39.3433574,117.3616476
207,Gansu,China,2020-01-30 11:00:00,26.0,0.0,0.0,0.0,35.7518326,104.2861116
208,Inner Mongolia,China,2020-01-30 11:00:00,19.0,0.0,0.0,0.0,43.37822,115.0594815
209,Ningxia,China,2020-01-30 11:00:00,17.0,0.0,0.0,0.0,37.198731,106.1580937
210,Jilin,China,2020-01-30 11:00:00,14.0,0.0,1.0,0.0,43.1520105,126.4371385
211,Xinjiang,China,2020-01-30 11:00:00,14.0,0.0,0.0,0.0,42.5246357,87.5395855
212,Guizhou,China,2020-01-30 11:00:00,12.0,0.0,1.0,0.0,26.8429645,107.2902839
213,Hong Kong,Hong Kong,2020-01-30 11:00:00,10.0,0.0,0.0,0.0,22.3193039,114.1693611
214,Taiwan,Taiwan,2020-01-30 11:00:00,9.0,0.0,0.0,0.0,23.69781,120.960515
215,Qinghai,China,2020-01-30 11:00:00,8.0,0.0,0.0,0.0,35.744798,96.4077358
216,Macau,Macau,2020-01-30 11:00:00,7.0,0.0,0.0,0.0,22.198745,113.543873
217,Tibet,China,2020-01-30 11:00:00,1.0,0.0,0.0,0.0,30.1533605,88.7878678
218,Washington,United States,2020-01-30 11:00:00,1.0,0.0,0.0,0.0,47.7510741,-120.7401385
219,Illinois,United States,2020-01-30 11:00:00,1.0,0.0,0.0,0.0,40.6331249,-89.3985283
220,California,United States,2020-01-30 11:00:00,2.0,0.0,0.0,0.0,36.778261,-119.4179324
221,Arizona,United States,2020-01-30 11:00:00,1.0,0.0,0.0,0.0,34.0489281,-111.0937311
222,0,Japan,2020-01-30 11:00:00,11.0,0.0,1.0,0.0,36.204824,138.252924
223,0,Thailand,2020-01-30 11:00:00,14.0,0.0,5.0,0.0,15.870032,100.992541
224,0,South Korea,2020-01-30 11:00:00,4.0,0.0,0.0,0.0,35.907757,127.766922
225,0,Singapore,2020-01-30 11:00:00,10.0,0.0,0.0,0.0,1.352083,103.819836
226,0,Vietnam,2020-01-30 11:00:00,2.0,0.0,0.0,0.0,14.058324,108.277199
227,0,France,2020-01-30 11:00:00,5.0,0.0,0.0,0.0,46.227638,2.213749
228,0,Nepal,2020-01-30 11:00:00,1.0,0.0,0.0,0.0,28.394857,84.12400799999999
229,0,Malaysia,2020-01-30 11:00:00,8.0,0.0,0.0,0.0,4.210484,101.975766
230,Ontario,Canada,2020-01-30 11:00:00,2.0,0.0,0.0,0.0,51.253775,-85.323214
231,British Columbia,Canada,2020-01-30 11:00:00,1.0,0.0,0.0,0.0,53.7266683,-127.6476205
232,0,Cambodia,2020-01-30 11:00:00,1.0,0.0,0.0,0.0,12.565679,104.990963
233,0,Sri Lanka,2020-01-30 11:00:00,1.0,0.0,0.0,0.0,7.873053999999999,80.77179699999999
234,New South Wales,Australia,2020-01-30 11:00:00,4.0,0.0,2.0,0.0,-31.2532183,146.921099
235,Victoria,Australia,2020-01-30 11:00:00,2.0,0.0,0.0,0.0,-37.4713077,144.7851531
236,Queensland,Australia,2020-01-30 11:00:00,3.0,0.0,0.0,0.0,-20.9175738,142.7027956
237,Bavaria,Germany,2020-01-30 11:00:00,4.0,0.0,0.0,0.0,48.7904472,11.4978895
238,0,Finland,2020-01-30 11:00:00,1.0,0.0,0.0,0.0,61.92410999999999,25.7481511
239,0,United Arab Emirates,2020-01-30 11:00:00,4.0,0.0,0.0,0.0,23.424076,53.847818
240,0,Philippines,2020-01-30 11:00:00,1.0,0.0,0.0,0.0,12.879721,121.774017
241,0,India,2020-01-30 11:00:00,1.0,0.0,0.0,0.0,20.593684,78.96288
242,Hubei,China,2020-01-29 21:00:00,4586.0,0.0,90.0,162.0,30.7378118,112.2384017
243,Zhejiang,China,2020-01-29 21:00:00,428.0,0.0,4.0,0.0,29.1416432,119.7889248
244,Guangdong,China,2020-01-29 21:00:00,311.0,0.0,6.0,0.0,23.3790333,113.7632828
245,Henan,China,2020-01-29 21:00:00,278.0,0.0,2.0,2.0,34.2904302,113.3823545
246,Hunan,China,2020-01-29 21:00:00,277.0,0.0,0.0,0.0,27.6252995,111.8568586
247,Anhui,China,2020-01-29 21:00:00,200.0,0.0,2.0,0.0,30.6006773,117.9249002
248,Chongqing,China,2020-01-29 21:00:00,165.0,0.0,1.0,0.0,29.4315861,106.912251
249,Jiangxi,China,2020-01-29 21:00:00,162.0,0.0,4.0,0.0,27.0874564,114.9042208
250,Shandong,China,2020-01-29 21:00:00,145.0,0.0,1.0,0.0,35.8939566,117.9249002
251,Sichuan,China,2020-01-29 21:00:00,142.0,0.0,1.0,1.0,30.26380319999999,102.8054753
252,Jiangsu,China,2020-01-29 21:00:00,129.0,0.0,1.0,0.0,33.1401715,119.7889248
253,Beijing,China,2020-01-29 21:00:00,111.0,0.0,4.0,1.0,39.90419989999999,116.4073963
254,Shanghai,China,2020-01-29 21:00:00,101.0,0.0,5.0,1.0,31.230416,121.473701
255,Fujian,China,2020-01-29 21:00:00,101.0,0.0,0.0,0.0,26.4836842,117.9249002
256,Guangxi,China,2020-01-29 21:00:00,78.0,0.0,2.0,0.0,23.7247599,108.8076195
257,Hebei,China,2020-01-29 21:00:00,65.0,0.0,0.0,1.0,37.8956594,114.9042208
258,Shaanxi,China,2020-01-29 21:00:00,56.0,0.0,0.0,0.0,35.3939908,109.1880047
259,Yunnan,China,2020-01-29 21:00:00,55.0,0.0,0.0,0.0,24.4752847,101.3431058
260,Hainan,China,2020-01-29 21:00:00,43.0,0.0,0.0,1.0,19.5663947,109.949686
261,Heilongjiang,China,2020-01-29 21:00:00,43.0,0.0,0.0,1.0,47.12164720000001,128.738231
262,Liaoning,China,2020-01-29 21:00:00,39.0,0.0,1.0,0.0,41.9436543,122.5290376
263,Shanxi,China,2020-01-29 21:00:00,35.0,0.0,1.0,0.0,37.2425649,111.8568586
264,Tianjin,China,2020-01-29 21:00:00,27.0,0.0,0.0,0.0,39.3433574,117.3616476
265,Gansu,China,2020-01-29 21:00:00,26.0,0.0,0.0,0.0,35.7518326,104.2861116
266,Inner Mongolia,China,2020-01-29 21:00:00,16.0,0.0,0.0,0.0,43.37822,115.0594815
267,Jilin,China,2020-01-29 21:00:00,14.0,0.0,1.0,0.0,43.1520105,126.4371385
268,Xinjiang,China,2020-01-29 21:00:00,14.0,0.0,0.0,0.0,42.5246357,87.5395855
269,Guizhou,China,2020-01-29 21:00:00,12.0,0.0,1.0,0.0,26.8429645,107.2902839
270,Ningxia,China,2020-01-29 21:00:00,12.0,0.0,0.0,0.0,37.198731,106.1580937
271,Hong Kong,Hong Kong,2020-01-29 21:00:00,10.0,0.0,0.0,0.0,22.3193039,114.1693611
272,Taiwan,Taiwan,2020-01-29 21:00:00,8.0,0.0,0.0,0.0,23.69781,120.960515
273,Macau,Macau,2020-01-29 21:00:00,7.0,0.0,0.0,0.0,22.198745,113.543873
274,Qinghai,China,2020-01-29 21:00:00,6.0,0.0,0.0,0.0,35.744798,96.4077358
275,Tibet,China,2020-01-29 21:00:00,1.0,0.0,0.0,0.0,30.1533605,88.7878678
276,Washington,United States,2020-01-29 21:00:00,1.0,0.0,0.0,0.0,47.7510741,-120.7401385
277,Illinois,United States,2020-01-29 21:00:00,1.0,0.0,0.0,0.0,40.6331249,-89.3985283
278,California,United States,2020-01-29 21:00:00,2.0,0.0,0.0,0.0,36.778261,-119.4179324
279,Arizona,United States,2020-01-29 21:00:00,1.0,0.0,0.0,0.0,34.0489281,-111.0937311
280,0,Japan,2020-01-29 21:00:00,11.0,0.0,1.0,0.0,36.204824,138.252924
281,0,Thailand,2020-01-29 21:00:00,14.0,0.0,5.0,0.0,15.870032,100.992541
282,0,South Korea,2020-01-29 21:00:00,4.0,0.0,0.0,0.0,35.907757,127.766922
283,0,Singapore,2020-01-29 21:00:00,10.0,0.0,0.0,0.0,1.352083,103.819836
284,0,Vietnam,2020-01-29 21:00:00,2.0,0.0,0.0,0.0,14.058324,108.277199
285,0,France,2020-01-29 21:00:00,5.0,0.0,0.0,0.0,46.227638,2.213749
286,0,Nepal,2020-01-29 21:00:00,1.0,0.0,0.0,0.0,28.394857,84.12400799999999
287,0,Malaysia,2020-01-29 21:00:00,7.0,0.0,0.0,0.0,4.210484,101.975766
288,Ontario,Canada,2020-01-29 21:00:00,2.0,0.0,0.0,0.0,51.253775,-85.323214
289,British Columbia,Canada,2020-01-29 21:00:00,1.0,0.0,0.0,0.0,53.7266683,-127.6476205
290,0,Cambodia,2020-01-29 21:00:00,1.0,0.0,0.0,0.0,12.565679,104.990963
291,0,Sri Lanka,2020-01-29 21:00:00,1.0,0.0,0.0,0.0,7.873053999999999,80.77179699999999
292,New South Wales,Australia,2020-01-29 21:00:00,4.0,0.0,0.0,0.0,-31.2532183,146.921099
293,Victoria,Australia,2020-01-29 21:00:00,2.0,0.0,0.0,0.0,-37.4713077,144.7851531
294,Queensland,Australia,2020-01-29 21:00:00,1.0,0.0,0.0,0.0,-20.9175738,142.7027956
295,Bavaria,Germany,2020-01-29 21:00:00,4.0,0.0,0.0,0.0,48.7904472,11.4978895
296,0,Finland,2020-01-29 21:00:00,1.0,0.0,0.0,0.0,61.92410999999999,25.7481511
297,0,United Arab Emirates,2020-01-29 21:00:00,4.0,0.0,0.0,0.0,23.424076,53.847818
298,Hubei,China,2020-01-29 14:30:00,3554.0,0.0,88.0,125.0,30.7378118,112.2384017
299,Zhejiang,China,2020-01-29 14:30:00,296.0,0.0,3.0,0.0,29.1416432,119.7889248
300,Guangdong,China,2020-01-29 14:30:00,277.0,0.0,5.0,0.0,23.3790333,113.7632828
301,Hunan,China,2020-01-29 14:30:00,221.0,0.0,0.0,0.0,27.6252995,111.8568586
302,Henan,China,2020-01-29 14:30:00,206.0,0.0,1.0,2.0,34.2904302,113.3823545
303,Anhui,China,2020-01-29 14:30:00,152.0,0.0,2.0,0.0,30.6006773,117.9249002
304,Chongqing,China,2020-01-29 14:30:00,147.0,0.0,1.0,0.0,29.4315861,106.912251
305,Shandong,China,2020-01-29 14:30:00,130.0,0.0,1.0,0.0,35.8939566,117.9249002
306,Beijing,China,2020-01-29 14:30:00,111.0,0.0,4.0,1.0,39.90419989999999,116.4073963
307,Jiangxi,China,2020-01-29 14:30:00,109.0,0.0,3.0,0.0,27.0874564,114.9042208
308,Sichuan,China,2020-01-29 14:30:00,108.0,0.0,1.0,1.0,30.26380319999999,102.8054753
309,Jiangsu,China,2020-01-29 14:30:00,99.0,0.0,1.0,0.0,33.1401715,119.7889248
310,Shanghai,China,2020-01-29 14:30:00,96.0,0.0,5.0,1.0,31.230416,121.473701
311,Fujian,China,2020-01-29 14:30:00,84.0,0.0,0.0,0.0,26.4836842,117.9249002
312,Guangxi,China,2020-01-29 14:30:00,58.0,0.0,2.0,0.0,23.7247599,108.8076195
313,Shaanxi,China,2020-01-29 14:30:00,56.0,0.0,0.0,0.0,35.3939908,109.1880047
314,Yunnan,China,2020-01-29 14:30:00,55.0,0.0,0.0,0.0,24.4752847,101.3431058
315,Hebei,China,2020-01-29 14:30:00,48.0,0.0,0.0,1.0,37.8956594,114.9042208
316,Hainan,China,2020-01-29 14:30:00,43.0,0.0,0.0,1.0,19.5663947,109.949686
317,Liaoning,China,2020-01-29 14:30:00,39.0,0.0,1.0,0.0,41.9436543,122.5290376
318,Heilongjiang,China,2020-01-29 14:30:00,38.0,0.0,0.0,1.0,47.12164720000001,128.738231
319,Tianjin,China,2020-01-29 14:30:00,27.0,0.0,0.0,0.0,39.3433574,117.3616476
320,Shanxi,China,2020-01-29 14:30:00,27.0,0.0,1.0,0.0,37.2425649,111.8568586
321,Gansu,China,2020-01-29 14:30:00,24.0,0.0,0.0,0.0,35.7518326,104.2861116
322,Inner Mongolia,China,2020-01-29 14:30:00,16.0,0.0,0.0,0.0,43.37822,115.0594815
323,Xinjiang,China,2020-01-29 14:30:00,13.0,0.0,0.0,0.0,42.5246357,87.5395855
324,Ningxia,China,2020-01-29 14:30:00,12.0,0.0,0.0,0.0,37.198731,106.1580937
325,Hong Kong,Hong Kong,2020-01-29 14:30:00,10.0,0.0,0.0,0.0,22.3193039,114.1693611
326,Guizhou,China,2020-01-29 14:30:00,9.0,0.0,1.0,0.0,26.8429645,107.2902839
327,Jilin,China,2020-01-29 14:30:00,9.0,0.0,0.0,0.0,43.1520105,126.4371385
328,Taiwan,Taiwan,2020-01-29 14:30:00,8.0,0.0,0.0,0.0,23.69781,120.960515
329,Macau,Macau,2020-01-29 14:30:00,7.0,0.0,0.0,0.0,22.198745,113.543873
330,Qinghai,China,2020-01-29 14:30:00,6.0,0.0,0.0,0.0,35.744798,96.4077358
331,Washington,United States,2020-01-29 14:30:00,1.0,0.0,0.0,0.0,47.7510741,-120.7401385
332,Illinois,United States,2020-01-29 14:30:00,1.0,0.0,0.0,0.0,40.6331249,-89.3985283
333,California,United States,2020-01-29 14:30:00,2.0,0.0,0.0,0.0,36.778261,-119.4179324
334,Arizona,United States,2020-01-29 14:30:00,1.0,0.0,0.0,0.0,34.0489281,-111.0937311
335,0,Japan,2020-01-29 14:30:00,7.0,0.0,1.0,0.0,36.204824,138.252924
336,0,Thailand,2020-01-29 14:30:00,14.0,0.0,5.0,0.0,15.870032,100.992541
337,0,South Korea,2020-01-29 14:30:00,4.0,0.0,0.0,0.0,35.907757,127.766922
338,0,Singapore,2020-01-29 14:30:00,7.0,0.0,0.0,0.0,1.352083,103.819836
339,0,Vietnam,2020-01-29 14:30:00,2.0,0.0,0.0,0.0,14.058324,108.277199
340,0,France,2020-01-29 14:30:00,5.0,0.0,0.0,0.0,46.227638,2.213749
341,0,Nepal,2020-01-29 14:30:00,1.0,0.0,0.0,0.0,28.394857,84.12400799999999
342,0,Malaysia,2020-01-29 14:30:00,7.0,0.0,0.0,0.0,4.210484,101.975766
343,Ontario,Canada,2020-01-29 14:30:00,1.0,0.0,0.0,0.0,51.253775,-85.323214
344,British Columbia,Canada,2020-01-29 14:30:00,1.0,0.0,0.0,0.0,53.7266683,-127.6476205
345,0,Cambodia,2020-01-29 14:30:00,1.0,0.0,0.0,0.0,12.565679,104.990963
346,0,Sri Lanka,2020-01-29 14:30:00,1.0,0.0,0.0,0.0,7.873053999999999,80.77179699999999
347,New South Wales,Australia,2020-01-29 14:30:00,4.0,0.0,0.0,0.0,-31.2532183,146.921099
348,Victoria,Australia,2020-01-29 14:30:00,1.0,0.0,0.0,0.0,-37.4713077,144.7851531
349,Bavaria,Germany,2020-01-29 14:30:00,4.0,0.0,0.0,0.0,48.7904472,11.4978895
350,0,Finland,2020-01-29 14:30:00,1.0,0.0,0.0,0.0,61.92410999999999,25.7481511
351,0,United Arab Emirates,2020-01-29 14:30:00,4.0,0.0,0.0,0.0,23.424076,53.847818
352,Hubei,China,2020-01-29 13:30:00,3554.0,0.0,80.0,125.0,30.7378118,112.2384017
353,Guangdong,China,2020-01-29 13:30:00,277.0,0.0,4.0,0.0,23.3790333,113.7632828
354,Zhejiang,China,2020-01-29 13:30:00,296.0,0.0,3.0,0.0,29.1416432,119.7889248
355,Henan,China,2020-01-29 13:30:00,206.0,0.0,1.0,2.0,34.2904302,113.3823545
356,Chongqing,China,2020-01-29 13:30:00,147.0,0.0,0.0,0.0,29.4315861,106.912251
357,Hunan,China,2020-01-29 13:30:00,221.0,0.0,0.0,0.0,27.6252995,111.8568586
358,Shandong,China,2020-01-29 13:30:00,130.0,0.0,1.0,0.0,35.8939566,117.9249002
359,Beijing,China,2020-01-29 13:30:00,111.0,0.0,4.0,1.0,39.90419989999999,116.4073963
360,Anhui,China,2020-01-29 13:30:00,152.0,0.0,2.0,0.0,30.6006773,117.9249002
361,Sichuan,China,2020-01-29 13:30:00,108.0,0.0,0.0,0.0,30.26380319999999,102.8054753
362,Fujian,China,2020-01-29 13:30:00,84.0,0.0,0.0,0.0,26.4836842,117.9249002
363,Shanghai,China,2020-01-29 13:30:00,96.0,0.0,4.0,1.0,31.230416,121.473701
364,Jiangxi,China,2020-01-29 13:30:00,109.0,0.0,3.0,0.0,27.0874564,114.9042208
365,Jiangsu,China,2020-01-29 13:30:00,99.0,0.0,1.0,0.0,33.1401715,119.7889248
366,Guangxi,China,2020-01-29 13:30:00,58.0,0.0,2.0,0.0,23.7247599,108.8076195
367,Shaanxi,China,2020-01-29 13:30:00,56.0,0.0,0.0,0.0,35.3939908,109.1880047
368,Hainan,China,2020-01-29 13:30:00,43.0,0.0,1.0,1.0,19.5663947,109.949686
369,Liaoning,China,2020-01-29 13:30:00,39.0,0.0,0.0,0.0,41.9436543,122.5290376
370,Yunnan,China,2020-01-29 13:30:00,55.0,0.0,0.0,0.0,24.4752847,101.3431058
371,Tianjin,China,2020-01-29 13:30:00,27.0,0.0,0.0,0.0,39.3433574,117.3616476
372,Heilongjiang,China,2020-01-29 13:30:00,38.0,0.0,0.0,1.0,47.12164720000001,128.738231
373,Hebei,China,2020-01-29 13:30:00,48.0,0.0,0.0,1.0,37.8956594,114.9042208
374,Gansu,China,2020-01-29 13:30:00,24.0,0.0,0.0,0.0,35.7518326,104.2861116
375,Shanxi,China,2020-01-29 13:30:00,27.0,0.0,0.0,0.0,37.2425649,111.8568586
376,Inner Mongolia,China,2020-01-29 13:30:00,16.0,0.0,0.0,0.0,43.37822,115.0594815
377,Hong Kong,Hong Kong,2020-01-29 13:30:00,10.0,0.0,0.0,0.0,22.3193039,114.1693611
378,Guizhou,China,2020-01-29 13:30:00,9.0,0.0,0.0,0.0,26.8429645,107.2902839
379,Ningxia,China,2020-01-29 13:30:00,12.0,0.0,0.0,0.0,37.198731,106.1580937
380,Jilin,China,2020-01-29 13:30:00,9.0,0.0,0.0,0.0,43.1520105,126.4371385
381,Macau,Macau,2020-01-29 13:30:00,7.0,0.0,0.0,0.0,22.198745,113.543873
382,Taiwan,Taiwan,2020-01-29 13:30:00,8.0,0.0,0.0,0.0,23.69781,120.960515
383,Xinjiang,China,2020-01-29 13:30:00,13.0,0.0,0.0,0.0,42.5246357,87.5395855
384,Qinghai,China,2020-01-29 13:30:00,6.0,0.0,0.0,0.0,35.744798,96.4077358
385,Washington,United States,2020-01-29 13:30:00,1.0,0.0,0.0,0.0,47.7510741,-120.7401385
386,Illinois,United States,2020-01-29 13:30:00,1.0,0.0,0.0,0.0,40.6331249,-89.3985283
387,California,United States,2020-01-29 13:30:00,2.0,0.0,0.0,0.0,36.778261,-119.4179324
388,Arizona,United States,2020-01-29 13:30:00,1.0,0.0,0.0,0.0,34.0489281,-111.0937311
389,Ontario,Canada,2020-01-29 13:30:00,3.0,0.0,0.0,0.0,51.253775,-85.323214
390,0,Japan,2020-01-29 13:30:00,7.0,0.0,1.0,0.0,36.204824,138.252924
391,0,Thailand,2020-01-29 13:30:00,14.0,0.0,5.0,0.0,15.870032,100.992541
392,0,South Korea,2020-01-29 13:30:00,4.0,0.0,0.0,0.0,35.907757,127.766922
393,0,Singapore,2020-01-29 13:30:00,7.0,0.0,0.0,0.0,1.352083,103.819836
394,0,Vietnam,2020-01-29 13:30:00,2.0,0.0,0.0,0.0,14.058324,108.277199
395,0,Nepal,2020-01-29 13:30:00,1.0,0.0,0.0,0.0,28.394857,84.12400799999999
396,0,Malaysia,2020-01-29 13:30:00,7.0,0.0,0.0,0.0,4.210484,101.975766
397,0,Cambodia,2020-01-29 13:30:00,1.0,0.0,0.0,0.0,12.565679,104.990963
398,0,Sri Lanka,2020-01-29 13:30:00,1.0,0.0,0.0,0.0,7.873053999999999,80.77179699999999
399,New South Wales,Australia,2020-01-29 13:30:00,4.0,0.0,0.0,0.0,-31.2532183,146.921099
400,Victoria,Australia,2020-01-29 13:30:00,1.0,0.0,0.0,0.0,-37.4713077,144.7851531
401,0,United Arab Emirates,2020-01-29 13:30:00,4.0,0.0,0.0,0.0,23.424076,53.847818
402,0,France,2020-01-29 13:30:00,4.0,0.0,0.0,0.0,46.227638,2.213749
403,Bavaria,Germany,2020-01-29 13:30:00,4.0,0.0,0.0,0.0,48.7904472,11.4978895
404,Hubei,China,2020-01-28 23:00:00,3554.0,0.0,80.0,125.0,30.7378118,112.2384017
405,Zhejiang,China,2020-01-28 23:00:00,296.0,0.0,3.0,0.0,29.1416432,119.7889248
406,Guangdong,China,2020-01-28 23:00:00,241.0,0.0,5.0,0.0,23.3790333,113.7632828
407,Hunan,China,2020-01-28 23:00:00,221.0,0.0,0.0,0.0,27.6252995,111.8568586
408,Henan,China,2020-01-28 23:00:00,206.0,0.0,1.0,2.0,34.2904302,113.3823545
409,Anhui,China,2020-01-28 23:00:00,152.0,0.0,0.0,0.0,30.6006773,117.9249002
410,Chongqing,China,2020-01-28 23:00:00,147.0,0.0,1.0,0.0,29.4315861,106.912251
411,Shandong,China,2020-01-28 23:00:00,121.0,0.0,0.0,0.0,35.8939566,117.9249002
412,Jiangxi,China,2020-01-28 23:00:00,109.0,0.0,3.0,0.0,27.0874564,114.9042208
413,Sichuan,China,2020-01-28 23:00:00,108.0,0.0,0.0,0.0,30.26380319999999,102.8054753
414,Jiangsu,China,2020-01-28 23:00:00,99.0,0.0,1.0,0.0,33.1401715,119.7889248
415,Beijing,China,2020-01-28 23:00:00,91.0,0.0,4.0,1.0,39.90419989999999,116.4073963
416,Fujian,China,2020-01-28 23:00:00,82.0,0.0,0.0,0.0,26.4836842,117.9249002
417,Shanghai,China,2020-01-28 23:00:00,80.0,0.0,4.0,1.0,31.230416,121.473701
418,Guangxi,China,2020-01-28 23:00:00,58.0,0.0,2.0,0.0,23.7247599,108.8076195
419,Shaanxi,China,2020-01-28 23:00:00,56.0,0.0,0.0,0.0,35.3939908,109.1880047
420,Hebei,China,2020-01-28 23:00:00,48.0,0.0,0.0,1.0,37.8956594,114.9042208
421,Yunnan,China,2020-01-28 23:00:00,44.0,0.0,0.0,0.0,24.4752847,101.3431058
422,Hainan,China,2020-01-28 23:00:00,43.0,0.0,0.0,1.0,19.5663947,109.949686
423,Heilongjiang,China,2020-01-28 23:00:00,37.0,0.0,0.0,1.0,47.12164720000001,128.738231
424,Liaoning,China,2020-01-28 23:00:00,36.0,0.0,0.0,0.0,41.9436543,122.5290376
425,Shanxi,China,2020-01-28 23:00:00,27.0,0.0,0.0,0.0,37.2425649,111.8568586
426,Tianjin,China,2020-01-28 23:00:00,25.0,0.0,0.0,0.0,39.3433574,117.3616476
427,Gansu,China,2020-01-28 23:00:00,24.0,0.0,0.0,0.0,35.7518326,104.2861116
428,Inner Mongolia,China,2020-01-28 23:00:00,16.0,0.0,0.0,0.0,43.37822,115.0594815
429,Xinjiang,China,2020-01-28 23:00:00,13.0,0.0,0.0,0.0,42.5246357,87.5395855
430,Ningxia,China,2020-01-28 23:00:00,12.0,0.0,0.0,0.0,37.198731,106.1580937
431,Guizhou,China,2020-01-28 23:00:00,9.0,0.0,0.0,0.0,26.8429645,107.2902839
432,Jilin,China,2020-01-28 23:00:00,9.0,0.0,0.0,0.0,43.1520105,126.4371385
433,Hong Kong,Hong Kong,2020-01-28 23:00:00,8.0,0.0,0.0,0.0,22.3193039,114.1693611
434,Taiwan,Taiwan,2020-01-28 23:00:00,8.0,0.0,0.0,0.0,23.69781,120.960515
435,Macau,Macau,2020-01-28 23:00:00,7.0,0.0,0.0,0.0,22.198745,113.543873
436,Qinghai,China,2020-01-28 23:00:00,6.0,0.0,0.0,0.0,35.744798,96.4077358
437,Washington,United States,2020-01-28 18:00:00,1.0,0.0,0.0,0.0,47.7510741,-120.7401385
438,Illinois,United States,2020-01-28 23:00:00,1.0,0.0,0.0,0.0,40.6331249,-89.3985283
439,California,United States,2020-01-28 23:00:00,2.0,0.0,0.0,0.0,36.778261,-119.4179324
440,Arizona,United States,2020-01-28 23:00:00,1.0,0.0,0.0,0.0,34.0489281,-111.0937311
441,0,Japan,2020-01-28 23:00:00,7.0,0.0,1.0,0.0,36.204824,138.252924
442,0,Thailand,2020-01-28 23:00:00,14.0,0.0,5.0,0.0,15.870032,100.992541
443,0,South Korea,2020-01-28 23:00:00,4.0,0.0,0.0,0.0,35.907757,127.766922
444,0,Singapore,2020-01-28 23:00:00,7.0,0.0,0.0,0.0,1.352083,103.819836
445,0,Vietnam,2020-01-28 23:00:00,2.0,0.0,0.0,0.0,14.058324,108.277199
446,0,France,2020-01-28 23:00:00,4.0,0.0,0.0,0.0,46.227638,2.213749
447,0,Nepal,2020-01-28 23:00:00,1.0,0.0,0.0,0.0,28.394857,84.12400799999999
448,0,Malaysia,2020-01-28 23:00:00,7.0,0.0,0.0,0.0,4.210484,101.975766
449,Ontario,Canada,2020-01-28 23:00:00,1.0,0.0,0.0,0.0,51.253775,-85.323214
450,British Columbia,Canada,2020-01-28 23:00:00,1.0,0.0,0.0,0.0,53.7266683,-127.6476205
451,0,Cambodia,2020-01-28 23:00:00,1.0,0.0,0.0,0.0,12.565679,104.990963
452,0,Sri Lanka,2020-01-28 23:00:00,1.0,0.0,0.0,0.0,7.873053999999999,80.77179699999999
453,New South Wales,Australia,2020-01-28 23:00:00,4.0,0.0,0.0,0.0,-31.2532183,146.921099
454,Victoria,Australia,2020-01-28 23:00:00,1.0,0.0,0.0,0.0,-37.4713077,144.7851531
455,Bavaria,Germany,2020-01-28 23:00:00,4.0,0.0,0.0,0.0,48.7904472,11.4978895
456,Hubei,China,2020-01-28 18:00:00,3554.0,0.0,80.0,125.0,30.7378118,112.2384017
457,Guangdong,China,2020-01-28 18:00:00,207.0,0.0,4.0,0.0,23.3790333,113.7632828
458,Zhejiang,China,2020-01-28 18:00:00,173.0,0.0,3.0,0.0,29.1416432,119.7889248
459,Henan,China,2020-01-28 18:00:00,168.0,0.0,0.0,1.0,34.2904302,113.3823545
460,Hunan,China,2020-01-28 18:00:00,143.0,0.0,0.0,0.0,27.6252995,111.8568586
461,Chongqing,China,2020-01-28 18:00:00,132.0,0.0,0.0,0.0,29.4315861,106.912251
462,Jiangxi,China,2020-01-28 18:00:00,109.0,0.0,3.0,0.0,27.0874564,114.9042208
463,Anhui,China,2020-01-28 18:00:00,106.0,0.0,0.0,0.0,30.6006773,117.9249002
464,Shandong,China,2020-01-28 18:00:00,95.0,0.0,0.0,0.0,35.8939566,117.9249002
465,Beijing,China,2020-01-28 18:00:00,91.0,0.0,4.0,1.0,39.90419989999999,116.4073963
466,Sichuan,China,2020-01-28 18:00:00,90.0,0.0,0.0,0.0,30.26380319999999,102.8054753
467,Fujian,China,2020-01-28 18:00:00,80.0,0.0,0.0,0.0,26.4836842,117.9249002
468,Jiangsu,China,2020-01-28 18:00:00,70.0,0.0,1.0,0.0,33.1401715,119.7889248
469,Shanghai,China,2020-01-28 18:00:00,66.0,0.0,4.0,1.0,31.230416,121.473701
470,Guangxi,China,2020-01-28 18:00:00,51.0,0.0,2.0,0.0,23.7247599,108.8076195
471,Shaanxi,China,2020-01-28 18:00:00,46.0,0.0,0.0,0.0,35.3939908,109.1880047
472,Yunnan,China,2020-01-28 18:00:00,44.0,0.0,0.0,0.0,24.4752847,101.3431058
473,Hainan,China,2020-01-28 18:00:00,40.0,0.0,0.0,1.0,19.5663947,109.949686
474,Liaoning,China,2020-01-28 18:00:00,34.0,0.0,0.0,0.0,41.9436543,122.5290376
475,Hebei,China,2020-01-28 18:00:00,33.0,0.0,0.0,1.0,37.8956594,114.9042208
476,Heilongjiang,China,2020-01-28 18:00:00,33.0,0.0,0.0,1.0,47.12164720000001,128.738231
477,Shanxi,China,2020-01-28 18:00:00,27.0,0.0,0.0,0.0,37.2425649,111.8568586
478,Tianjin,China,2020-01-28 18:00:00,24.0,0.0,0.0,0.0,39.3433574,117.3616476
479,Gansu,China,2020-01-28 18:00:00,19.0,0.0,0.0,0.0,35.7518326,104.2861116
480,Inner Mongolia,China,2020-01-28 18:00:00,15.0,0.0,0.0,0.0,43.37822,115.0594815
481,Ningxia,China,2020-01-28 18:00:00,11.0,0.0,0.0,0.0,37.198731,106.1580937
482,Xinjiang,China,2020-01-28 18:00:00,10.0,0.0,0.0,0.0,42.5246357,87.5395855
483,Guizhou,China,2020-01-28 18:00:00,9.0,0.0,0.0,0.0,26.8429645,107.2902839
484,Jilin,China,2020-01-28 18:00:00,8.0,0.0,0.0,0.0,43.1520105,126.4371385
485,Taiwan,Taiwan,2020-01-28 18:00:00,8.0,0.0,0.0,0.0,23.69781,120.960515
486,Hong Kong,Hong Kong,2020-01-28 18:00:00,8.0,0.0,0.0,0.0,22.3193039,114.1693611
487,Macau,Macau,2020-01-28 18:00:00,7.0,0.0,0.0,0.0,22.198745,113.543873
488,Qinghai,China,2020-01-28 18:00:00,6.0,0.0,0.0,0.0,35.744798,96.4077358
489,Washington,United States,2020-01-28 18:00:00,1.0,0.0,0.0,0.0,47.7510741,-120.7401385
490,Illinois,United States,2020-01-28 18:00:00,1.0,0.0,0.0,0.0,40.6331249,-89.3985283
491,California,United States,2020-01-28 18:00:00,2.0,0.0,0.0,0.0,36.778261,-119.4179324
492,Arizona,United States,2020-01-28 18:00:00,1.0,0.0,0.0,0.0,34.0489281,-111.0937311
493,0,Japan,2020-01-28 18:00:00,7.0,0.0,1.0,0.0,36.204824,138.252924
494,0,Thailand,2020-01-28 18:00:00,14.0,0.0,5.0,0.0,15.870032,100.992541
495,0,South Korea,2020-01-28 18:00:00,4.0,0.0,0.0,0.0,35.907757,127.766922
496,0,Singapore,2020-01-28 18:00:00,7.0,0.0,0.0,0.0,1.352083,103.819836
497,0,Vietnam,2020-01-28 18:00:00,2.0,0.0,0.0,0.0,14.058324,108.277199
498,0,France,2020-01-28 18:00:00,4.0,0.0,0.0,0.0,46.227638,2.213749
499,0,Nepal,2020-01-28 18:00:00,1.0,0.0,0.0,0.0,28.394857,84.12400799999999
500,0,Malaysia,2020-01-28 18:00:00,4.0,0.0,0.0,0.0,4.210484,101.975766
501,Ontario,Canada,2020-01-28 18:00:00,1.0,0.0,0.0,0.0,51.253775,-85.323214
502,British Columbia,Canada,2020-01-28 18:00:00,1.0,0.0,0.0,0.0,53.7266683,-127.6476205
503,0,Cambodia,2020-01-28 18:00:00,1.0,0.0,0.0,0.0,12.565679,104.990963
504,0,Sri Lanka,2020-01-28 18:00:00,1.0,0.0,0.0,0.0,7.873053999999999,80.77179699999999
505,New South Wales,Australia,2020-01-28 18:00:00,4.0,0.0,0.0,0.0,-31.2532183,146.921099
506,Victoria,Australia,2020-01-28 18:00:00,1.0,0.0,0.0,0.0,-37.4713077,144.7851531
507,Bavaria,Germany,2020-01-28 18:00:00,4.0,0.0,0.0,0.0,48.7904472,11.4978895
508,Hubei,China,2020-01-28 13:00:00,2714.0,0.0,52.0,100.0,30.7378118,112.2384017
509,Guangdong,China,2020-01-28 13:00:00,207.0,0.0,4.0,0.0,23.3790333,113.7632828
510,Zhejiang,China,2020-01-28 13:00:00,173.0,0.0,3.0,0.0,29.1416432,119.7889248
511,Henan,China,2020-01-28 13:00:00,168.0,0.0,0.0,1.0,34.2904302,113.3823545
512,Hunan,China,2020-01-28 13:00:00,143.0,0.0,0.0,0.0,27.6252995,111.8568586
513,Chongqing,China,2020-01-28 13:00:00,132.0,0.0,0.0,0.0,29.4315861,106.912251
514,Anhui,China,2020-01-28 13:00:00,106.0,0.0,0.0,0.0,30.6006773,117.9249002
515,Shandong,China,2020-01-28 13:00:00,95.0,0.0,0.0,0.0,35.8939566,117.9249002
516,Beijing,China,2020-01-28 13:00:00,91.0,0.0,4.0,1.0,39.90419989999999,116.4073963
517,Sichuan,China,2020-01-28 13:00:00,90.0,0.0,0.0,0.0,30.26380319999999,102.8054753
518,Fujian,China,2020-01-28 13:00:00,80.0,0.0,0.0,0.0,26.4836842,117.9249002
519,Jiangxi,China,2020-01-28 13:00:00,72.0,0.0,3.0,0.0,27.0874564,114.9042208
520,Jiangsu,China,2020-01-28 13:00:00,70.0,0.0,1.0,0.0,33.1401715,119.7889248
521,Shanghai,China,2020-01-28 13:00:00,66.0,0.0,4.0,1.0,31.230416,121.473701
522,Guangxi,China,2020-01-28 13:00:00,51.0,0.0,2.0,0.0,23.7247599,108.8076195
523,Shaanxi,China,2020-01-28 13:00:00,46.0,0.0,0.0,0.0,35.3939908,109.1880047
524,Yunnan,China,2020-01-28 13:00:00,44.0,0.0,0.0,0.0,24.4752847,101.3431058
525,Hainan,China,2020-01-28 13:00:00,40.0,0.0,0.0,1.0,19.5663947,109.949686
526,Liaoning,China,2020-01-28 13:00:00,34.0,0.0,0.0,0.0,41.9436543,122.5290376
527,Heilongjiang,China,2020-01-28 13:00:00,33.0,0.0,0.0,1.0,47.12164720000001,128.738231
528,Hebei,China,2020-01-28 13:00:00,33.0,0.0,0.0,1.0,37.8956594,114.9042208
529,Tianjin,China,2020-01-28 13:00:00,24.0,0.0,0.0,0.0,39.3433574,117.3616476
530,Shanxi,China,2020-01-28 13:00:00,20.0,0.0,0.0,0.0,37.2425649,111.8568586
531,Gansu,China,2020-01-28 13:00:00,19.0,0.0,0.0,0.0,35.7518326,104.2861116
532,Inner Mongolia,China,2020-01-28 13:00:00,15.0,0.0,0.0,0.0,43.37822,115.0594815
533,Ningxia,China,2020-01-28 13:00:00,11.0,0.0,0.0,0.0,37.198731,106.1580937
534,Xinjiang,China,2020-01-28 13:00:00,10.0,0.0,0.0,0.0,42.5246357,87.5395855
535,Guizhou,China,2020-01-28 13:00:00,9.0,0.0,0.0,0.0,26.8429645,107.2902839
536,Jilin,China,2020-01-28 13:00:00,8.0,0.0,0.0,0.0,43.1520105,126.4371385
537,Taiwan,Taiwan,2020-01-28 13:00:00,8.0,0.0,0.0,0.0,23.69781,120.960515
538,Hong Kong,Hong Kong,2020-01-28 13:00:00,8.0,0.0,0.0,0.0,22.3193039,114.1693611
539,Macau,Macau,2020-01-28 13:00:00,7.0,0.0,0.0,0.0,22.198745,113.543873
540,Qinghai,China,2020-01-28 13:00:00,6.0,0.0,0.0,0.0,35.744798,96.4077358
541,Washington,United States,2020-01-28 13:00:00,1.0,0.0,0.0,0.0,47.7510741,-120.7401385
542,Illinois,United States,2020-01-28 13:00:00,1.0,0.0,0.0,0.0,40.6331249,-89.3985283
543,California,United States,2020-01-28 13:00:00,2.0,0.0,0.0,0.0,36.778261,-119.4179324
544,Arizona,United States,2020-01-28 13:00:00,1.0,0.0,0.0,0.0,34.0489281,-111.0937311
545,0,Japan,2020-01-28 13:00:00,7.0,0.0,1.0,0.0,36.204824,138.252924
546,0,Thailand,2020-01-28 13:00:00,14.0,0.0,5.0,0.0,15.870032,100.992541
547,0,South Korea,2020-01-28 13:00:00,4.0,0.0,0.0,0.0,35.907757,127.766922
548,0,Singapore,2020-01-28 13:00:00,7.0,0.0,0.0,0.0,1.352083,103.819836
549,0,Vietnam,2020-01-28 13:00:00,2.0,0.0,0.0,0.0,14.058324,108.277199
550,0,France,2020-01-28 13:00:00,3.0,0.0,0.0,0.0,46.227638,2.213749
551,0,Nepal,2020-01-28 13:00:00,1.0,0.0,0.0,0.0,28.394857,84.12400799999999
552,0,Malaysia,2020-01-28 13:00:00,4.0,0.0,0.0,0.0,4.210484,101.975766
553,Ontario,Canada,2020-01-28 13:00:00,2.0,0.0,0.0,0.0,51.253775,-85.323214
554,0,Cambodia,2020-01-28 13:00:00,1.0,0.0,0.0,0.0,12.565679,104.990963
555,0,Sri Lanka,2020-01-28 13:00:00,1.0,0.0,0.0,0.0,7.873053999999999,80.77179699999999
556,New South Wales,Australia,2020-01-28 13:00:00,4.0,0.0,0.0,0.0,-31.2532183,146.921099
557,Victoria,Australia,2020-01-28 13:00:00,1.0,0.0,0.0,0.0,-37.4713077,144.7851531
558,Bavaria,Germany,2020-01-28 13:00:00,1.0,0.0,0.0,0.0,48.7904472,11.4978895
559,Hubei,China,2020-01-27 20:30:00,2714.0,0.0,47.0,100.0,30.7378118,112.2384017
560,Zhejiang,China,2020-01-27 20:30:00,173.0,0.0,1.0,0.0,29.1416432,119.7889248
561,Henan,China,2020-01-27 20:30:00,168.0,0.0,0.0,1.0,34.2904302,113.3823545
562,Guangdong,China,2020-01-27 20:30:00,151.0,0.0,4.0,0.0,23.3790333,113.7632828
563,Chongqing,China,2020-01-27 20:30:00,132.0,0.0,0.0,0.0,29.4315861,106.912251
564,Anhui,China,2020-01-27 20:30:00,106.0,0.0,0.0,0.0,30.6006773,117.9249002
565,Hunan,China,2020-01-27 20:30:00,100.0,0.0,0.0,0.0,27.6252995,111.8568586
566,Sichuan,China,2020-01-27 20:30:00,90.0,0.0,0.0,0.0,30.26380319999999,102.8054753
567,Shandong,China,2020-01-27 20:30:00,87.0,0.0,0.0,1.0,35.8939566,117.9249002
568,Beijing,China,2020-01-27 20:30:00,80.0,0.0,2.0,1.0,39.90419989999999,116.4073963
569,Jiangxi,China,2020-01-27 20:30:00,72.0,0.0,2.0,0.0,27.0874564,114.9042208
570,Jiangsu,China,2020-01-27 20:30:00,70.0,0.0,1.0,0.0,33.1401715,119.7889248
571,Shanghai,China,2020-01-27 20:30:00,66.0,0.0,3.0,1.0,31.230416,121.473701
572,Fujian,China,2020-01-27 20:30:00,59.0,0.0,0.0,0.0,26.4836842,117.9249002
573,Guangxi,China,2020-01-27 20:30:00,51.0,0.0,0.0,0.0,23.7247599,108.8076195
574,Shaanxi,China,2020-01-27 20:30:00,35.0,0.0,0.0,0.0,35.3939908,109.1880047
575,Hainan,China,2020-01-27 20:30:00,33.0,0.0,0.0,1.0,19.5663947,109.949686
576,Hebei,China,2020-01-27 20:30:00,33.0,0.0,0.0,1.0,37.8956594,114.9042208
577,Heilongjiang,China,2020-01-27 20:30:00,30.0,0.0,0.0,1.0,47.12164720000001,128.738231
578,Liaoning,China,2020-01-27 20:30:00,27.0,0.0,0.0,0.0,41.9436543,122.5290376
579,Yunnan,China,2020-01-27 20:30:00,26.0,0.0,0.0,0.0,24.4752847,101.3431058
580,Tianjin,China,2020-01-27 20:30:00,23.0,0.0,0.0,0.0,39.3433574,117.3616476
581,Shanxi,China,2020-01-27 20:30:00,20.0,0.0,0.0,0.0,37.2425649,111.8568586
582,Gansu,China,2020-01-27 20:30:00,19.0,0.0,0.0,0.0,35.7518326,104.2861116
583,Inner Mongolia,China,2020-01-27 20:30:00,11.0,0.0,0.0,0.0,43.37822,115.0594815
584,Guizhou,China,2020-01-27 20:30:00,9.0,0.0,0.0,0.0,26.8429645,107.2902839
585,Hong Kong,Hong Kong,2020-01-27 20:30:00,8.0,0.0,0.0,0.0,22.3193039,114.1693611
586,Ningxia,China,2020-01-27 20:30:00,7.0,0.0,0.0,0.0,37.198731,106.1580937
587,Jilin,China,2020-01-27 20:30:00,6.0,0.0,0.0,0.0,43.1520105,126.4371385
588,Macau,Macau,2020-01-27 20:30:00,6.0,0.0,0.0,0.0,22.198745,113.543873
589,Qinghai,China,2020-01-27 20:30:00,6.0,0.0,0.0,0.0,35.744798,96.4077358
590,Taiwan,Taiwan,2020-01-27 20:30:00,5.0,0.0,0.0,0.0,23.69781,120.960515
591,Xinjiang,China,2020-01-27 20:30:00,5.0,0.0,0.0,0.0,42.5246357,87.5395855
592,Washington,United States,2020-01-27 20:30:00,1.0,0.0,0.0,0.0,47.7510741,-120.7401385
593,Illinois,United States,2020-01-27 20:30:00,1.0,0.0,0.0,0.0,40.6331249,-89.3985283
594,California,United States,2020-01-27 20:30:00,2.0,0.0,0.0,0.0,36.778261,-119.4179324
595,Arizona,United States,2020-01-27 20:30:00,1.0,0.0,0.0,0.0,34.0489281,-111.0937311
596,0,Japan,2020-01-27 20:30:00,4.0,0.0,1.0,0.0,36.204824,138.252924
597,0,Thailand,2020-01-27 20:30:00,8.0,0.0,2.0,0.0,15.870032,100.992541
598,0,South Korea,2020-01-27 20:30:00,4.0,0.0,0.0,0.0,35.907757,127.766922
599,0,Singapore,2020-01-27 20:30:00,5.0,0.0,0.0,0.0,1.352083,103.819836
600,0,Vietnam,2020-01-27 20:30:00,2.0,0.0,0.0,0.0,14.058324,108.277199
601,0,France,2020-01-27 20:30:00,3.0,0.0,0.0,0.0,46.227638,2.213749
602,0,Nepal,2020-01-27 20:30:00,1.0,0.0,0.0,0.0,28.394857,84.12400799999999
603,0,Malaysia,2020-01-27 20:30:00,4.0,0.0,0.0,0.0,4.210484,101.975766
604,Ontario,Canada,2020-01-27 20:30:00,1.0,0.0,0.0,0.0,51.253775,-85.323214
605,0,Cambodia,2020-01-27 20:30:00,1.0,0.0,0.0,0.0,12.565679,104.990963
606,0,Sri Lanka,2020-01-27 20:30:00,1.0,0.0,0.0,0.0,7.873053999999999,80.77179699999999
607,0,Ivory Coast,2020-01-27 20:30:00,0.0,0.0,0.0,0.0,7.539988999999999,-5.547079999999999
608,New South Wales,Australia,2020-01-27 20:30:00,4.0,0.0,0.0,0.0,-31.2532183,146.921099
609,Victoria,Australia,2020-01-27 20:30:00,1.0,0.0,0.0,0.0,-37.4713077,144.7851531
610,Bavaria,Germany,2020-01-27 20:30:00,1.0,0.0,0.0,0.0,48.7904472,11.4978895
611,Hubei,China,2020-01-27 19:00:00,1423.0,0.0,45.0,76.0,30.7378118,112.2384017
612,Guangdong,China,2020-01-27 19:00:00,151.0,0.0,4.0,0.0,23.3790333,113.7632828
613,Zhejiang,China,2020-01-27 19:00:00,128.0,0.0,1.0,0.0,29.1416432,119.7889248
614,Henan,China,2020-01-27 19:00:00,128.0,0.0,0.0,1.0,34.2904302,113.3823545
615,Chongqing,China,2020-01-27 19:00:00,110.0,0.0,0.0,0.0,29.4315861,106.912251
616,Hunan,China,2020-01-27 19:00:00,100.0,0.0,0.0,0.0,27.6252995,111.8568586
617,Beijing,China,2020-01-27 19:00:00,80.0,0.0,2.0,1.0,39.90419989999999,116.4073963
618,Shandong,China,2020-01-27 19:00:00,75.0,0.0,0.0,0.0,35.8939566,117.9249002
619,Jiangxi,China,2020-01-27 19:00:00,72.0,0.0,2.0,0.0,27.0874564,114.9042208
620,Anhui,China,2020-01-27 19:00:00,70.0,0.0,0.0,0.0,30.6006773,117.9249002
621,Sichuan,China,2020-01-27 19:00:00,69.0,0.0,0.0,0.0,30.26380319999999,102.8054753
622,Fujian,China,2020-01-27 19:00:00,59.0,0.0,0.0,0.0,26.4836842,117.9249002
623,Shanghai,China,2020-01-27 19:00:00,53.0,0.0,3.0,1.0,31.230416,121.473701
624,Jiangsu,China,2020-01-27 19:00:00,47.0,0.0,1.0,0.0,33.1401715,119.7889248
625,Guangxi,China,2020-01-27 19:00:00,46.0,0.0,0.0,0.0,23.7247599,108.8076195
626,Shaanxi,China,2020-01-27 19:00:00,35.0,0.0,0.0,0.0,35.3939908,109.1880047
627,Hainan,China,2020-01-27 19:00:00,33.0,0.0,0.0,1.0,19.5663947,109.949686
628,Liaoning,China,2020-01-27 19:00:00,27.0,0.0,0.0,0.0,41.9436543,122.5290376
629,Yunnan,China,2020-01-27 19:00:00,26.0,0.0,0.0,0.0,24.4752847,101.3431058
630,Tianjin,China,2020-01-27 19:00:00,23.0,0.0,0.0,0.0,39.3433574,117.3616476
631,Heilongjiang,China,2020-01-27 19:00:00,21.0,0.0,0.0,1.0,47.12164720000001,128.738231
632,Hebei,China,2020-01-27 19:00:00,18.0,0.0,0.0,1.0,37.8956594,114.9042208
633,Gansu,China,2020-01-27 19:00:00,14.0,0.0,0.0,0.0,35.7518326,104.2861116
634,Shanxi,China,2020-01-27 19:00:00,13.0,0.0,0.0,0.0,37.2425649,111.8568586
635,Inner Mongolia,China,2020-01-27 19:00:00,11.0,0.0,0.0,0.0,43.37822,115.0594815
636,Hong Kong,Hong Kong,2020-01-27 19:00:00,8.0,0.0,0.0,0.0,22.3193039,114.1693611
637,Guizhou,China,2020-01-27 19:00:00,7.0,0.0,0.0,0.0,26.8429645,107.2902839
638,Ningxia,China,2020-01-27 19:00:00,7.0,0.0,0.0,0.0,37.198731,106.1580937
639,Jilin,China,2020-01-27 19:00:00,6.0,0.0,0.0,0.0,43.1520105,126.4371385
640,Macau,Macau,2020-01-27 19:00:00,6.0,0.0,0.0,0.0,22.198745,113.543873
641,Qinghai,China,2020-01-27 19:00:00,6.0,0.0,0.0,0.0,35.744798,96.4077358
642,Taiwan,Taiwan,2020-01-27 19:00:00,5.0,0.0,0.0,0.0,23.69781,120.960515
643,Xinjiang,China,2020-01-27 19:00:00,5.0,0.0,0.0,0.0,42.5246357,87.5395855
644,Washington,United States,2020-01-27 19:00:00,1.0,0.0,0.0,0.0,47.7510741,-120.7401385
645,Illinois,United States,2020-01-27 19:00:00,1.0,0.0,0.0,0.0,40.6331249,-89.3985283
646,California,United States,2020-01-27 19:00:00,2.0,0.0,0.0,0.0,36.778261,-119.4179324
647,Arizona,United States,2020-01-27 19:00:00,1.0,0.0,0.0,0.0,34.0489281,-111.0937311
648,0,Japan,2020-01-27 19:00:00,4.0,0.0,1.0,0.0,36.204824,138.252924
649,0,Thailand,2020-01-27 19:00:00,8.0,0.0,2.0,0.0,15.870032,100.992541
650,0,South Korea,2020-01-27 19:00:00,4.0,0.0,0.0,0.0,35.907757,127.766922
651,0,Singapore,2020-01-27 19:00:00,5.0,0.0,0.0,0.0,1.352083,103.819836
652,0,Vietnam,2020-01-27 19:00:00,2.0,0.0,0.0,0.0,14.058324,108.277199
653,0,France,2020-01-27 19:00:00,3.0,0.0,0.0,0.0,46.227638,2.213749
654,0,Nepal,2020-01-27 19:00:00,1.0,0.0,0.0,0.0,28.394857,84.12400799999999
655,0,Malaysia,2020-01-27 19:00:00,4.0,0.0,0.0,0.0,4.210484,101.975766
656,Ontario,Canada,2020-01-27 19:00:00,1.0,0.0,0.0,0.0,51.253775,-85.323214
657,0,Cambodia,2020-01-27 19:00:00,1.0,0.0,0.0,0.0,12.565679,104.990963
658,0,Sri Lanka,2020-01-27 19:00:00,1.0,0.0,0.0,0.0,7.873053999999999,80.77179699999999
659,0,Ivory Coast,2020-01-27 19:00:00,1.0,0.0,0.0,0.0,7.539988999999999,-5.547079999999999
660,New South Wales,Australia,2020-01-27 19:00:00,4.0,0.0,0.0,0.0,-31.2532183,146.921099
661,Victoria,Australia,2020-01-27 19:00:00,1.0,0.0,0.0,0.0,-37.4713077,144.7851531
662,Hubei,China,2020-01-27 09:00:00,1423.0,0.0,45.0,76.0,30.7378118,112.2384017
663,Guangdong,China,2020-01-27 09:00:00,151.0,0.0,3.0,0.0,23.3790333,113.7632828
664,Zhejiang,China,2020-01-27 09:00:00,128.0,0.0,1.0,0.0,29.1416432,119.7889248
665,Henan,China,2020-01-27 09:00:00,128.0,0.0,0.0,0.0,34.2904302,113.3823545
666,Chongqing,China,2020-01-27 09:00:00,110.0,0.0,0.0,1.0,29.4315861,106.912251
667,Hunan,China,2020-01-27 09:00:00,100.0,0.0,0.0,0.0,27.6252995,111.8568586
668,Shandong,China,2020-01-27 09:00:00,75.0,0.0,0.0,0.0,35.8939566,117.9249002
669,Beijing,China,2020-01-27 09:00:00,72.0,0.0,2.0,0.0,39.90419989999999,116.4073963
670,Anhui,China,2020-01-27 09:00:00,70.0,0.0,0.0,0.0,30.6006773,117.9249002
671,Sichuan,China,2020-01-27 09:00:00,69.0,0.0,0.0,0.0,30.26380319999999,102.8054753
672,Fujian,China,2020-01-27 09:00:00,56.0,0.0,0.0,0.0,26.4836842,117.9249002
673,Shanghai,China,2020-01-27 09:00:00,53.0,0.0,3.0,1.0,31.230416,121.473701
674,Jiangxi,China,2020-01-27 09:00:00,48.0,0.0,1.0,0.0,27.0874564,114.9042208
675,Jiangsu,China,2020-01-27 09:00:00,47.0,0.0,1.0,0.0,33.1401715,119.7889248
676,Guangxi,China,2020-01-27 09:00:00,46.0,0.0,0.0,0.0,23.7247599,108.8076195
677,Shaanxi,China,2020-01-27 09:00:00,35.0,0.0,0.0,0.0,35.3939908,109.1880047
678,Hainan,China,2020-01-27 09:00:00,33.0,0.0,0.0,1.0,19.5663947,109.949686
679,Liaoning,China,2020-01-27 09:00:00,27.0,0.0,0.0,0.0,41.9436543,122.5290376
680,Yunnan,China,2020-01-27 09:00:00,26.0,0.0,0.0,0.0,24.4752847,101.3431058
681,Tianjin,China,2020-01-27 09:00:00,22.0,0.0,0.0,0.0,39.3433574,117.3616476
682,Heilongjiang,China,2020-01-27 09:00:00,21.0,0.0,0.0,1.0,47.12164720000001,128.738231
683,Hebei,China,2020-01-27 09:00:00,18.0,0.0,0.0,1.0,37.8956594,114.9042208
684,Gansu,China,2020-01-27 09:00:00,14.0,0.0,0.0,0.0,35.7518326,104.2861116
685,Shanxi,China,2020-01-27 09:00:00,13.0,0.0,0.0,0.0,37.2425649,111.8568586
686,Inner Mongolia,China,2020-01-27 09:00:00,11.0,0.0,0.0,0.0,43.37822,115.0594815
687,Hong Kong,Hong Kong,2020-01-27 09:00:00,8.0,0.0,0.0,0.0,22.3193039,114.1693611
688,Guizhou,China,2020-01-27 09:00:00,7.0,0.0,0.0,0.0,26.8429645,107.2902839
689,Ningxia,China,2020-01-27 09:00:00,7.0,0.0,0.0,0.0,37.198731,106.1580937
690,Jilin,China,2020-01-27 09:00:00,6.0,0.0,0.0,0.0,43.1520105,126.4371385
691,Macau,Macau,2020-01-27 09:00:00,6.0,0.0,0.0,0.0,22.198745,113.543873
692,Taiwan,Taiwan,2020-01-27 09:00:00,5.0,0.0,0.0,0.0,23.69781,120.960515
693,Xinjiang,China,2020-01-27 09:00:00,5.0,0.0,0.0,0.0,42.5246357,87.5395855
694,Qinghai,China,2020-01-27 09:00:00,4.0,0.0,0.0,0.0,35.744798,96.4077358
695,Washington,United States,2020-01-27 09:00:00,1.0,0.0,0.0,0.0,47.7510741,-120.7401385
696,Illinois,United States,2020-01-27 09:00:00,1.0,0.0,0.0,0.0,40.6331249,-89.3985283
697,California,United States,2020-01-27 09:00:00,2.0,0.0,0.0,0.0,36.778261,-119.4179324
698,Arizona,United States,2020-01-27 09:00:00,1.0,0.0,0.0,0.0,34.0489281,-111.0937311
699,0,Japan,2020-01-27 09:00:00,4.0,0.0,1.0,0.0,36.204824,138.252924
700,0,Thailand,2020-01-27 09:00:00,8.0,0.0,2.0,0.0,15.870032,100.992541
701,0,South Korea,2020-01-27 09:00:00,4.0,0.0,0.0,0.0,35.907757,127.766922
702,0,Singapore,2020-01-27 09:00:00,4.0,0.0,0.0,0.0,1.352083,103.819836
703,0,Vietnam,2020-01-27 09:00:00,2.0,0.0,0.0,0.0,14.058324,108.277199
704,0,France,2020-01-27 09:00:00,3.0,0.0,0.0,0.0,46.227638,2.213749
705,0,Australia,2020-01-27 09:00:00,5.0,0.0,0.0,0.0,-25.274398,133.775136
706,0,Nepal,2020-01-27 09:00:00,1.0,0.0,0.0,0.0,28.394857,84.12400799999999
707,0,Malaysia,2020-01-27 09:00:00,4.0,0.0,0.0,0.0,4.210484,101.975766
708,Ontario,Canada,2020-01-27 09:00:00,1.0,0.0,0.0,0.0,51.253775,-85.323214
709,0,Cambodia,2020-01-27 09:00:00,1.0,0.0,0.0,0.0,12.565679,104.990963
710,Hubei,China,2020-01-26 23:00:00,1423.0,0.0,44.0,76.0,30.7378118,112.2384017
711,Guangdong,China,2020-01-26 23:00:00,146.0,0.0,2.0,0.0,23.3790333,113.7632828
712,Zhejiang,China,2020-01-26 23:00:00,128.0,0.0,1.0,0.0,29.1416432,119.7889248
713,Henan,China,2020-01-26 23:00:00,128.0,0.0,0.0,1.0,34.2904302,113.3823545
714,Chongqing,China,2020-01-26 23:00:00,110.0,0.0,0.0,0.0,29.4315861,106.912251
715,Hunan,China,2020-01-26 23:00:00,100.0,0.0,0.0,0.0,27.6252995,111.8568586
716,Anhui,China,2020-01-26 23:00:00,70.0,0.0,0.0,0.0,30.6006773,117.9249002
717,Sichuan,China,2020-01-26 23:00:00,69.0,0.0,0.0,0.0,30.26380319999999,102.8054753
718,Beijing,China,2020-01-26 23:00:00,68.0,0.0,2.0,0.0,39.90419989999999,116.4073963
719,Shandong,China,2020-01-26 23:00:00,63.0,0.0,0.0,0.0,35.8939566,117.9249002
720,Shanghai,China,2020-01-26 23:00:00,53.0,0.0,1.0,1.0,31.230416,121.473701
721,Jiangxi,China,2020-01-26 23:00:00,48.0,0.0,0.0,0.0,27.0874564,114.9042208
722,Jiangsu,China,2020-01-26 23:00:00,47.0,0.0,1.0,0.0,33.1401715,119.7889248
723,Guangxi,China,2020-01-26 23:00:00,46.0,0.0,0.0,0.0,23.7247599,108.8076195
724,Fujian,China,2020-01-26 23:00:00,35.0,0.0,0.0,0.0,26.4836842,117.9249002
725,Liaoning,China,2020-01-26 23:00:00,23.0,0.0,0.0,0.0,41.9436543,122.5290376
726,Hainan,China,2020-01-26 23:00:00,22.0,0.0,0.0,0.0,19.5663947,109.949686
727,Shaanxi,China,2020-01-26 23:00:00,22.0,0.0,0.0,0.0,35.3939908,109.1880047
728,Heilongjiang,China,2020-01-26 23:00:00,21.0,0.0,0.0,1.0,47.12164720000001,128.738231
729,Yunnan,China,2020-01-26 23:00:00,19.0,0.0,0.0,0.0,24.4752847,101.3431058
730,Hebei,China,2020-01-26 23:00:00,18.0,0.0,0.0,1.0,37.8956594,114.9042208
731,Tianjin,China,2020-01-26 23:00:00,14.0,0.0,0.0,0.0,39.3433574,117.3616476
732,Gansu,China,2020-01-26 23:00:00,14.0,0.0,0.0,0.0,35.7518326,104.2861116
733,Shanxi,China,2020-01-26 23:00:00,13.0,0.0,0.0,0.0,37.2425649,111.8568586
734,Inner Mongolia,China,2020-01-26 23:00:00,11.0,0.0,0.0,0.0,43.37822,115.0594815
735,Hong Kong,Hong Kong,2020-01-26 23:00:00,8.0,0.0,0.0,0.0,22.3193039,114.1693611
736,Guizhou,China,2020-01-26 23:00:00,7.0,0.0,0.0,0.0,26.8429645,107.2902839
737,Jilin,China,2020-01-26 23:00:00,6.0,0.0,0.0,0.0,43.1520105,126.4371385
738,Macau,Macau,2020-01-26 23:00:00,6.0,0.0,0.0,0.0,22.198745,113.543873
739,Xinjiang,China,2020-01-26 23:00:00,5.0,0.0,0.0,0.0,42.5246357,87.5395855
740,Ningxia,China,2020-01-26 23:00:00,4.0,0.0,0.0,0.0,37.198731,106.1580937
741,Taiwan,Taiwan,2020-01-26 23:00:00,4.0,0.0,0.0,0.0,23.69781,120.960515
742,Qinghai,China,2020-01-26 23:00:00,4.0,0.0,0.0,0.0,35.744798,96.4077358
743,Washington,United States,2020-01-26 23:00:00,1.0,0.0,0.0,0.0,47.7510741,-120.7401385
744,Illinois,United States,2020-01-26 23:00:00,1.0,0.0,0.0,0.0,40.6331249,-89.3985283
745,California,United States,2020-01-26 23:00:00,2.0,0.0,0.0,0.0,36.778261,-119.4179324
746,Arizona,United States,2020-01-26 23:00:00,1.0,0.0,0.0,0.0,34.0489281,-111.0937311
747,0,Japan,2020-01-26 23:00:00,4.0,0.0,1.0,0.0,36.204824,138.252924
748,0,Thailand,2020-01-26 23:00:00,8.0,0.0,2.0,0.0,15.870032,100.992541
749,0,South Korea,2020-01-26 23:00:00,3.0,0.0,0.0,0.0,35.907757,127.766922
750,0,Singapore,2020-01-26 23:00:00,4.0,0.0,0.0,0.0,1.352083,103.819836
751,0,Vietnam,2020-01-26 23:00:00,2.0,0.0,0.0,0.0,14.058324,108.277199
752,0,France,2020-01-26 23:00:00,3.0,0.0,0.0,0.0,46.227638,2.213749
753,0,Australia,2020-01-26 23:00:00,4.0,0.0,0.0,0.0,-25.274398,133.775136
754,0,Nepal,2020-01-26 23:00:00,1.0,0.0,0.0,0.0,28.394857,84.12400799999999
755,0,Malaysia,2020-01-26 23:00:00,4.0,0.0,0.0,0.0,4.210484,101.975766
756,Ontario,Canada,2020-01-26 23:00:00,1.0,0.0,0.0,0.0,51.253775,-85.323214
757,Hubei,China,2020-01-26 11:00:00,1058.0,0.0,42.0,52.0,30.7378118,112.2384017
758,Guangdong,China,2020-01-26 11:00:00,111.0,0.0,2.0,0.0,23.3790333,113.7632828
759,Zhejiang,China,2020-01-26 11:00:00,104.0,0.0,1.0,0.0,29.1416432,119.7889248
760,Henan,China,2020-01-26 11:00:00,83.0,3.0,0.0,1.0,34.2904302,113.3823545
761,Chongqing,China,2020-01-26 11:00:00,75.0,0.0,0.0,0.0,29.4315861,106.912251
762,Hunan,China,2020-01-26 11:00:00,69.0,0.0,0.0,0.0,27.6252995,111.8568586
763,Beijing,China,2020-01-26 11:00:00,68.0,0.0,2.0,0.0,39.90419989999999,116.4073963
764,Anhui,China,2020-01-26 11:00:00,60.0,4.0,0.0,0.0,30.6006773,117.9249002
765,Shandong,China,2020-01-26 11:00:00,46.0,0.0,0.0,0.0,35.8939566,117.9249002
766,Sichuan,China,2020-01-26 11:00:00,44.0,4.0,0.0,0.0,30.26380319999999,102.8054753
767,Shanghai,China,2020-01-26 11:00:00,40.0,72.0,1.0,1.0,31.230416,121.473701
768,Guangxi,China,2020-01-26 11:00:00,36.0,0.0,0.0,0.0,23.7247599,108.8076195
769,Jiangxi,China,2020-01-26 11:00:00,36.0,0.0,0.0,0.0,27.0874564,114.9042208
770,Fujian,China,2020-01-26 11:00:00,35.0,20.0,0.0,0.0,26.4836842,117.9249002
771,Jiangsu,China,2020-01-26 11:00:00,33.0,0.0,1.0,0.0,33.1401715,119.7889248
772,Hainan,China,2020-01-26 11:00:00,22.0,0.0,0.0,0.0,19.5663947,109.949686
773,Shaanxi,China,2020-01-26 11:00:00,22.0,0.0,0.0,0.0,35.3939908,109.1880047
774,Liaoning,China,2020-01-26 11:00:00,21.0,0.0,0.0,0.0,41.9436543,122.5290376
775,Yunnan,China,2020-01-26 11:00:00,16.0,36.0,0.0,0.0,24.4752847,101.3431058
776,Heilongjiang,China,2020-01-26 11:00:00,15.0,0.0,0.0,1.0,47.12164720000001,128.738231
777,Tianjin,China,2020-01-26 11:00:00,14.0,0.0,0.0,0.0,39.3433574,117.3616476
778,Hebei,China,2020-01-26 11:00:00,13.0,0.0,0.0,1.0,37.8956594,114.9042208
779,Shanxi,China,2020-01-26 11:00:00,9.0,0.0,0.0,0.0,37.2425649,111.8568586
780,Hong Kong,Hong Kong,2020-01-26 11:00:00,8.0,244.0,0.0,0.0,22.3193039,114.1693611
781,Inner Mongolia,China,2020-01-26 11:00:00,7.0,0.0,0.0,0.0,43.37822,115.0594815
782,Gansu,China,2020-01-26 11:00:00,7.0,0.0,0.0,0.0,35.7518326,104.2861116
783,Guizhou,China,2020-01-26 11:00:00,5.0,0.0,0.0,0.0,26.8429645,107.2902839
784,Macau,Macau,2020-01-26 11:00:00,5.0,0.0,0.0,0.0,22.198745,113.543873
785,Ningxia,China,2020-01-26 11:00:00,4.0,0.0,0.0,0.0,37.198731,106.1580937
786,Jilin,China,2020-01-26 11:00:00,4.0,0.0,0.0,0.0,43.1520105,126.4371385
787,Taiwan,Taiwan,2020-01-26 11:00:00,4.0,0.0,0.0,0.0,23.69781,120.960515
788,Xinjiang,China,2020-01-26 11:00:00,4.0,0.0,0.0,0.0,42.5246357,87.5395855
789,Qinghai,China,2020-01-26 11:00:00,1.0,0.0,0.0,0.0,35.744798,96.4077358
790,Washington,United States,2020-01-26 11:00:00,1.0,0.0,0.0,0.0,47.7510741,-120.7401385
791,Illinois,United States,2020-01-26 11:00:00,1.0,0.0,0.0,0.0,40.6331249,-89.3985283
792,California,United States,2020-01-26 11:00:00,1.0,0.0,0.0,0.0,36.778261,-119.4179324
793,0,Japan,2020-01-26 11:00:00,4.0,0.0,1.0,0.0,36.204824,138.252924
794,0,Thailand,2020-01-26 11:00:00,8.0,0.0,2.0,0.0,15.870032,100.992541
795,0,South Korea,2020-01-26 11:00:00,3.0,0.0,0.0,0.0,35.907757,127.766922
796,0,Singapore,2020-01-26 11:00:00,4.0,0.0,0.0,0.0,1.352083,103.819836
797,0,Vietnam,2020-01-26 11:00:00,2.0,0.0,0.0,0.0,14.058324,108.277199
798,0,France,2020-01-26 11:00:00,3.0,0.0,0.0,0.0,46.227638,2.213749
799,0,Australia,2020-01-26 11:00:00,4.0,0.0,0.0,0.0,-25.274398,133.775136
800,0,Nepal,2020-01-26 11:00:00,1.0,0.0,0.0,0.0,28.394857,84.12400799999999
801,0,Malaysia,2020-01-26 11:00:00,4.0,0.0,0.0,0.0,4.210484,101.975766
802,Ontario,Canada,2020-01-26 11:00:00,1.0,0.0,0.0,0.0,51.253775,-85.323214
805,Guangdong,China,2020-01-25 12:00:00,98.0,0.0,2.0,0.0,23.3790333,113.7632828
806,Henan,China,2020-01-25 12:00:00,83.0,3.0,0.0,1.0,34.2904302,113.3823545
807,Chongqing,China,2020-01-25 12:00:00,75.0,0.0,0.0,0.0,29.4315861,106.912251
808,Hunan,China,2020-01-25 12:00:00,69.0,0.0,0.0,0.0,27.6252995,111.8568586
809,Anhui,China,2020-01-25 12:00:00,60.0,4.0,0.0,0.0,30.6006773,117.9249002
810,Beijing,China,2020-01-25 12:00:00,51.0,0.0,2.0,0.0,39.90419989999999,116.4073963
811,Sichuan,China,2020-01-25 12:00:00,44.0,4.0,0.0,0.0,30.26380319999999,102.8054753
812,Shanghai,China,2020-01-25 12:00:00,40.0,72.0,1.0,1.0,31.230416,121.473701
813,Shandong,China,2020-01-25 12:00:00,39.0,0.0,0.0,0.0,35.8939566,117.9249002
814,Jiangxi,China,2020-01-25 12:00:00,36.0,0.0,0.0,0.0,27.0874564,114.9042208
815,Guangxi,China,2020-01-25 12:00:00,33.0,0.0,0.0,0.0,23.7247599,108.8076195
816,Jiangsu,China,2020-01-25 12:00:00,31.0,0.0,1.0,0.0,33.1401715,119.7889248
817,Hainan,China,2020-01-25 12:00:00,19.0,0.0,0.0,0.0,19.5663947,109.949686
818,Liaoning,China,2020-01-25 12:00:00,19.0,0.0,0.0,0.0,41.9436543,122.5290376
819,Fujian,China,2020-01-25 12:00:00,18.0,20.0,0.0,1.0,26.4836842,117.9249002
820,Heilongjiang,China,2020-01-25 12:00:00,15.0,0.0,0.0,0.0,47.12164720000001,128.738231
821,Shaanxi,China,2020-01-25 12:00:00,15.0,0.0,0.0,0.0,35.3939908,109.1880047
822,Tianjin,China,2020-01-25 12:00:00,13.0,0.0,0.0,0.0,39.3433574,117.3616476
823,Hebei,China,2020-01-25 12:00:00,13.0,0.0,0.0,1.0,37.8956594,114.9042208
824,Yunnan,China,2020-01-25 12:00:00,11.0,58.0,0.0,0.0,24.4752847,101.3431058
825,Shanxi,China,2020-01-25 12:00:00,9.0,0.0,0.0,0.0,37.2425649,111.8568586
826,Inner Mongolia,China,2020-01-25 12:00:00,7.0,0.0,0.0,0.0,43.37822,115.0594815
827,Gansu,China,2020-01-25 12:00:00,7.0,0.0,0.0,0.0,35.7518326,104.2861116
828,Guizhou,China,2020-01-25 12:00:00,5.0,0.0,0.0,0.0,26.8429645,107.2902839
829,Hong Kong,Hong Kong,2020-01-25 12:00:00,5.0,244.0,0.0,0.0,22.3193039,114.1693611
830,Ningxia,China,2020-01-25 12:00:00,4.0,1.0,0.0,0.0,37.198731,106.1580937
831,Jilin,China,2020-01-25 12:00:00,4.0,0.0,0.0,0.0,43.1520105,126.4371385
832,Xinjiang,China,2020-01-25 12:00:00,4.0,0.0,0.0,0.0,42.5246357,87.5395855
833,Taiwan,Taiwan,2020-01-25 12:00:00,3.0,0.0,0.0,0.0,23.69781,120.960515
834,Macau,Macau,2020-01-25 12:00:00,2.0,0.0,0.0,0.0,22.198745,113.543873
835,Qinghai,China,2020-01-25 12:00:00,1.0,0.0,0.0,0.0,35.744798,96.4077358
836,Washington,United States,2020-01-25 12:00:00,1.0,0.0,0.0,0.0,47.7510741,-120.7401385
837,Illinois,United States,2020-01-25 12:00:00,1.0,0.0,0.0,0.0,40.6331249,-89.3985283
838,0,Japan,2020-01-25 12:00:00,2.0,0.0,0.0,0.0,36.204824,138.252924
839,0,Thailand,2020-01-25 12:00:00,7.0,0.0,0.0,0.0,15.870032,100.992541
840,0,South Korea,2020-01-25 12:00:00,3.0,0.0,0.0,0.0,35.907757,127.766922
841,0,Singapore,2020-01-25 12:00:00,3.0,0.0,0.0,0.0,1.352083,103.819836
842,0,Vietnam,2020-01-25 12:00:00,2.0,0.0,0.0,0.0,14.058324,108.277199
843,0,France,2020-01-25 12:00:00,3.0,0.0,0.0,0.0,46.227638,2.213749
844,0,Australia,2020-01-25 12:00:00,4.0,0.0,0.0,0.0,-25.274398,133.775136
845,0,Nepal,2020-01-25 12:00:00,1.0,0.0,0.0,0.0,28.394857,84.12400799999999
846,0,Malaysia,2020-01-25 12:00:00,3.0,0.0,0.0,0.0,4.210484,101.975766
847,Hubei,China,2020-01-25 12:00:00,761.0,0.0,32.0,40.0,30.7378118,112.2384017
848,Guangdong,China,2020-01-25 12:00:00,78.0,0.0,2.0,0.0,23.3790333,113.7632828
849,Zhejiang,China,2020-01-25 12:00:00,62.0,0.0,1.0,0.0,29.1416432,119.7889248
850,Chongqing,China,2020-01-25 12:00:00,57.0,0.0,0.0,0.0,29.4315861,106.912251
851,Hunan,China,2020-01-25 12:00:00,43.0,0.0,0.0,0.0,27.6252995,111.8568586
852,Beijing,China,2020-01-25 12:00:00,41.0,0.0,2.0,0.0,39.90419989999999,116.4073963
853,Anhui,China,2020-01-25 12:00:00,39.0,4.0,0.0,0.0,30.6006773,117.9249002
854,Shanghai,China,2020-01-25 12:00:00,33.0,72.0,1.0,0.0,31.230416,121.473701
855,Henan,China,2020-01-25 12:00:00,32.0,1.0,0.0,0.0,34.2904302,113.3823545
856,Sichuan,China,2020-01-25 12:00:00,28.0,4.0,0.0,0.0,30.26380319999999,102.8054753
857,Shandong,China,2020-01-25 12:00:00,27.0,0.0,0.0,0.0,35.8939566,117.9249002
858,Guangxi,China,2020-01-25 12:00:00,23.0,0.0,0.0,0.0,23.7247599,108.8076195
859,Hainan,China,2020-01-25 12:00:00,19.0,0.0,0.0,0.0,19.5663947,109.949686
860,Jiangxi,China,2020-01-25 12:00:00,18.0,0.0,0.0,0.0,27.0874564,114.9042208
861,Fujian,China,2020-01-25 12:00:00,18.0,20.0,0.0,0.0,26.4836842,117.9249002
862,Jiangsu,China,2020-01-25 12:00:00,18.0,0.0,1.0,0.0,33.1401715,119.7889248
863,Liaoning,China,2020-01-25 12:00:00,17.0,0.0,0.0,0.0,41.9436543,122.5290376
864,Shaanxi,China,2020-01-25 12:00:00,15.0,0.0,0.0,0.0,35.3939908,109.1880047
865,Yunnan,China,2020-01-25 12:00:00,11.0,58.0,0.0,0.0,24.4752847,101.3431058
866,Tianjin,China,2020-01-25 12:00:00,10.0,0.0,0.0,0.0,39.3433574,117.3616476
867,Heilongjiang,China,2020-01-25 12:00:00,9.0,0.0,0.0,1.0,47.12164720000001,128.738231
868,Hebei,China,2020-01-25 12:00:00,8.0,0.0,0.0,1.0,37.8956594,114.9042208
869,Inner Mongolia,China,2020-01-25 12:00:00,7.0,0.0,0.0,0.0,43.37822,115.0594815
870,Shanxi,China,2020-01-25 12:00:00,6.0,0.0,0.0,0.0,37.2425649,111.8568586
871,Hong Kong,Hong Kong,2020-01-25 12:00:00,5.0,244.0,0.0,0.0,22.3193039,114.1693611
872,Guizhou,China,2020-01-25 12:00:00,4.0,0.0,0.0,0.0,26.8429645,107.2902839
873,Jilin,China,2020-01-25 12:00:00,4.0,0.0,0.0,0.0,43.1520105,126.4371385
874,Gansu,China,2020-01-25 12:00:00,4.0,0.0,0.0,0.0,35.7518326,104.2861116
875,Ningxia,China,2020-01-25 12:00:00,3.0,1.0,0.0,0.0,37.198731,106.1580937
876,Taiwan,Taiwan,2020-01-25 12:00:00,3.0,0.0,0.0,0.0,23.69781,120.960515
877,Xinjiang,China,2020-01-25 12:00:00,3.0,0.0,0.0,0.0,42.5246357,87.5395855
878,Macau,Macau,2020-01-25 12:00:00,2.0,0.0,0.0,0.0,22.198745,113.543873
879,Qinghai,China,2020-01-25 12:00:00,1.0,0.0,0.0,0.0,35.744798,96.4077358
880,Washington,United States,2020-01-25 12:00:00,1.0,0.0,0.0,0.0,47.7510741,-120.7401385
881,Illinois,United States,2020-01-25 12:00:00,1.0,0.0,0.0,0.0,40.6331249,-89.3985283
882,0,Japan,2020-01-25 12:00:00,2.0,0.0,0.0,0.0,36.204824,138.252924
883,0,Thailand,2020-01-25 12:00:00,7.0,0.0,0.0,0.0,15.870032,100.992541
884,0,South Korea,2020-01-25 12:00:00,2.0,0.0,0.0,0.0,35.907757,127.766922
885,0,Singapore,2020-01-25 12:00:00,3.0,0.0,0.0,0.0,1.352083,103.819836
886,0,Vietnam,2020-01-25 12:00:00,2.0,0.0,0.0,0.0,14.058324,108.277199
887,0,France,2020-01-25 12:00:00,3.0,0.0,0.0,0.0,46.227638,2.213749
888,0,Australia,2020-01-25 12:00:00,4.0,0.0,0.0,0.0,-25.274398,133.775136
889,0,Nepal,2020-01-25 12:00:00,1.0,0.0,0.0,0.0,28.394857,84.12400799999999
890,0,Malaysia,2020-01-25 12:00:00,3.0,0.0,0.0,0.0,4.210484,101.975766
891,Hubei,China,2020-01-25 00:00:00,729.0,0.0,32.0,39.0,30.7378118,112.2384017
892,Guangdong,China,2020-01-25 00:00:00,78.0,0.0,2.0,0.0,23.3790333,113.7632828
893,Zhejiang,China,2020-01-25 00:00:00,62.0,0.0,1.0,0.0,29.1416432,119.7889248
894,Chongqing,China,2020-01-25 00:00:00,57.0,0.0,0.0,0.0,29.4315861,106.912251
895,Hunan,China,2020-01-25 00:00:00,43.0,0.0,0.0,0.0,27.6252995,111.8568586
896,Anhui,China,2020-01-25 00:00:00,39.0,4.0,0.0,0.0,30.6006773,117.9249002
897,Beijing,China,2020-01-25 00:00:00,36.0,0.0,1.0,0.0,39.90419989999999,116.4073963
898,Shanghai,China,2020-01-25 00:00:00,33.0,22.0,1.0,0.0,31.230416,121.473701
899,Henan,China,2020-01-25 00:00:00,32.0,1.0,0.0,0.0,34.2904302,113.3823545
900,Sichuan,China,2020-01-25 00:00:00,28.0,4.0,0.0,0.0,30.26380319999999,102.8054753
901,Guangxi,China,2020-01-25 00:00:00,23.0,0.0,0.0,0.0,23.7247599,108.8076195
902,Shandong,China,2020-01-25 00:00:00,21.0,0.0,0.0,0.0,35.8939566,117.9249002
903,Jiangxi,China,2020-01-25 00:00:00,18.0,0.0,0.0,0.0,27.0874564,114.9042208
904,Jiangsu,China,2020-01-25 00:00:00,18.0,0.0,1.0,0.0,33.1401715,119.7889248
905,Hainan,China,2020-01-25 00:00:00,17.0,0.0,0.0,0.0,19.5663947,109.949686
906,Liaoning,China,2020-01-25 00:00:00,15.0,0.0,0.0,0.0,41.9436543,122.5290376
907,Fujian,China,2020-01-25 00:00:00,10.0,4.0,0.0,0.0,26.4836842,117.9249002
908,Heilongjiang,China,2020-01-25 00:00:00,9.0,0.0,0.0,1.0,47.12164720000001,128.738231
909,Tianjin,China,2020-01-25 00:00:00,8.0,0.0,0.0,0.0,39.3433574,117.3616476
910,Hebei,China,2020-01-25 00:00:00,8.0,0.0,0.0,1.0,37.8956594,114.9042208
911,Shanxi,China,2020-01-25 00:00:00,6.0,0.0,0.0,0.0,37.2425649,111.8568586
912,Yunnan,China,2020-01-25 00:00:00,5.0,0.0,0.0,0.0,24.4752847,101.3431058
913,Hong Kong,Hong Kong,2020-01-25 00:00:00,5.0,36.0,0.0,0.0,22.3193039,114.1693611
914,Shaanxi,China,2020-01-25 00:00:00,5.0,0.0,0.0,0.0,35.3939908,109.1880047
915,Guizhou,China,2020-01-25 00:00:00,4.0,0.0,0.0,0.0,26.8429645,107.2902839
916,Jilin,China,2020-01-25 00:00:00,4.0,0.0,0.0,0.0,43.1520105,126.4371385
917,Gansu,China,2020-01-25 00:00:00,4.0,0.0,0.0,0.0,35.7518326,104.2861116
918,Ningxia,China,2020-01-25 00:00:00,3.0,1.0,0.0,0.0,37.198731,106.1580937
919,Taiwan,Taiwan,2020-01-25 00:00:00,3.0,0.0,0.0,0.0,23.69781,120.960515
920,Xinjiang,China,2020-01-25 00:00:00,3.0,0.0,0.0,0.0,42.5246357,87.5395855
921,Macau,Macau,2020-01-25 00:00:00,2.0,0.0,0.0,0.0,22.198745,113.543873
922,Inner Mongolia,China,2020-01-25 00:00:00,2.0,0.0,0.0,0.0,43.37822,115.0594815
923,Qinghai,China,2020-01-25 00:00:00,0.0,1.0,0.0,0.0,35.744798,96.4077358
924,Washington,United States,2020-01-25 00:00:00,1.0,0.0,0.0,0.0,47.7510741,-120.7401385
925,Illinois,United States,2020-01-25 00:00:00,1.0,0.0,0.0,0.0,40.6331249,-89.3985283
926,0,Japan,2020-01-25 00:00:00,2.0,0.0,0.0,0.0,36.204824,138.252924
927,0,Thailand,2020-01-25 00:00:00,5.0,0.0,0.0,0.0,15.870032,100.992541
928,0,South Korea,2020-01-25 00:00:00,2.0,0.0,0.0,0.0,35.907757,127.766922
929,0,Singapore,2020-01-25 00:00:00,3.0,0.0,0.0,0.0,1.352083,103.819836
930,0,Vietnam,2020-01-25 00:00:00,2.0,0.0,0.0,0.0,14.058324,108.277199
931,0,France,2020-01-25 00:00:00,3.0,0.0,0.0,0.0,46.227638,2.213749
932,0,Australia,2020-01-25 00:00:00,1.0,0.0,0.0,0.0,-25.274398,133.775136
933,0,Nepal,2020-01-25 00:00:00,1.0,0.0,0.0,0.0,28.394857,84.12400799999999
934,0,Malaysia,2020-01-25 00:00:00,3.0,0.0,0.0,0.0,4.210484,101.975766
935,Hubei,China,2020-01-24 12:00:00,549.0,0.0,31.0,24.0,30.7378118,112.2384017
936,Guangdong,China,2020-01-24 12:00:00,53.0,0.0,2.0,0.0,23.3790333,113.7632828
937,Zhejiang,China,2020-01-24 12:00:00,43.0,0.0,1.0,0.0,29.1416432,119.7889248
938,Beijing,China,2020-01-24 12:00:00,36.0,0.0,1.0,0.0,39.90419989999999,116.4073963
939,Chongqing,China,2020-01-24 12:00:00,27.0,13.0,0.0,0.0,29.4315861,106.912251
940,Hunan,China,2020-01-24 12:00:00,24.0,0.0,0.0,0.0,27.6252995,111.8568586
941,Guangxi,China,2020-01-24 12:00:00,23.0,0.0,0.0,0.0,23.7247599,108.8076195
942,Shanghai,China,2020-01-24 12:00:00,20.0,22.0,1.0,0.0,31.230416,121.473701
943,Jiangxi,China,2020-01-24 12:00:00,18.0,0.0,0.0,0.0,27.0874564,114.9042208
944,Sichuan,China,2020-01-24 12:00:00,15.0,4.0,0.0,0.0,30.26380319999999,102.8054753
945,Shandong,China,2020-01-24 12:00:00,15.0,0.0,0.0,0.0,35.8939566,117.9249002
946,Anhui,China,2020-01-24 12:00:00,15.0,4.0,0.0,0.0,30.6006773,117.9249002
947,Fujian,China,2020-01-24 12:00:00,10.0,2.0,0.0,0.0,26.4836842,117.9249002
948,Henan,China,2020-01-24 12:00:00,9.0,42.0,0.0,0.0,34.2904302,113.3823545
949,Jiangsu,China,2020-01-24 12:00:00,9.0,0.0,0.0,0.0,33.1401715,119.7889248
950,Hainan,China,2020-01-24 12:00:00,8.0,32.0,0.0,0.0,19.5663947,109.949686
951,Tianjin,China,2020-01-24 12:00:00,8.0,0.0,0.0,0.0,39.3433574,117.3616476
952,Yunnan,China,2020-01-24 12:00:00,5.0,0.0,0.0,0.0,24.4752847,101.3431058
953,Shaanxi,China,2020-01-24 12:00:00,5.0,0.0,0.0,0.0,35.3939908,109.1880047
954,Heilongjiang,China,2020-01-24 12:00:00,4.0,0.0,0.0,1.0,47.12164720000001,128.738231
955,Liaoning,China,2020-01-24 12:00:00,4.0,0.0,0.0,0.0,41.9436543,122.5290376
956,Guizhou,China,2020-01-24 12:00:00,3.0,0.0,0.0,0.0,26.8429645,107.2902839
957,Jilin,China,2020-01-24 12:00:00,3.0,0.0,0.0,0.0,43.1520105,126.4371385
958,Taiwan,Taiwan,2020-01-24 12:00:00,3.0,0.0,0.0,0.0,23.69781,120.960515
959,Ningxia,China,2020-01-24 12:00:00,2.0,1.0,0.0,0.0,37.198731,106.1580937
960,Hong Kong,Hong Kong,2020-01-24 12:00:00,2.0,36.0,0.0,0.0,22.3193039,114.1693611
961,Macau,Macau,2020-01-24 12:00:00,2.0,0.0,0.0,0.0,22.198745,113.543873
962,Hebei,China,2020-01-24 12:00:00,2.0,0.0,0.0,1.0,37.8956594,114.9042208
963,Gansu,China,2020-01-24 12:00:00,2.0,0.0,0.0,0.0,35.7518326,104.2861116
964,Xinjiang,China,2020-01-24 12:00:00,2.0,0.0,0.0,0.0,42.5246357,87.5395855
965,Shanxi,China,2020-01-24 12:00:00,1.0,0.0,0.0,0.0,37.2425649,111.8568586
966,Inner Mongolia,China,2020-01-24 12:00:00,1.0,2.0,0.0,0.0,43.37822,115.0594815
967,Qinghai,China,2020-01-24 12:00:00,0.0,1.0,0.0,0.0,35.744798,96.4077358
968,Washington,United States,2020-01-24 12:00:00,1.0,0.0,0.0,0.0,47.7510741,-120.7401385
969,Chicago,United States,2020-01-24 12:00:00,1.0,0.0,0.0,0.0,41.8781136,-87.6297982
970,0,Japan,2020-01-24 12:00:00,2.0,0.0,0.0,0.0,36.204824,138.252924
971,0,Thailand,2020-01-24 12:00:00,5.0,0.0,0.0,0.0,15.870032,100.992541
972,0,South Korea,2020-01-24 12:00:00,2.0,0.0,0.0,0.0,35.907757,127.766922
973,0,Singapore,2020-01-24 12:00:00,3.0,0.0,0.0,0.0,1.352083,103.819836
974,0,Vietnam,2020-01-24 12:00:00,2.0,0.0,0.0,0.0,14.058324,108.277199
976,Hubei,China,2020-01-24 00:00:00,549.0,0.0,31.0,24.0,30.7378118,112.2384017
977,Guangdong,China,2020-01-24 00:00:00,53.0,0.0,2.0,0.0,23.3790333,113.7632828
978,Zhejiang,China,2020-01-24 00:00:00,43.0,0.0,1.0,0.0,29.1416432,119.7889248
979,Beijing,China,2020-01-24 00:00:00,26.0,22.0,0.0,0.0,39.90419989999999,116.4073963
980,Shanghai,China,2020-01-24 00:00:00,20.0,0.0,0.0,0.0,31.230416,121.473701
981,Hunan,China,2020-01-24 00:00:00,24.0,0.0,0.0,0.0,27.6252995,111.8568586
982,Anhui,China,2020-01-24 00:00:00,15.0,4.0,0.0,0.0,30.6006773,117.9249002
983,Chongqing,China,2020-01-24 00:00:00,27.0,13.0,0.0,0.0,29.4315861,106.912251
984,Sichuan,China,2020-01-24 00:00:00,15.0,4.0,0.0,0.0,30.26380319999999,102.8054753
985,Shandong,China,2020-01-24 00:00:00,9.0,0.0,0.0,0.0,35.8939566,117.9249002
986,Guangxi,China,2020-01-24 00:00:00,13.0,0.0,0.0,0.0,23.7247599,108.8076195
987,Fujian,China,2020-01-24 00:00:00,5.0,2.0,0.0,0.0,26.4836842,117.9249002
988,Jiangsu,China,2020-01-24 00:00:00,9.0,0.0,0.0,0.0,33.1401715,119.7889248
989,Henan,China,2020-01-24 00:00:00,9.0,0.0,0.0,0.0,34.2904302,113.3823545
990,Hainan,China,2020-01-24 00:00:00,8.0,32.0,0.0,0.0,19.5663947,109.949686
991,Tianjin,China,2020-01-24 00:00:00,5.0,0.0,0.0,0.0,39.3433574,117.3616476
992,Jiangxi,China,2020-01-24 00:00:00,7.0,0.0,0.0,0.0,27.0874564,114.9042208
993,Shaanxi,China,2020-01-24 00:00:00,3.0,0.0,0.0,0.0,35.3939908,109.1880047
994,Guizhou,China,2020-01-24 00:00:00,3.0,0.0,0.0,0.0,26.8429645,107.2902839
995,Liaoning,China,2020-01-24 00:00:00,4.0,0.0,0.0,0.0,41.9436543,122.5290376
996,Hong Kong,Hong Kong,2020-01-24 00:00:00,2.0,36.0,0.0,0.0,22.3193039,114.1693611
997,Heilongjiang,China,2020-01-24 00:00:00,4.0,0.0,0.0,1.0,47.12164720000001,128.738231
998,Macau,Macau,2020-01-24 00:00:00,2.0,0.0,0.0,0.0,22.198745,113.543873
999,Xinjiang,China,2020-01-24 00:00:00,2.0,0.0,0.0,0.0,42.5246357,87.5395855
1000,Gansu,China,2020-01-24 00:00:00,2.0,0.0,0.0,0.0,35.7518326,104.2861116
1001,Yunnan,China,2020-01-24 00:00:00,2.0,0.0,0.0,0.0,24.4752847,101.3431058
1002,Taiwan,Taiwan,2020-01-24 00:00:00,1.0,0.0,0.0,0.0,23.69781,120.960515
1003,Shanxi,China,2020-01-24 00:00:00,1.0,0.0,0.0,0.0,37.2425649,111.8568586
1004,Jilin,China,2020-01-24 00:00:00,3.0,0.0,0.0,0.0,43.1520105,126.4371385
1005,Hebei,China,2020-01-24 00:00:00,2.0,0.0,0.0,1.0,37.8956594,114.9042208
1006,Ningxia,China,2020-01-24 00:00:00,1.0,0.0,0.0,0.0,37.198731,106.1580937
1007,Inner Mongolia,China,2020-01-24 00:00:00,1.0,2.0,0.0,0.0,43.37822,115.0594815
1008,Washington,United States,2020-01-24 00:00:00,1.0,0.0,0.0,0.0,47.7510741,-120.7401385
1009,0,Japan,2020-01-24 00:00:00,2.0,0.0,0.0,0.0,36.204824,138.252924
1010,0,Thailand,2020-01-24 00:00:00,4.0,0.0,0.0,0.0,15.870032,100.992541
1011,0,South Korea,2020-01-24 00:00:00,1.0,0.0,0.0,0.0,35.907757,127.766922
1012,0,Singapore,2020-01-24 00:00:00,1.0,0.0,0.0,0.0,1.352083,103.819836
1013,0,Vietnam,2020-01-24 00:00:00,2.0,0.0,0.0,0.0,14.058324,108.277199
1014,Anhui,China,2020-01-23 12:00:00,9.0,4.0,0.0,0.0,30.6006773,117.9249002
1015,Beijing,China,2020-01-23 12:00:00,22.0,0.0,0.0,0.0,39.90419989999999,116.4073963
1016,Chongqing,China,2020-01-23 12:00:00,9.0,0.0,0.0,0.0,29.4315861,106.912251
1017,Fujian,China,2020-01-23 12:00:00,5.0,2.0,0.0,0.0,26.4836842,117.9249002
1018,Gansu,China,2020-01-23 12:00:00,2.0,0.0,0.0,0.0,35.7518326,104.2861116
1019,Guangdong,China,2020-01-23 12:00:00,32.0,1.0,2.0,0.0,23.3790333,113.7632828
1020,Guangxi,China,2020-01-23 12:00:00,5.0,0.0,0.0,0.0,23.7247599,108.8076195
1021,Guizhou,China,2020-01-23 12:00:00,3.0,0.0,0.0,0.0,26.8429645,107.2902839
1022,Hainan,China,2020-01-23 12:00:00,5.0,32.0,0.0,0.0,19.5663947,109.949686
1023,Hebei,China,2020-01-23 12:00:00,1.0,0.0,0.0,1.0,37.8956594,114.9042208
1024,Heilongjiang,China,2020-01-23 12:00:00,2.0,0.0,0.0,0.0,47.12164720000001,128.738231
1025,Henan,China,2020-01-23 12:00:00,5.0,0.0,0.0,0.0,34.2904302,113.3823545
1026,Hong Kong,Hong Kong,2020-01-23 12:00:00,2.0,65.0,0.0,0.0,22.3193039,114.1693611
1027,Hubei,China,2020-01-23 12:00:00,444.0,0.0,28.0,17.0,30.7378118,112.2384017
1028,Hunan,China,2020-01-23 12:00:00,9.0,0.0,0.0,0.0,27.6252995,111.8568586
1029,Inner Mongolia,China,2020-01-23 12:00:00,0.0,1.0,0.0,0.0,43.37822,115.0594815
1030,Jiangsu,China,2020-01-23 12:00:00,5.0,0.0,0.0,0.0,33.1401715,119.7889248
1031,Jiangxi,China,2020-01-23 12:00:00,7.0,0.0,0.0,0.0,27.0874564,114.9042208
1032,Jilin,China,2020-01-23 12:00:00,1.0,0.0,0.0,0.0,43.1520105,126.4371385
1033,Liaoning,China,2020-01-23 12:00:00,3.0,0.0,0.0,0.0,41.9436543,122.5290376
1034,Macau,Macau,2020-01-23 12:00:00,2.0,0.0,0.0,0.0,22.198745,113.543873
1035,Ningxia,China,2020-01-23 12:00:00,1.0,0.0,0.0,0.0,37.198731,106.1580937
1036,Qinghai,China,2020-01-23 12:00:00,0.0,0.0,0.0,0.0,35.744798,96.4077358
1037,Shaanxi,China,2020-01-23 12:00:00,3.0,1.0,0.0,0.0,35.3939908,109.1880047
1038,Shandong,China,2020-01-23 12:00:00,6.0,2.0,0.0,0.0,35.8939566,117.9249002
1039,Shanghai,China,2020-01-23 12:00:00,16.0,22.0,0.0,0.0,31.230416,121.473701
1040,Shanxi,China,2020-01-23 12:00:00,1.0,0.0,0.0,0.0,37.2425649,111.8568586
1041,Sichuan,China,2020-01-23 12:00:00,8.0,2.0,0.0,0.0,30.26380319999999,102.8054753
1042,Taiwan,Taiwan,2020-01-23 12:00:00,1.0,0.0,0.0,0.0,23.69781,120.960515
1043,Tianjin,China,2020-01-23 12:00:00,4.0,0.0,0.0,0.0,39.3433574,117.3616476
1044,Tibet,China,2020-01-23 12:00:00,0.0,0.0,0.0,0.0,30.1533605,88.7878678
1045,Washington,United States,2020-01-23 12:00:00,1.0,0.0,0.0,0.0,47.7510741,-120.7401385
1046,Xinjiang,China,2020-01-23 12:00:00,2.0,0.0,0.0,0.0,42.5246357,87.5395855
1047,Yunnan,China,2020-01-23 12:00:00,2.0,0.0,0.0,0.0,24.4752847,101.3431058
1048,Zhejiang,China,2020-01-23 12:00:00,27.0,0.0,0.0,0.0,29.1416432,119.7889248
1049,0,Japan,2020-01-23 12:00:00,1.0,0.0,0.0,0.0,36.204824,138.252924
1050,0,Thailand,2020-01-23 12:00:00,3.0,0.0,0.0,0.0,15.870032,100.992541
1051,0,South Korea,2020-01-23 12:00:00,1.0,0.0,0.0,0.0,35.907757,127.766922
1052,0,Singapore,2020-01-23 12:00:00,1.0,0.0,0.0,0.0,1.352083,103.819836
1053,0,Philippines,2020-01-23 12:00:00,0.0,4.0,0.0,0.0,12.879721,121.774017
1054,0,Malaysia,2020-01-23 12:00:00,0.0,4.0,0.0,0.0,4.210484,101.975766
1055,0,Vietnam,2020-01-23 12:00:00,2.0,0.0,0.0,0.0,14.058324,108.277199
1056,0,Australia,2020-01-23 12:00:00,0.0,1.0,0.0,0.0,-25.274398,133.775136
1057,0,Mexico,2020-01-23 12:00:00,0.0,1.0,0.0,0.0,23.634501,-102.552784
1058,0,Brazil,2020-01-23 12:00:00,0.0,1.0,0.0,0.0,-14.235004,-51.92528
1059,0,Colombia,2020-01-23 12:00:00,0.0,1.0,0.0,0.0,4.570868,-74.297333
1060,Anhui,China,2020-01-22 12:00:00,1.0,4.0,0.0,0.0,30.6006773,117.9249002
1061,Beijing,China,2020-01-22 12:00:00,14.0,0.0,0.0,0.0,39.90419989999999,116.4073963
1062,Chongqing,China,2020-01-22 12:00:00,6.0,0.0,0.0,0.0,29.4315861,106.912251
1063,Fujian,China,2020-01-22 12:00:00,1.0,0.0,0.0,0.0,26.4836842,117.9249002
1064,Gansu,China,2020-01-22 12:00:00,0.0,0.0,0.0,0.0,35.7518326,104.2861116
1065,Guangdong,China,2020-01-22 12:00:00,26.0,1.0,0.0,0.0,23.3790333,113.7632828
1066,Guangxi,China,2020-01-22 12:00:00,2.0,1.0,0.0,0.0,23.7247599,108.8076195
1067,Guizhou,China,2020-01-22 12:00:00,1.0,0.0,0.0,0.0,26.8429645,107.2902839
1068,Hainan,China,2020-01-22 12:00:00,4.0,0.0,0.0,0.0,19.5663947,109.949686
1069,Hebei,China,2020-01-22 12:00:00,1.0,0.0,0.0,0.0,37.8956594,114.9042208
1070,Heilongjiang,China,2020-01-22 12:00:00,0.0,1.0,0.0,0.0,47.12164720000001,128.738231
1071,Henan,China,2020-01-22 12:00:00,5.0,0.0,0.0,0.0,34.2904302,113.3823545
1072,Hong Kong,Hong Kong,2020-01-22 12:00:00,0.0,117.0,0.0,0.0,22.3193039,114.1693611
1073,Hubei,China,2020-01-22 12:00:00,444.0,0.0,0.0,0.0,30.7378118,112.2384017
1074,Hunan,China,2020-01-22 12:00:00,4.0,0.0,0.0,0.0,27.6252995,111.8568586
1075,Inner Mongolia,China,2020-01-22 12:00:00,0.0,0.0,0.0,0.0,43.37822,115.0594815
1076,Jiangsu,China,2020-01-22 12:00:00,1.0,0.0,0.0,0.0,33.1401715,119.7889248
1077,Jiangxi,China,2020-01-22 12:00:00,2.0,0.0,0.0,0.0,27.0874564,114.9042208
1078,Jilin,China,2020-01-22 12:00:00,0.0,1.0,0.0,0.0,43.1520105,126.4371385
1079,Liaoning,China,2020-01-22 12:00:00,2.0,0.0,0.0,0.0,41.9436543,122.5290376
1080,Macau,Macau,2020-01-22 12:00:00,1.0,0.0,0.0,0.0,22.198745,113.543873
1081,Ningxia,China,2020-01-22 12:00:00,1.0,0.0,0.0,0.0,37.198731,106.1580937
1082,Qinghai,China,2020-01-22 12:00:00,0.0,0.0,0.0,0.0,35.744798,96.4077358
1083,Shaanxi,China,2020-01-22 12:00:00,0.0,0.0,0.0,0.0,35.3939908,109.1880047
1084,Shandong,China,2020-01-22 12:00:00,2.0,0.0,0.0,0.0,35.8939566,117.9249002
1085,Shanghai,China,2020-01-22 12:00:00,9.0,10.0,0.0,0.0,31.230416,121.473701
1086,Shanxi,China,2020-01-22 12:00:00,1.0,0.0,0.0,0.0,37.2425649,111.8568586
1087,Sichuan,China,2020-01-22 12:00:00,5.0,2.0,0.0,0.0,30.26380319999999,102.8054753
1088,Taiwan,Taiwan,2020-01-22 12:00:00,1.0,0.0,0.0,0.0,23.69781,120.960515
1089,Tianjin,China,2020-01-22 12:00:00,4.0,0.0,0.0,0.0,39.3433574,117.3616476
1090,Tibet,China,2020-01-22 12:00:00,0.0,0.0,0.0,0.0,30.1533605,88.7878678
1091,Washington,United States,2020-01-22 12:00:00,1.0,0.0,0.0,0.0,47.7510741,-120.7401385
1092,Xinjiang,China,2020-01-22 12:00:00,0.0,0.0,0.0,0.0,42.5246357,87.5395855
1093,Yunnan,China,2020-01-22 12:00:00,1.0,0.0,0.0,0.0,24.4752847,101.3431058
1094,Zhejiang,China,2020-01-22 12:00:00,10.0,0.0,0.0,0.0,29.1416432,119.7889248
1095,0,Japan,2020-01-22 12:00:00,2.0,0.0,0.0,0.0,36.204824,138.252924
1096,0,Thailand,2020-01-22 12:00:00,2.0,0.0,0.0,0.0,15.870032,100.992541
1097,0,South Korea,2020-01-22 12:00:00,1.0,0.0,0.0,0.0,35.907757,127.766922
1098,Shanghai,China,2020-01-21 00:00:00,9.0,10.0,0.0,0.0,31.230416,121.473701
1099,Yunnan,China,2020-01-21 00:00:00,1.0,0.0,0.0,0.0,24.4752847,101.3431058
1100,Beijing,China,2020-01-21 00:00:00,10.0,0.0,0.0,0.0,39.90419989999999,116.4073963
1101,Taiwan,Taiwan,2020-01-21 00:00:00,1.0,0.0,0.0,0.0,23.69781,120.960515
1102,Jilin,China,2020-01-21 00:00:00,0.0,1.0,0.0,0.0,43.1520105,126.4371385
1103,Sichuan,China,2020-01-21 00:00:00,2.0,1.0,0.0,0.0,30.26380319999999,102.8054753
1104,Tianjin,China,2020-01-21 00:00:00,2.0,0.0,0.0,0.0,39.3433574,117.3616476
1105,Ningxia,China,2020-01-21 00:00:00,0.0,1.0,0.0,0.0,37.198731,106.1580937
1106,Anhui,China,2020-01-21 00:00:00,0.0,3.0,0.0,0.0,30.6006773,117.9249002
1107,Shandong,China,2020-01-21 00:00:00,1.0,0.0,0.0,0.0,35.8939566,117.9249002
1108,Guangdong,China,2020-01-21 00:00:00,17.0,4.0,0.0,0.0,23.3790333,113.7632828
1109,Guangxi,China,2020-01-21 00:00:00,0.0,1.0,0.0,0.0,23.7247599,108.8076195
1110,Jiangxi,China,2020-01-21 00:00:00,2.0,0.0,0.0,0.0,27.0874564,114.9042208
1111,Henan,China,2020-01-21 00:00:00,1.0,0.0,0.0,0.0,34.2904302,113.3823545
1112,Zhejiang,China,2020-01-21 00:00:00,5.0,16.0,0.0,0.0,29.1416432,119.7889248
1113,Hainan,China,2020-01-21 00:00:00,0.0,1.0,0.0,0.0,19.5663947,109.949686
1114,Hubei,China,2020-01-21 00:00:00,270.0,11.0,0.0,0.0,30.7378118,112.2384017
1115,Hunan,China,2020-01-21 00:00:00,1.0,0.0,0.0,0.0,27.6252995,111.8568586
1116,Guizhou,China,2020-01-21 00:00:00,0.0,1.0,0.0,0.0,26.8429645,107.2902839
1117,Liaoning,China,2020-01-21 00:00:00,0.0,1.0,0.0,0.0,41.9436543,122.5290376
1118,Chongqing,China,2020-01-21 00:00:00,5.0,0.0,0.0,0.0,29.4315861,106.912251
1119,Hong Kong,Hong Kong,2020-01-21 00:00:00,0.0,117.0,0.0,0.0,22.3193039,114.1693611
1120,Heilongjiang,China,2020-01-21 00:00:00,0.0,1.0,0.0,0.0,47.12164720000001,128.738231
1121,0,Japan,2020-01-21 00:00:00,1.0,0.0,0.0,0.0,36.204824,138.252924
1122,0,Thailand,2020-01-21 00:00:00,2.0,0.0,0.0,0.0,15.870032,100.992541
1123,0,South Korea,2020-01-21 00:00:00,1.0,0.0,0.0,0.0,35.907757,127.766922
1124,Washington,United States,2020-01-21 00:00:00,1.0,0.0,0.0,0.0,47.7510741,-120.7401385
