org\optaplanner\examples\meetingscheduling\domain\RequiredAttendance.class
org\optaplanner\examples\dinnerparty\domain\Hobby.class
org\optaplanner\examples\coachshuttlegathering\domain\solver\DepotAngleBusStopDifficultyWeightFactory$DepotAngleCustomerDifficultyWeight.class
org\optaplanner\examples\common\swingui\timetable\TimeTableLayout.class
org\optaplanner\examples\cheaptime\domain\solver\TaskAssignmentDifficultyComparator.class
org\optaplanner\examples\tsp\domain\solver\nearby\VisitNearbyDistanceMeter.class
org\optaplanner\examples\common\swingui\ConstraintMatchesDialog$1.class
org\optaplanner\examples\vehiclerouting\domain\solver\DepotAngleCustomerDifficultyWeightFactory.class
org\optaplanner\examples\examination\domain\Examination.class
org\optaplanner\examples\tsp\swingui\TspPanel.class
org\optaplanner\examples\vehiclerouting\persistence\VehicleRoutingDao.class
org\optaplanner\examples\machinereassignment\persistence\MachineReassignmentExporter$MachineReassignmentOutputBuilder.class
org\optaplanner\examples\pas\domain\Patient.class
org\optaplanner\examples\cheaptime\domain\TaskRequirement.class
org\optaplanner\examples\tennis\app\TennisApp.class
org\optaplanner\examples\coachshuttlegathering\app\CoachShuttleGatheringApp.class
org\optaplanner\examples\vehiclerouting\swingui\VehicleRoutingPanel.class
org\optaplanner\examples\tsp\domain\solver\LatitudeVisitDifficultyComparator.class
org\optaplanner\examples\vehiclerouting\domain\location\segmented\RoadSegmentLocation.class
org\optaplanner\examples\nurserostering\domain\contract\ContractLine.class
org\optaplanner\examples\pas\solver\move\PatientAdmissionMoveHelper.class
org\optaplanner\examples\investment\domain\AssetClassAllocation.class
org\optaplanner\examples\pas\persistence\PatientAdmissionScheduleImporter$PatientAdmissionScheduleInputBuilder$1.class
org\optaplanner\examples\curriculumcourse\domain\Room.class
org\optaplanner\examples\curriculumcourse\domain\UnavailablePeriodPenalty.class
org\optaplanner\examples\cloudbalancing\swingui\CloudComputerPanel$CloudBar.class
org\optaplanner\examples\vehiclerouting\domain\JsonVehicleRoute.class
org\optaplanner\examples\investment\domain\util\InvestmentNumericUtil.class
org\optaplanner\examples\app\OptaPlannerExamplesApp$WebExamplesDialog.class
org\optaplanner\examples\common\swingui\components\LabeledComboBoxRenderer.class
org\optaplanner\examples\travelingtournament\solver\move\factory\MatchChainRotationsMoveFactory$RotationMovesFactory.class
org\optaplanner\examples\vehiclerouting\swingui\VehicleRoutingWorldPanel.class
org\optaplanner\examples\machinereassignment\persistence\MachineReassignmentExporter.class
org\optaplanner\examples\machinereassignment\domain\solver\MrServiceDependency.class
org\optaplanner\examples\pas\swingui\PatientAdmissionSchedulePanel$BedDesignationAction.class
org\optaplanner\examples\pas\persistence\PatientAdmissionScheduleExporter$PatientAdmissionScheduleOutputBuilder$1.class
org\optaplanner\examples\pas\domain\Equipment.class
org\optaplanner\examples\examination\swingui\InstitutionParametrizationDialog$3.class
org\optaplanner\examples\common\persistence\AbstractSolutionImporter$InputBuilder.class
org\optaplanner\examples\machinereassignment\persistence\MachineReassignmentImporter.class
org\optaplanner\examples\common\swingui\timetable\TimeTableLayout$Cell.class
org\optaplanner\examples\nqueens\solver\score\NQueensAdvancedIncrementalScoreCalculator.class
org\optaplanner\examples\machinereassignment\solver\drools\MrMachineTransientUsage.class
org\optaplanner\examples\nurserostering\domain\ShiftType.class
org\optaplanner\examples\nurserostering\solver\drools\EmployeeFreeSequence.class
org\optaplanner\examples\app\OptaPlannerExamplesApp$1.class
org\optaplanner\examples\common\domain\PersistableIdComparator.class
org\optaplanner\examples\pas\domain\RequiredPatientEquipment.class
org\optaplanner\examples\projectjobscheduling\domain\solver\ExecutionModeStrengthWeightFactory$ExecutionModeStrengthWeight.class
org\optaplanner\examples\coachshuttlegathering\domain\location\RoadLocation.class
org\optaplanner\examples\nqueens\app\NQueensBenchmarkApp.class
org\optaplanner\examples\nurserostering\swingui\EmployeePanel$1.class
org\optaplanner\examples\vehiclerouting\domain\timewindowed\solver\ArrivalTimeUpdatingVariableListener.class
org\optaplanner\examples\machinereassignment\domain\MrService.class
org\optaplanner\examples\cheaptime\solver\score\CheapTimeEasyScoreCalculator$MachinePeriodStatus.class
org\optaplanner\examples\curriculumcourse\domain\Course.class
org\optaplanner\examples\vehiclerouting\persistence\util\VehicleRoutingTspBasedGenerator$1.class
org\optaplanner\examples\nurserostering\solver\move\factory\ShiftAssignmentSequenceSwitchLength2MoveFactory$AssignmentSequence.class
org\optaplanner\examples\nurserostering\domain\request\ShiftOnRequest.class
org\optaplanner\examples\tennis\swingui\TennisPanel.class
org\optaplanner\examples\machinereassignment\app\MachineReassignmentBenchmarkApp.class
org\optaplanner\examples\cloudbalancing\swingui\CloudBalancingPanel$2.class
org\optaplanner\examples\pas\swingui\PatientAdmissionSchedulePanel$PatientOrRoomIcon.class
org\optaplanner\examples\travelingtournament\solver\move\factory\MatchChainRotationsMoveFactory.class
org\optaplanner\examples\vehiclerouting\domain\location\DistanceType.class
org\optaplanner\examples\investment\solver\score\InvestmentEasyScoreCalculator.class
org\optaplanner\examples\pas\domain\AdmissionPart.class
org\optaplanner\examples\investment\swingui\InvestmentPanel$4.class
org\optaplanner\examples\tsp\solver\score\TspEasyScoreCalculator.class
org\optaplanner\examples\vehiclerouting\domain\location\AirLocation.class
org\optaplanner\examples\meetingscheduling\domain\MeetingSchedule.class
org\optaplanner\examples\common\persistence\AbstractTxtSolutionExporter$TxtOutputBuilder.class
org\optaplanner\examples\nurserostering\solver\drools\EmployeeConsecutiveAssignmentStart.class
org\optaplanner\examples\vehiclerouting\domain\solver\DepotAngleCustomerDifficultyWeightFactory$DepotAngleCustomerDifficultyWeight.class
org\optaplanner\examples\examination\domain\Room.class
org\optaplanner\examples\curriculumcourse\domain\solver\RoomStrengthWeightFactory$RoomStrengthWeight.class
org\optaplanner\examples\common\persistence\XStreamSolutionDao.class
org\optaplanner\examples\nurserostering\solver\drools\EmployeeWeekendSequence.class
org\optaplanner\examples\tsp\domain\solver\LongitudeVisitDifficultyComparator.class
org\optaplanner\examples\nurserostering\app\NurseRosteringBenchmarkApp.class
org\optaplanner\examples\cheaptime\persistence\CheapTimeSolutionFileIO.class
org\optaplanner\examples\projectjobscheduling\app\ProjectJobSchedulingApp.class
org\optaplanner\examples\nurserostering\solver\move\factory\ShiftAssignmentSequenceSwitchLength2MoveFactory.class
org\optaplanner\examples\dinnerparty\persistence\DinnerPartyDao.class
org\optaplanner\examples\nurserostering\domain\solver\MovableShiftAssignmentSelectionFilter.class
org\optaplanner\examples\examination\domain\RoomPenalty.class
org\optaplanner\examples\vehiclerouting\persistence\VehicleRoutingFileIO.class
org\optaplanner\examples\dinnerparty\swingui\DinnerPartyPanel.class
org\optaplanner\examples\nqueens\swingui\NQueensPanel$QueenAction.class
org\optaplanner\examples\curriculumcourse\solver\move\DifferentCourseSwapMoveFilter.class
org\optaplanner\examples\nurserostering\domain\contract\ContractLineType.class
org\optaplanner\examples\common\persistence\AbstractTxtSolutionImporter.class
org\optaplanner\examples\investment\swingui\InvestmentPanel$3.class
org\optaplanner\examples\pas\domain\solver\BedStrengthComparator.class
org\optaplanner\examples\vehiclerouting\persistence\util\VehicleRoutingTspBasedGenerator.class
org\optaplanner\examples\nurserostering\domain\Shift.class
org\optaplanner\examples\cheaptime\solver\drools\PeriodWrapper.class
org\optaplanner\examples\common\persistence\AbstractTxtSolutionExporter.class
org\optaplanner\examples\examination\domain\solver\ExamDifficultyWeightFactory$ExamDifficultyWeight.class
org\optaplanner\examples\nurserostering\solver\move\factory\ShiftAssignmentPillarPartSwapMoveFactory$LowestDayIndexAssignmentSequenceIterator.class
org\optaplanner\examples\meetingscheduling\app\MeetingSchedulingApp.class
org\optaplanner\examples\dinnerparty\domain\Seat.class
org.codehaus.plexus.compiler.javac.JavacCompiler1959619978976761335arguments
org\optaplanner\examples\tsp\solver\score\TspIncrementalScoreCalculator.class
org\optaplanner\examples\cloudbalancing\solver\score\CloudBalancingMapBasedEasyScoreCalculator.class
org\optaplanner\examples\common\app\CommonApp.class
org\optaplanner\examples\curriculumcourse\app\CurriculumCourseBenchmarkApp.class
org\optaplanner\examples\dinnerparty\swingui\DinnerPartyPanel$SeatDesignationAction.class
org\optaplanner\examples\coachshuttlegathering\persistence\CoachShuttleGatheringDao.class
org\optaplanner\examples\projectjobscheduling\solver\score\drools\RenewableResourceUsedDay.class
org\optaplanner\examples\projectjobscheduling\domain\resource\LocalResource.class
org\optaplanner\examples\nurserostering\persistence\NurseRosteringExporter.class
org\optaplanner\examples\examination\domain\solver\TopicConflict.class
org\optaplanner\examples\vehiclerouting\domain\Depot.class
org\optaplanner\examples\investment\swingui\InvestmentPanel.class
org\optaplanner\examples\vehiclerouting\persistence\util\VehicleRoutingDistanceTypeComparison.class
org\optaplanner\examples\tsp\swingui\TspPanel$1.class
org\optaplanner\examples\app\OptaPlannerExamplesApp$EmptyIcon.class
org\optaplanner\examples\examination\domain\PeriodPenaltyType.class
org\optaplanner\examples\dinnerparty\swingui\DinnerPartyPanel$1.class
org\optaplanner\examples\nurserostering\solver\move\factory\ShiftAssignmentSequenceSwitchLength3MoveFactory$AssignmentSequence.class
org\optaplanner\examples\machinereassignment\solver\score\MachineReassignmentIncrementalScoreCalculator$1.class
org\optaplanner\examples\examination\swingui\InstitutionParametrizationDialog.class
org\optaplanner\examples\common\business\ExtensionFileFilter.class
org\optaplanner\examples\nqueens\domain\Column.class
org\optaplanner\examples\nqueens\solver\solution\CheatingNQueensPhaseCommand.class
org\optaplanner\examples\machinereassignment\domain\MrGlobalPenaltyInfo.class
org\optaplanner\examples\machinereassignment\persistence\MachineReassignmentDao.class
org\optaplanner\examples\travelingtournament\persistence\TravelingTournamentExporter$TravelingTournamentOutputBuilder.class
org\optaplanner\examples\pas\domain\PreferredPatientEquipment.class
org\optaplanner\examples\projectjobscheduling\swingui\ProjectJobSchedulingPanel.class
org\optaplanner\examples\projectjobscheduling\domain\Job.class
org\optaplanner\examples\cheaptime\solver\move\factory\CheapTimePillarSlideMoveIteratorFactory$RandomCheapTimePillarSlideMoveIterator.class
org\optaplanner\examples\dinnerparty\domain\JobType.class
org\optaplanner\examples\pas\swingui\PatientAdmissionSchedulePanel$1.class
org\optaplanner\examples\nurserostering\domain\NurseRosterParametrization.class
org\optaplanner\examples\cloudbalancing\domain\CloudProcess.class
org\optaplanner\examples\examination\persistence\ExaminationImporter$ExaminationInputBuilder$1.class
org\optaplanner\examples\examination\persistence\ExaminationImporter.class
org\optaplanner\examples\cheaptime\domain\MachineCapacity.class
org\optaplanner\examples\pas\persistence\PatientAdmissionScheduleDao.class
org\optaplanner\examples\app\GeneralOptaPlannerBenchmarkApp.class
org\optaplanner\examples\machinereassignment\domain\MrProcessAssignment.class
org\optaplanner\examples\coachshuttlegathering\swingui\CoachShuttleGatheringWorldPanel.class
org\optaplanner\examples\cheaptime\persistence\CheapTimeImporter$CheapTimeInputBuilder$ForecastInputBuilder.class
org\optaplanner\examples\pas\solver\move\BedDesignationSwapMove.class
org\optaplanner\examples\common\persistence\AbstractSolutionDao.class
org\optaplanner\examples\travelingtournament\solver\move\factory\InverseMatchSwapMoveFilter.class
org\optaplanner\examples\tsp\persistence\TspImageStipplerImporter$TspImageStipplerInputBuilder.class
org\optaplanner\examples\meetingscheduling\persistence\MeetingSchedulingDao.class
org\optaplanner\examples\travelingtournament\app\TravelingTournamentBenchmarkApp.class
org\optaplanner\examples\cheaptime\persistence\CheapTimeDao.class
org\optaplanner\examples\tsp\domain\Domicile.class
org\optaplanner\examples\travelingtournament\solver\move\TravelingTournamentMoveHelper.class
org\optaplanner\examples\projectjobscheduling\domain\solver\PredecessorsDoneDateUpdatingVariableListener.class
org\optaplanner\examples\vehiclerouting\domain\location\segmented\HubSegmentLocation.class
org\optaplanner\examples\coachshuttlegathering\domain\Bus.class
org\optaplanner\examples\nurserostering\solver\move\factory\ShiftAssignmentPillarPartSwapMoveFactory$1.class
org\optaplanner\examples\examination\domain\InstitutionParametrization.class
org\optaplanner\examples\vehiclerouting\swingui\VehicleRoutingPanel$2.class
org\optaplanner\examples\vehiclerouting\domain\solver\LatitudeCustomerDifficultyComparator.class
org\optaplanner\examples\coachshuttlegathering\swingui\CoachShuttleGatheringWorldPanel$1.class
org\optaplanner\examples\cloudbalancing\swingui\CloudBalancingPanel$3.class
org\optaplanner\examples\tsp\domain\solver\DomicileAngleVisitDifficultyWeightFactory.class
org\optaplanner\examples\cheaptime\solver\CheapTimeCostCalculator.class
org\optaplanner\examples\cloudbalancing\domain\solver\CloudProcessDifficultyComparator.class
org\optaplanner\examples\common\swingui\ConstraintMatchesDialog.class
org\optaplanner\examples\curriculumcourse\persistence\CurriculumCourseExporter$CurriculumCourseOutputBuilder.class
org\optaplanner\examples\examination\persistence\ExaminationImporter$1.class
org\optaplanner\examples\cloudbalancing\swingui\CloudComputerPanel$CloudProcessListDialog$2.class
org\optaplanner\examples\projectjobscheduling\solver\score\capacity\ResourceCapacityTracker.class
org\optaplanner\examples\pas\persistence\PatientAdmissionScheduleExporter$PatientAdmissionScheduleOutputBuilder.class
org\optaplanner\examples\curriculumcourse\swingui\CurriculumCoursePanel$LectureAction.class
org\optaplanner\examples\tennis\domain\UnavailabilityPenalty.class
org\optaplanner\examples\coachshuttlegathering\domain\StopOrHub.class
org\optaplanner\examples\dinnerparty\solver\move\DifferentGenderSwapMoveFilter.class
org\optaplanner\examples\examination\domain\solver\ExamDifficultyWeightFactory$1.class
org\optaplanner\examples\nurserostering\solver\move\EmployeeChangeMove.class
org\optaplanner\examples\nurserostering\swingui\NurseRosteringPanel.class
org\optaplanner\examples\cheaptime\swingui\CheapTimePanel$StableTaskAssignmentComparator.class
org\optaplanner\examples\examination\app\ExaminationApp.class
org\optaplanner\examples\cheaptime\domain\Resource.class
org\optaplanner\examples\pas\domain\Night.class
org\optaplanner\examples\vehiclerouting\persistence\VehicleRoutingImporter$1.class
org\optaplanner\examples\tsp\persistence\TspFileIO.class
org\optaplanner\examples\vehiclerouting\domain\JsonCustomer.class
org\optaplanner\examples\meetingscheduling\domain\Day.class
org\optaplanner\examples\nurserostering\domain\DayOfWeek.class
org\optaplanner\examples\common\persistence\AbstractXlsxSolutionImporter$XslxInputBuilder.class
org\optaplanner\examples\nurserostering\domain\DayOfWeek$1.class
org\optaplanner\examples\common\swingui\OpenBrowserAction.class
org\optaplanner\examples\vehiclerouting\domain\VehicleRoutingSolution.class
org\optaplanner\examples\meetingscheduling\swingui\MeetingSchedulingPanel$1.class
org\optaplanner\examples\projectjobscheduling\domain\solver\DelayStrengthComparator.class
org\optaplanner\examples\investment\solver\move\factory\InvestmentQuantityTransferMoveIteratorFactory.class
org\optaplanner\examples\nurserostering\domain\pattern\WorkBeforeFreeSequencePattern.class
org\optaplanner\examples\tsp\swingui\TspPanel$2.class
org\optaplanner\examples\projectjobscheduling\domain\ResourceRequirement.class
org\optaplanner\examples\common\swingui\ConstraintMatchesDialog$2.class
org\optaplanner\examples\investment\swingui\InvestmentPanel$2.class
org\optaplanner\examples\investment\solver\move\factory\InvestmentBiQuantityTransferMoveIteratorFactory$RandomInvestmentBiQuantityTransferMoveIterator.class
org\optaplanner\examples\vehiclerouting\domain\solver\nearby\CustomerNearbyDistanceMeter.class
org\optaplanner\examples\machinereassignment\swingui\MrMachinePanel$2.class
org\optaplanner\examples\nqueens\domain\solution\RowStrengthWeightFactory.class
org\optaplanner\examples\investment\swingui\InvestmentPanel$5.class
org\optaplanner\examples\projectjobscheduling\app\ProjectJobSchedulingBenchmarkApp.class
org\optaplanner\examples\machinereassignment\persistence\MachineReassignmentFileIO.class
org\optaplanner\examples\nqueens\solver\score\NQueensEasyScoreCalculator.class
org\optaplanner\examples\pas\persistence\PatientAdmissionScheduleImporter$PatientAdmissionScheduleInputBuilder.class
org\optaplanner\examples\nurserostering\solver\move\NurseRosteringMoveHelper.class
org\optaplanner\examples\projectjobscheduling\persistence\ProjectJobSchedulingImporter$ProjectJobSchedulingInputBuilder.class
org\optaplanner\examples\machinereassignment\solver\solution\initializer\ToOriginalMachineSolutionInitializer.class
org\optaplanner\examples\coachshuttlegathering\domain\solver\DepotAngleBusStopDifficultyWeightFactory.class
org\optaplanner\examples\investment\persistence\InvestmentImporter.class
org\optaplanner\examples\common\persistence\AbstractSolutionExporter$OutputBuilder.class
org\optaplanner\examples\nqueens\app\NQueensApp.class
org\optaplanner\examples\tsp\domain\Visit.class
org\optaplanner\examples\nqueens\swingui\NQueensPanel.class
org\optaplanner\examples\tennis\domain\TeamAssignment.class
org\optaplanner\examples\vehiclerouting\domain\solver\DepotDistanceCustomerDifficultyWeightFactory$DepotDistanceCustomerDifficultyWeight.class
org\optaplanner\examples\examination\domain\LeadingExam.class
org\optaplanner\examples\nurserostering\solver\move\factory\ShiftAssignmentPillarPartSwapMoveFactory.class
org\optaplanner\examples\examination\domain\solver\RoomStrengthWeightFactory.class
org\optaplanner\examples\curriculumcourse\persistence\CurriculumCourseImporter$CurriculumCourseInputBuilder.class
org\optaplanner\examples\cloudbalancing\solver\move\factory\CloudComputerChangeMoveFactory.class
org\optaplanner\examples\tsp\persistence\TspImageStipplerImporter.class
org\optaplanner\examples\cloudbalancing\swingui\CloudBalancingPanel$1.class
org\optaplanner\examples\machinereassignment\domain\MrProcess.class
org\optaplanner\examples\cheaptime\swingui\CheapTimePanel$1.class
org\optaplanner\examples\coachshuttlegathering\domain\BusHub.class
org\optaplanner\examples\machinereassignment\solver\drools\MrMachineUsage.class
org\optaplanner\examples\dinnerparty\domain\Job.class
org\optaplanner\examples\curriculumcourse\app\CurriculumCourseApp.class
org\optaplanner\examples\cloudbalancing\domain\solver\CloudComputerStrengthComparator.class
org\optaplanner\examples\nqueens\solver\move\factory\RowChangeMoveFactory.class
org\optaplanner\examples\nqueens\domain\solution\QueenDifficultyWeightFactory.class
javac.bat
org\optaplanner\examples\meetingscheduling\swingui\MeetingSchedulingPanel$OvertimeTimeGrain.class
org\optaplanner\examples\common\swingui\timetable\TimeTableLayout$Column.class
org\optaplanner\examples\common\swingui\ConstraintMatchesDialog$ConstraintMatchTotalTableModel.class
org\optaplanner\examples\projectjobscheduling\solver\score\capacity\RenewableResourceCapacityTracker.class
org\optaplanner\examples\machinereassignment\swingui\MachineReassignmentPanel$MrProcessAssignmentAction.class
org\optaplanner\examples\curriculumcourse\domain\solver\LectureDifficultyWeightFactory.class
org\optaplanner\examples\common\swingui\CommonIcons.class
org\optaplanner\examples\cloudbalancing\swingui\CloudBalancingPanel$6.class
org\optaplanner\examples\investment\app\InvestmentApp.class
org\optaplanner\examples\examination\swingui\InstitutionParametrizationDialog$1.class
org\optaplanner\examples\tsp\domain\solver\DomicileDistanceVisitDifficultyWeightFactory.class
org\optaplanner\examples\investment\persistence\InvestmentImporter$InvestmentAllocationInputBuilder.class
org\optaplanner\examples\vehiclerouting\domain\timewindowed\solver\DummyDirtyUpdatingVariableListener.class
org\optaplanner\examples\cloudbalancing\swingui\CloudBalancingPanel.class
org\optaplanner\examples\projectjobscheduling\domain\JobType.class
org\optaplanner\examples\cloudbalancing\swingui\CloudBalancingPanel$5.class
org\optaplanner\examples\meetingscheduling\swingui\MeetingSchedulingPanel.class
org\optaplanner\examples\nqueens\domain\solution\QueenDifficultyWeightFactory$QueenDifficultyWeight.class
org\optaplanner\examples\examination\swingui\ExaminationPanel$1.class
org\optaplanner\examples\investment\solver\score\InvestmentIncrementalScoreCalculator.class
org\optaplanner\examples\nurserostering\domain\solver\ShiftAssignmentDifficultyComparator.class
org\optaplanner\examples\common\swingui\timetable\TimeTableLayout$Row.class
org\optaplanner\examples\cheaptime\swingui\CheapTimePanel$GroupByMachineTaskAssignmentComparator.class
org\optaplanner\examples\examination\domain\PeriodPenalty.class
org\optaplanner\examples\machinereassignment\app\MachineReassignmentApp.class
org\optaplanner\examples\common\swingui\timetable\TimeTablePanel.class
org\optaplanner\examples\examination\swingui\InstitutionParametrizationDialog$2.class
org\optaplanner\examples\common\app\LoggingMain.class
org\optaplanner\examples\common\swingui\timetable\TimeTableLayoutConstraints.class
org\optaplanner\examples\investment\domain\AssetClass.class
org\optaplanner\examples\cheaptime\persistence\CheapTimeExporter.class
org\optaplanner\examples\tsp\domain\solver\DomicileDistanceVisitDifficultyWeightFactory$DomicileDistanceVisitDifficultyWeight.class
org\optaplanner\examples\machinereassignment\swingui\MachineReassignmentPanel.class
org\optaplanner\examples\pas\domain\Room$1.class
org\optaplanner\examples\tsp\persistence\TspImporter$TspInputBuilder.class
org\optaplanner\examples\pas\domain\RoomEquipment.class
org\optaplanner\examples\machinereassignment\domain\MrBalancePenalty.class
org\optaplanner\examples\common\app\CommonBenchmarkApp$ArgOption.class
org\optaplanner\examples\tsp\domain\Standstill.class
org\optaplanner\examples\vehiclerouting\solver\solution\initializer\BuoyVehicleRoutingSolutionInitializer$1.class
org\optaplanner\examples\common\persistence\AbstractSolutionExporter.class
org\optaplanner\examples\pas\domain\Room.class
org\optaplanner\examples\nurserostering\persistence\NurseRosteringImporter.class
org\optaplanner\examples\pas\solver\move\factory\BedDesignationPillarPartSwapMoveFactory$1.class
org\optaplanner\examples\machinereassignment\swingui\MachineReassignmentPanel$1.class
org\optaplanner\examples\nurserostering\domain\request\DayOnRequest.class
org\optaplanner\examples\vehiclerouting\domain\Standstill.class
org\optaplanner\examples\cloudbalancing\swingui\CloudComputerPanel$CloudProcessListDialog$1.class
org\optaplanner\examples\common\swingui\timetable\TimeTableLayout$1.class
org\optaplanner\examples\tennis\persistence\TennisDao.class
org\optaplanner\examples\nqueens\domain\NQueens.class
org\optaplanner\examples\pas\domain\Gender.class
org\optaplanner\examples\pas\solver\move\BedChangeMove.class
org\optaplanner\examples\travelingtournament\swingui\TravelingTournamentPanel.class
org\optaplanner\examples\cloudbalancing\solver\move\CloudProcessSwapMove.class
org\optaplanner\examples\common\swingui\timetable\TimeTableLayout$ComponentSpan.class
org\optaplanner\examples\investment\domain\Sector.class
org\optaplanner\examples\tsp\domain\solver\DomicileDistanceStandstillStrengthWeightFactory$DomicileDistanceVisitDifficultyWeight.class
org\optaplanner\examples\coachshuttlegathering\domain\CoachShuttleGatheringSolution.class
org\optaplanner\examples\cloudbalancing\app\CloudBalancingHelloWorld.class
org\optaplanner\examples\investment\swingui\InvestmentPanel$6.class
org\optaplanner\examples\machinereassignment\swingui\MrMachinePanel$1.class
org\optaplanner\examples\coachshuttlegathering\domain\solver\TransportTimeToHubUpdatingVariableListener.class
org\optaplanner\examples\nqueens\solver\score\NQueensBasicIncrementalScoreCalculator.class
org\optaplanner\examples\curriculumcourse\domain\Curriculum.class
org\optaplanner\examples\cheaptime\solver\move\factory\CheapTimePillarSlideMoveIteratorFactory.class
org\optaplanner\examples\curriculumcourse\persistence\CurriculumCourseImporter.class
org\optaplanner\examples\tsp\domain\TravelingSalesmanTour.class
org\optaplanner\examples\cheaptime\domain\Task.class
org\optaplanner\examples\pas\solver\move\factory\BedDesignationPillarPartSwapMoveFactory.class
org\optaplanner\examples\projectjobscheduling\solver\score\capacity\NonrenewableResourceCapacityTracker.class
org\optaplanner\examples\meetingscheduling\domain\Meeting.class
org\optaplanner\examples\vehiclerouting\persistence\VehicleRoutingImporter.class
org\optaplanner\examples\machinereassignment\domain\MrNeighborhood.class
org\optaplanner\examples\nurserostering\domain\pattern\FreeBefore2DaysWithAWorkDayPattern.class
org\optaplanner\examples\projectjobscheduling\domain\solver\ExecutionModeStrengthWeightFactory.class
org\optaplanner\examples\cloudbalancing\domain\CloudComputer.class
org\optaplanner\examples\investment\swingui\InvestmentPanel$1.class
org\optaplanner\examples\cloudbalancing\solver\move\CloudComputerChangeMove.class
org\optaplanner\examples\machinereassignment\domain\MrMachine.class
org\optaplanner\examples\meetingscheduling\domain\MeetingAssignment.class
org\optaplanner\examples\travelingtournament\persistence\TravelingTournamentDao.class
org\optaplanner\examples\travelingtournament\domain\Match.class
org\optaplanner\examples\machinereassignment\persistence\MachineReassignmentImporter$MachineReassignmentInputBuilder.class
org\optaplanner\examples\nurserostering\domain\ShiftTypeSkillRequirement.class
org\optaplanner\examples\app\OptaPlannerExamplesApp$WebExamplesDialog$1.class
org\optaplanner\examples\cheaptime\solver\score\CheapTimeIncrementalScoreCalculator$1.class
org\optaplanner\examples\coachshuttlegathering\domain\Shuttle.class
org\optaplanner\examples\tsp\swingui\TspWorldPanel$1.class
org\optaplanner\examples\vehiclerouting\domain\location\Location.class
org\optaplanner\examples\app\OptaPlannerExamplesApp$3.class
org\optaplanner\examples\cloudbalancing\swingui\CloudBalancingPanel$4.class
org\optaplanner\examples\cheaptime\swingui\CheapTimePanel.class
org\optaplanner\examples\projectjobscheduling\solver\score\ProjectJobSchedulingIncrementalScoreCalculator.class
org\optaplanner\examples\cheaptime\solver\score\CheapTimeIncrementalScoreCalculator.class
org\optaplanner\examples\coachshuttlegathering\persistence\CoachShuttleGatheringExporter.class
org\optaplanner\examples\dinnerparty\domain\Guest.class
org\optaplanner\examples\cloudbalancing\swingui\CloudComputerPanel.class
org\optaplanner\examples\vehiclerouting\swingui\VehicleRoutingWorldPanel$1.class
org\optaplanner\examples\common\persistence\AbstractSolutionImporter.class
org\optaplanner\examples\cheaptime\solver\score\CheapTimeIncrementalScoreCalculator$MachinePeriodStatus.class
org\optaplanner\examples\nurserostering\domain\ShiftDate.class
org\optaplanner\examples\common\persistence\AbstractXmlSolutionImporter$XmlInputBuilder.class
org\optaplanner\examples\machinereassignment\domain\MrProcessRequirement.class
org\optaplanner\examples\pas\domain\PatientAdmissionSchedule.class
org\optaplanner\examples\common\persistence\AbstractXmlSolutionExporter$XmlOutputBuilder.class
org\optaplanner\examples\meetingscheduling\swingui\MeetingSchedulingPanel$MeetingAssignmentAction.class
org\optaplanner\examples\cheaptime\persistence\CheapTimeImporter.class
org\optaplanner\examples\nurserostering\domain\contract\MinMaxContractLine.class
org\optaplanner\examples\cloudbalancing\solver\score\CloudBalancingEasyScoreCalculator.class
org\optaplanner\examples\nurserostering\app\NurseRosteringApp.class
org\optaplanner\examples\tsp\persistence\TspImporter.class
org\optaplanner\examples\common\persistence\AbstractPngSolutionImporter.class
org\optaplanner\examples\travelingtournament\persistence\TravelingTournamentExporter.class
org\optaplanner\examples\meetingscheduling\domain\Room.class
org\optaplanner\examples\pas\app\PatientAdmissionScheduleBenchmarkApp.class
org\optaplanner\examples\curriculumcourse\domain\solver\LectureDifficultyWeightFactory$LectureDifficultyWeight.class
org\optaplanner\examples\travelingtournament\swingui\TravelingTournamentPanel$MatchAction.class
org\optaplanner\examples\vehiclerouting\persistence\VehicleRoutingImporter$VehicleRoutingInputBuilder.class
org\optaplanner\examples\pas\persistence\PatientAdmissionScheduleImporter.class
org\optaplanner\examples\examination\persistence\ExaminationImporter$ExaminationInputBuilder.class
org\optaplanner\examples\examination\domain\solver\ExamDifficultyWeightFactory.class
org\optaplanner\examples\tsp\persistence\TspImporter$1.class
org\optaplanner\examples\examination\domain\solver\RoomStrengthWeightFactory$RoomStrengthWeight.class
org\optaplanner\examples\app\AllExamplesSolutionImporter.class
org\optaplanner\examples\cloudbalancing\solver\move\CloudBalancingMoveHelper.class
org\optaplanner\examples\vehiclerouting\app\VehicleRoutingBenchmarkApp.class
org\optaplanner\examples\cheaptime\solver\move\CheapTimePillarSlideMove.class
org\optaplanner\examples\vehiclerouting\solver\score\VehicleRoutingEasyScoreCalculator.class
org\optaplanner\examples\cheaptime\domain\TaskAssignment.class
org\optaplanner\examples\examination\persistence\ExaminationExporter$ExaminationOutputBuilder.class
org\optaplanner\examples\nurserostering\domain\request\DayOffRequest.class
org\optaplanner\examples\projectjobscheduling\persistence\ProjectJobSchedulingDao.class
org\optaplanner\examples\coachshuttlegathering\swingui\CoachShuttleGatheringPanel.class
org\optaplanner\examples\cloudbalancing\app\CloudBalancingBenchmarkHelloWorld.class
org\optaplanner\examples\nurserostering\domain\pattern\ShiftType2DaysPattern.class
org\optaplanner\examples\cheaptime\solver\score\CheapTimeIncrementalScoreCalculator$MachinePeriodPart.class
org\optaplanner\examples\examination\app\ExaminationBenchmarkApp.class
org\optaplanner\examples\meetingscheduling\domain\Attendance.class
org\optaplanner\examples\curriculumcourse\persistence\CurriculumCourseDao.class
org\optaplanner\examples\curriculumcourse\domain\Day.class
org\optaplanner\examples\projectjobscheduling\persistence\ProjectJobSchedulingImporter$ProjectJobSchedulingInputBuilder$ProjectFileInputBuilder.class
org\optaplanner\examples\tennis\swingui\TennisPanel$TeamAssignmentAction.class
org\optaplanner\examples\examination\swingui\ExaminationPanel$PeriodIcon.class
org\optaplanner\examples\vehiclerouting\swingui\VehicleRoutingSolutionPainter.class
org\optaplanner\examples\machinereassignment\swingui\MrMachinePanel$MrProcessAssignmentListDialog.class
org\optaplanner\examples\curriculumcourse\swingui\CurriculumCoursePanel.class
org\optaplanner\examples\cheaptime\app\CheapTimeBenchmarkApp.class
org\optaplanner\examples\nurserostering\solver\drools\EmployeeAssignmentTotal.class
org\optaplanner\examples\nurserostering\domain\SkillProficiency.class
org\optaplanner\examples\coachshuttlegathering\persistence\CoachShuttleGatheringImporter$CoachShuttleGatheringInputBuilder.class
org\optaplanner\examples\cheaptime\solver\score\CheapTimeEasyScoreCalculator$1.class
org\optaplanner\examples\curriculumcourse\domain\Lecture.class
org\optaplanner\examples\nurserostering\domain\ShiftAssignment.class
org\optaplanner\examples\examination\persistence\ExaminationDao.class
org\optaplanner\examples\coachshuttlegathering\persistence\CoachShuttleGatheringImporter.class
org\optaplanner\examples\cloudbalancing\swingui\CloudComputerPanel$2.class
org\optaplanner\examples\tsp\persistence\TspDao.class
org\optaplanner\examples\nurserostering\domain\contract\Contract.class
org\optaplanner\examples\curriculumcourse\domain\Timeslot.class
org\optaplanner\examples\pas\domain\solver\BedDesignationDifficultyWeightFactory.class
org\optaplanner\examples\vehiclerouting\app\VehicleRoutingApp.class
org\optaplanner\examples\nurserostering\solver\move\factory\ShiftAssignmentSequenceSwitchLength2MoveFactory$1.class
org\optaplanner\examples\cheaptime\persistence\CheapTimeExporter$CheapTimeOutputBuilder.class
org\optaplanner\examples\tsp\swingui\TspWorldPanel$2.class
org\optaplanner\examples\meetingscheduling\persistence\MeetingSchedulingGenerator.class
org\optaplanner\examples\tsp\persistence\TspExporter.class
org\optaplanner\examples\pas\domain\Specialism.class
org\optaplanner\examples\machinereassignment\domain\MrResource.class
org\optaplanner\examples\coachshuttlegathering\persistence\CoachShuttleGatheringExporter$CoachShuttleGatheringOutputBuilder.class
org\optaplanner\examples\examination\domain\Exam.class
org\optaplanner\examples\tsp\app\TspApp.class
org\optaplanner\examples\nurserostering\solver\move\factory\ShiftAssignmentSequenceSwitchLength3MoveFactory.class
org\optaplanner\examples\common\swingui\latitudelongitude\LatitudeLongitudeTranslator.class
org\optaplanner\examples\machinereassignment\solver\score\MachineReassignmentIncrementalScoreCalculator$MrMachineCapacityScorePart.class
org\optaplanner\examples\nurserostering\domain\Skill.class
org\optaplanner\examples\common\persistence\AbstractXmlSolutionImporter.class
org\optaplanner\examples\cheaptime\domain\Machine.class
org\optaplanner\examples\projectjobscheduling\domain\Schedule.class
org\optaplanner\examples\meetingscheduling\domain\Person.class
org\optaplanner\examples\tsp\domain\solver\DomicileDistanceStandstillStrengthWeightFactory.class
org\optaplanner\examples\travelingtournament\persistence\TravelingTournamentImporter.class
org\optaplanner\examples\pas\domain\Department.class
org\optaplanner\examples\tsp\swingui\TspWorldPanel.class
org\optaplanner\examples\cheaptime\solver\score\CheapTimeEasyScoreCalculator$MachinePeriodPart.class
org\optaplanner\examples\travelingtournament\domain\TravelingTournament.class
org\optaplanner\examples\investment\solver\move\InvestmentQuantityTransferMove.class
org\optaplanner\examples\machinereassignment\solver\score\MachineReassignmentIncrementalScoreCalculator$MrServiceScorePart.class
org\optaplanner\examples\nurserostering\swingui\EmployeePanel$ShiftAssignmentAction.class
org\optaplanner\examples\nqueens\domain\Queen.class
org\optaplanner\examples\vehiclerouting\domain\Distancesvehicles.class
org\optaplanner\examples\cloudbalancing\swingui\CloudComputerPanel$1.class
org\optaplanner\examples\vehiclerouting\domain\solver\DepotDistanceCustomerDifficultyWeightFactory.class
org\optaplanner\examples\nurserostering\solver\move\EmployeeMultipleChangeMove.class
org\optaplanner\examples\common\business\AlphaNumericStringComparator.class
org\optaplanner\examples\vehiclerouting\swingui\VehicleRoutingPanel$1.class
org\optaplanner\examples\nurserostering\domain\pattern\ShiftType3DaysPattern.class
org\optaplanner\examples\nurserostering\solver\drools\EmployeeConsecutiveAssignmentEnd.class
org\optaplanner\examples\machinereassignment\solver\drools\MrServiceMovedProcessesCount.class
org\optaplanner\examples\cloudbalancing\persistence\CloudBalancingGenerator.class
org\optaplanner\examples\tsp\swingui\TspListPanel.class
org\optaplanner\examples\nurserostering\domain\ShiftDate$1.class
org\optaplanner\examples\examination\swingui\ExaminationPanel$ExamAction.class
org\optaplanner\examples\meetingscheduling\domain\PreferredAttendance.class
org\optaplanner\examples\examination\domain\FollowingExam.class
org\optaplanner\examples\machinereassignment\solver\score\MachineReassignmentIncrementalScoreCalculator$MrMachineScorePart.class
org\optaplanner\examples\machinereassignment\domain\solver\MrProcessAssignmentDifficultyComparator.class
org\optaplanner\examples\pas\domain\Bed.class
org\optaplanner\examples\cloudbalancing\app\CloudBalancingBenchmarkApp.class
org\optaplanner\examples\nurserostering\domain\WeekendDefinition.class
org\optaplanner\examples\curriculumcourse\domain\solver\RoomStrengthWeightFactory.class
org\optaplanner\examples\dinnerparty\persistence\DinnerPartyImporter.class
org\optaplanner\examples\travelingtournament\domain\Day.class
org\optaplanner\examples\tsp\domain\solver\DomicileAngleVisitDifficultyWeightFactory$DomicileAngleVisitDifficultyWeight.class
org\optaplanner\examples\investment\solver\solution\initializer\InvestmentAllocationSolutionInitializer.class
org\optaplanner\examples\nurserostering\solver\drools\EmployeeConsecutiveWeekendAssignmentStart.class
org\optaplanner\examples\travelingtournament\app\TravelingTournamentApp.class
org\optaplanner\examples\tsp\app\TspBenchmarkApp.class
org\optaplanner\examples\projectjobscheduling\domain\ExecutionMode.class
org\optaplanner\examples\vehiclerouting\solver\solution\initializer\BuoyVehicleRoutingSolutionInitializer.class
org\optaplanner\examples\examination\domain\RoomPenaltyType.class
org\optaplanner\examples\vehiclerouting\domain\location\RoadLocation.class
org\optaplanner\examples\nurserostering\solver\move\factory\ShiftAssignmentSequenceSwitchLength3MoveFactory$1.class
org\optaplanner\examples\common\swingui\timetable\TimeTablePanel$HeaderRowKey.class
org\optaplanner\examples\common\persistence\AbstractPngSolutionImporter$PngInputBuilder.class
org\optaplanner\examples\dinnerparty\solver\solution\initializer\DinnerPartySolutionInitializer.class
org\optaplanner\examples\pas\swingui\PatientAdmissionSchedulePanel.class
org\optaplanner\examples\coachshuttlegathering\domain\BusOrStop.class
org\optaplanner\examples\projectjobscheduling\domain\resource\GlobalResource.class
org\optaplanner\examples\cheaptime\persistence\CheapTimeExporter$CheapTimeOutputBuilder$MachinePeriodStatus.class
org\optaplanner\examples\examination\swingui\ExaminationPanel$RoomIcon.class
org\optaplanner\examples\pas\solver\move\factory\BedDesignationSwapMoveFactory.class
org\optaplanner\examples\projectjobscheduling\domain\solver\NotSourceOrSinkAllocationFilter.class
org\optaplanner\examples\pas\domain\DepartmentSpecialism.class
org\optaplanner\examples\tsp\persistence\TspExporter$TspOutputBuilder.class
org\optaplanner\examples\travelingtournament\solver\move\MatchChainRotationsMove.class
org\optaplanner\examples\nqueens\domain\solution\RowStrengthWeightFactory$RowStrengthWeight.class
org\optaplanner\examples\nurserostering\domain\pattern\Pattern.class
org\optaplanner\examples\cheaptime\solver\score\CheapTimeEasyScoreCalculator.class
org\optaplanner\examples\app\OptaPlannerExamplesApp$2.class
org\optaplanner\examples\cloudbalancing\persistence\CloudBalancingDao.class
org\optaplanner\examples\travelingtournament\persistence\TravelingTournamentImporter$TravelingTournamentInputBuilder.class
org\optaplanner\examples\nurserostering\swingui\NurseRosteringPanel$1.class
org\optaplanner\examples\common\persistence\AbstractXlsxSolutionImporter.class
org\optaplanner\examples\pas\domain\solver\BedDesignationDifficultyWeightFactory$BedDesignationDifficultyWeight.class
org\optaplanner\examples\nurserostering\domain\solver\EmployeeStrengthComparator.class
org\optaplanner\examples\tennis\domain\solver\MovableTeamAssignmentSelectionFilter.class
org\optaplanner\examples\curriculumcourse\domain\CourseSchedule.class
org\optaplanner\examples\dinnerparty\app\DinnerPartyApp.class
org\optaplanner\examples\investment\solver\move\factory\InvestmentBiQuantityTransferMoveIteratorFactory.class
org\optaplanner\examples\projectjobscheduling\domain\resource\Resource.class
org\optaplanner\examples\nqueens\persistence\NQueensGenerator.class
org\optaplanner\examples\travelingtournament\domain\Team.class
org\optaplanner\examples\cheaptime\domain\PeriodPowerPrice.class
org\optaplanner\examples\machinereassignment\swingui\MrMachinePanel.class
org\optaplanner\examples\nurserostering\solver\move\factory\ShiftAssignmentPillarPartSwapMoveFactory$AssignmentSequence.class
org\optaplanner\examples\machinereassignment\domain\MrMachineCapacity.class
org\optaplanner\examples\tennis\domain\Team.class
org\optaplanner\examples\nurserostering\solver\move\factory\ShiftAssignmentSwapMoveFactory.class
org\optaplanner\examples\nurserostering\domain\contract\BooleanContractLine.class
org\optaplanner\examples\dinnerparty\domain\Table.class
org\optaplanner\examples\projectjobscheduling\domain\Project.class
org\optaplanner\examples\common\persistence\SolutionDao.class
org\optaplanner\examples\curriculumcourse\domain\Period.class
org\optaplanner\examples\nurserostering\persistence\NurseRosteringExporter$NurseRosteringOutputBuilder.class
org\optaplanner\examples\tsp\swingui\TspListPanel$VisitAction.class
org\optaplanner\examples\cloudbalancing\app\CloudBalancingApp.class
org\optaplanner\examples\pas\domain\GenderLimitation.class
org\optaplanner\examples\pas\app\PatientAdmissionScheduleApp.class
org\optaplanner\examples\nqueens\persistence\NQueensDao.class
org\optaplanner\examples\dinnerparty\domain\DinnerParty.class
org\optaplanner\examples\common\swingui\timetable\TimeTablePanel$HeaderColumnKey.class
org\optaplanner\examples\nurserostering\swingui\EmployeePanel.class
org\optaplanner\examples\cloudbalancing\persistence\CloudBalancingGenerator$Price.class
org\optaplanner\examples\coachshuttlegathering\domain\Coach.class
org\optaplanner\examples\investment\solver\move\factory\InvestmentQuantityTransferMoveIteratorFactory$RandomInvestmentQuantityTransferMoveIterator.class
org\optaplanner\examples\examination\swingui\ExaminationPanel$ExamIcon.class
org\optaplanner\examples\cheaptime\solver\drools\IdleCost.class
org\optaplanner\examples\tennis\persistence\TennisGenerator.class
org\optaplanner\examples\coachshuttlegathering\domain\location\RoadLocationArc.class
org\optaplanner\examples\projectjobscheduling\persistence\ProjectJobSchedulingImporter.class
org\optaplanner\examples\nurserostering\domain\NurseRoster.class
org\optaplanner\examples\dinnerparty\domain\HobbyPractician.class
org\optaplanner\examples\pas\persistence\PatientAdmissionScheduleImporter$PatientAdmissionScheduleInputBuilder$2.class
org\optaplanner\examples\nqueens\app\NQueensHelloWorld.class
org\optaplanner\examples\dinnerparty\domain\SeatDesignation.class
org\optaplanner\examples\pas\domain\BedDesignation.class
org\optaplanner\examples\coachshuttlegathering\solver\CoachShuttleGatheringEasyScoreCalculator.class
org\optaplanner\examples\machinereassignment\solver\score\MachineReassignmentIncrementalScoreCalculator.class
org\optaplanner\examples\pas\solver\move\factory\BedDesignationPillarPartSwapMoveFactory$LowestFirstNightBedDesignationIterator.class
org\optaplanner\examples\nurserostering\solver\move\factory\EmployeeChangeMoveFactory.class
org\optaplanner\examples\curriculumcourse\domain\Teacher.class
org\optaplanner\examples\machinereassignment\domain\MrLocation.class
org\optaplanner\examples\nqueens\domain\Row.class
org\optaplanner\examples\tsp\domain\location\Location.class
org\optaplanner\examples\curriculumcourse\persistence\CurriculumCourseExporter.class
org\optaplanner\examples\curriculumcourse\domain\solver\PeriodStrengthWeightFactory$PeriodStrengthWeight.class
org\optaplanner\examples\machinereassignment\domain\MachineReassignment.class
org\optaplanner\examples\machinereassignment\solver\selector\MrMachineProbabilityWeightFactory.class
org\optaplanner\examples\nurserostering\domain\request\ShiftOffRequest.class
org\optaplanner\examples\vehiclerouting\domain\timewindowed\TimeWindowedVehicleRoutingSolution.class
org\optaplanner\examples\curriculumcourse\domain\solver\CourseConflict.class
org\optaplanner\examples\examination\swingui\ExaminationPanel.class
org\optaplanner\examples\vehiclerouting\domain\MyObject.class
org\optaplanner\examples\investment\persistence\InvestmentDao.class
org\optaplanner\examples\cloudbalancing\swingui\CloudComputerPanel$CloudProcessListDialog.class
org\optaplanner\examples\nurserostering\domain\Employee.class
org\optaplanner\examples\examination\persistence\ExaminationExporter.class
org\optaplanner\examples\examination\domain\solver\PeriodUpdatingVariableListener.class
org\optaplanner\examples\app\OptaPlannerExamplesApp.class
org\optaplanner\examples\tennis\domain\TennisSolution.class
org\optaplanner\examples\nurserostering\solver\move\ShiftAssignmentSwapMove.class
org\optaplanner\examples\common\business\ProblemFileComparator.class
org\optaplanner\examples\nurserostering\persistence\NurseRosteringImporter$NurseRosteringInputBuilder.class
org\optaplanner\examples\investment\domain\InvestmentSolution.class
org\optaplanner\examples\tsp\domain\location\RoadLocation.class
org\optaplanner\examples\vehiclerouting\swingui\VehicleRoutingWorldPanel$2.class
org\optaplanner\examples\common\swingui\components\Labeled.class
org\optaplanner\examples\examination\domain\Period.class
org\optaplanner\examples\common\domain\AbstractPersistable.class
org\optaplanner\examples\nqueens\solver\score\NQueensMapBasedEasyScoreCalculator.class
org\optaplanner\examples\projectjobscheduling\domain\Allocation.class
org\optaplanner\examples\cloudbalancing\domain\CloudBalance.class
org\optaplanner\examples\dinnerparty\domain\Gender.class
org\optaplanner\examples\curriculumcourse\domain\solver\PeriodStrengthWeightFactory.class
org\optaplanner\examples\tsp\domain\location\AirLocation.class
org\optaplanner\examples\tsp\domain\location\DistanceType.class
org\optaplanner\examples\common\persistence\AbstractTxtSolutionImporter$TxtInputBuilder.class
org\optaplanner\examples\cheaptime\domain\CheapTimeSolution.class
org\optaplanner\examples\nqueens\solver\move\RowChangeMove.class
org\optaplanner\examples\nurserostering\domain\contract\PatternContractLine.class
org\optaplanner\examples\curriculumcourse\domain\solver\MovableLectureSelectionFilter.class
org\optaplanner\examples\vehiclerouting\domain\timewindowed\TimeWindowedDepot.class
org\optaplanner\examples\nurserostering\swingui\NurseRosteringPanel$2.class
org\optaplanner\examples\meetingscheduling\domain\TimeGrain.class
org\optaplanner\examples\pas\domain\RoomSpecialism.class
org\optaplanner\examples\dinnerparty\persistence\DinnerPartyImporter$DinnerPartyInputBuilder.class
org\optaplanner\examples\cloudbalancing\solver\score\CloudBalancingIncrementalScoreCalculator.class
org\optaplanner\examples\coachshuttlegathering\domain\BusStop.class
org\optaplanner\examples\nurserostering\solver\drools\EmployeeConsecutiveWeekendAssignmentEnd.class
org\optaplanner\examples\common\persistence\AbstractXmlSolutionExporter.class
org\optaplanner\examples\investment\domain\InvestmentParametrization.class
org\optaplanner\examples\cloudbalancing\swingui\CloudBalancingPanel$CloudProcessAction.class
org\optaplanner\examples\cloudbalancing\solver\move\factory\CloudProcessSwapMoveFactory.class
org\optaplanner\examples\cheaptime\solver\drools\MachinePeriodPart.class
org\optaplanner\examples\cloudbalancing\persistence\CloudBalancingGenerator$1.class
org\optaplanner\examples\pas\persistence\PatientAdmissionScheduleExporter.class
org\optaplanner\examples\examination\domain\Student.class
org\optaplanner\examples\common\app\CommonBenchmarkApp.class
org\optaplanner\examples\cheaptime\app\CheapTimeApp.class
org\optaplanner\examples\examination\domain\Topic.class
org\optaplanner\examples\investment\domain\Region.class
org\optaplanner\examples\dinnerparty\swingui\DinnerPartyPanel$SeatPanel.class
org\optaplanner\examples\common\swingui\SolutionPanel.class
org\optaplanner\examples\nurserostering\solver\drools\EmployeeWorkSequence.class
org\optaplanner\examples\tennis\domain\Day.class
org\optaplanner\examples\nurserostering\persistence\NurseRosteringDao.class
org\optaplanner\examples\nurserostering\swingui\NurseRosteringPanel$3.class
org\optaplanner\examples\cheaptime\persistence\CheapTimeImporter$CheapTimeInputBuilder.class
