01/01/2022,26,21
02/01/2022,27,23
03/01/2022,49,16
04/01/2022,42,24
05/01/2022,19,23
06/01/2022,44,31
07/01/2022,24,43
08/01/2022,17,31
09/01/2022,39,48
10/01/2022,40,30
11/01/2022,15,28
12/01/2022,22,25
13/01/2022,15,35
14/01/2022,20,47
15/01/2022,40,29
16/01/2022,45,44
17/01/2022,15,15
18/01/2022,32,24
19/01/2022,15,44
20/01/2022,33,25
21/01/2022,21,25
22/01/2022,26,41
23/01/2022,27,33
24/01/2022,32,29
25/01/2022,17,39
26/01/2022,48,42
27/01/2022,16,38
28/01/2022,42,15
29/01/2022,15,27
30/01/2022,18,23
31/01/2022,18,25
01/02/2022,47,41
02/02/2022,35,26
03/02/2022,38,29
04/02/2022,50,15
05/02/2022,50,19
06/02/2022,23,48
07/02/2022,34,29
08/02/2022,32,20
09/02/2022,32,32
10/02/2022,34,37
11/02/2022,31,21
12/02/2022,34,23
13/02/2022,18,20
14/02/2022,45,39
15/02/2022,43,30
16/02/2022,24,35
17/02/2022,29,31
18/02/2022,29,15
19/02/2022,37,35
20/02/2022,42,39
21/02/2022,46,47
22/02/2022,31,32
23/02/2022,20,48
24/02/2022,39,31
25/02/2022,22,26
26/02/2022,28,22
27/02/2022,18,32
28/02/2022,15,47
01/03/2022,19,15
02/03/2022,24,36
03/03/2022,20,34
04/03/2022,41,29
05/03/2022,32,32
06/03/2022,48,21
07/03/2022,37,31
08/03/2022,26,28
09/03/2022,28,35
10/03/2022,35,40
11/03/2022,17,32
12/03/2022,19,16
13/03/2022,25,39
14/03/2022,23,21
15/03/2022,41,29
16/03/2022,35,33
17/03/2022,46,23
18/03/2022,35,35
19/03/2022,17,47
20/03/2022,50,38
21/03/2022,16,30
22/03/2022,26,42
23/03/2022,39,25
24/03/2022,20,36
25/03/2022,41,28
26/03/2022,47,32
27/03/2022,50,18
28/03/2022,36,16
29/03/2022,25,47
30/03/2022,48,20
31/03/2022,46,29
01/04/2022,16,29
02/04/2022,22,19
03/04/2022,41,36
04/04/2022,30,20
05/04/2022,32,44
06/04/2022,42,17
07/04/2022,25,24
08/04/2022,47,25
09/04/2022,17,31
10/04/2022,45,48
11/04/2022,23,26
12/04/2022,39,20
13/04/2022,48,36
14/04/2022,22,27
15/04/2022,41,24
16/04/2022,35,46
17/04/2022,20,36
18/04/2022,42,17
19/04/2022,34,40
20/04/2022,30,36
21/04/2022,23,30
22/04/2022,17,50
23/04/2022,29,23
24/04/2022,34,34
25/04/2022,48,28
26/04/2022,26,35
27/04/2022,47,47
28/04/2022,38,20
29/04/2022,50,15
30/04/2022,34,37
01/05/2022,38,43
02/05/2022,23,40
03/05/2022,36,41
04/05/2022,46,27
05/05/2022,24,20
06/05/2022,17,19
07/05/2022,43,44
08/05/2022,35,24
09/05/2022,45,31
10/05/2022,25,31
11/05/2022,50,42
12/05/2022,36,15
13/05/2022,39,30
14/05/2022,34,29
15/05/2022,46,39
16/05/2022,28,26
17/05/2022,46,49
18/05/2022,46,24
19/05/2022,46,25
20/05/2022,29,39
21/05/2022,27,30
22/05/2022,17,26
23/05/2022,21,34
24/05/2022,18,30
25/05/2022,29,17
26/05/2022,22,16
27/05/2022,49,20
28/05/2022,29,39
29/05/2022,48,50
30/05/2022,45,23
31/05/2022,34,44
01/06/2022,32,24
02/06/2022,28,36
03/06/2022,29,26
04/06/2022,36,16
05/06/2022,36,29
06/06/2022,39,48
07/06/2022,23,28
08/06/2022,16,22
09/06/2022,29,44
10/06/2022,15,30
11/06/2022,40,29
12/06/2022,39,16
13/06/2022,30,22
14/06/2022,33,42
15/06/2022,31,24
16/06/2022,36,39
17/06/2022,47,18
18/06/2022,39,17
19/06/2022,19,48
20/06/2022,20,49
21/06/2022,49,26
22/06/2022,43,18
23/06/2022,36,20
24/06/2022,33,44
25/06/2022,32,21
26/06/2022,39,39
27/06/2022,31,21
28/06/2022,45,23
29/06/2022,22,24
30/06/2022,46,28
01/07/2022,32,44
02/07/2022,37,47
03/07/2022,42,40
04/07/2022,41,50
05/07/2022,25,15
06/07/2022,40,38
07/07/2022,17,16
08/07/2022,32,30
09/07/2022,35,49
10/07/2022,46,32
11/07/2022,31,29
12/07/2022,38,26
13/07/2022,22,24
14/07/2022,48,48
15/07/2022,23,20
16/07/2022,21,43
17/07/2022,47,40
18/07/2022,42,22
19/07/2022,41,46
20/07/2022,47,29
21/07/2022,23,45
22/07/2022,17,42
23/07/2022,31,26
24/07/2022,47,24
25/07/2022,43,34
26/07/2022,25,49
27/07/2022,19,37
28/07/2022,22,28
29/07/2022,34,25
30/07/2022,23,22
31/07/2022,30,27
01/08/2022,29,32
02/08/2022,33,19
03/08/2022,34,19
04/08/2022,33,40
05/08/2022,22,31
06/08/2022,15,23
07/08/2022,32,20
08/08/2022,24,34
09/08/2022,34,45
10/08/2022,38,45
11/08/2022,41,18
12/08/2022,17,39
13/08/2022,35,34
14/08/2022,34,38
15/08/2022,30,31
16/08/2022,39,40
17/08/2022,25,29
18/08/2022,33,38
19/08/2022,19,24
20/08/2022,49,23
21/08/2022,40,38
22/08/2022,48,42
23/08/2022,29,19
24/08/2022,23,28
25/08/2022,38,34
26/08/2022,45,42
27/08/2022,50,32
28/08/2022,29,40
29/08/2022,34,48
30/08/2022,27,19
31/08/2022,47,19
01/09/2022,41,15
02/09/2022,41,41
03/09/2022,42,42
04/09/2022,47,33
05/09/2022,24,15
06/09/2022,40,42
07/09/2022,40,40
08/09/2022,20,25
09/09/2022,29,33
10/09/2022,20,25
11/09/2022,37,49
12/09/2022,36,48
13/09/2022,20,47
14/09/2022,20,48
15/09/2022,42,48
16/09/2022,39,22
17/09/2022,23,45
18/09/2022,43,48
19/09/2022,30,21
20/09/2022,29,39
21/09/2022,49,41
22/09/2022,42,20
23/09/2022,21,41
24/09/2022,40,35
25/09/2022,47,41
26/09/2022,27,21
27/09/2022,41,31
28/09/2022,17,48
29/09/2022,24,15
30/09/2022,20,29
01/10/2022,35,37
02/10/2022,27,24
03/10/2022,22,15
04/10/2022,44,25
05/10/2022,22,42
06/10/2022,30,24
07/10/2022,44,44
08/10/2022,17,38
09/10/2022,43,39
10/10/2022,25,36
11/10/2022,37,46
12/10/2022,30,24
13/10/2022,28,27
14/10/2022,50,23
15/10/2022,20,30
16/10/2022,29,21
17/10/2022,17,28
18/10/2022,22,25
19/10/2022,30,19
20/10/2022,40,37
21/10/2022,23,22
22/10/2022,40,37
23/10/2022,27,18
24/10/2022,37,21
25/10/2022,44,41
26/10/2022,49,39
27/10/2022,21,17
28/10/2022,42,29
29/10/2022,43,29
30/10/2022,31,24
31/10/2022,47,21
01/11/2022,18,50
02/11/2022,24,47
03/11/2022,39,45
04/11/2022,29,44
05/11/2022,24,48
06/11/2022,27,35
07/11/2022,44,16
08/11/2022,38,27
09/11/2022,16,36
10/11/2022,19,18
11/11/2022,20,45
12/11/2022,31,21
13/11/2022,46,30
14/11/2022,39,38
15/11/2022,24,36
16/11/2022,18,41
17/11/2022,18,29
18/11/2022,18,50
19/11/2022,48,17
20/11/2022,25,23
21/11/2022,17,47
22/11/2022,17,21
23/11/2022,21,33
24/11/2022,36,21
25/11/2022,50,29
26/11/2022,39,39
27/11/2022,22,30
28/11/2022,30,23
29/11/2022,25,33
30/11/2022,36,45
01/12/2022,34,31
02/12/2022,23,29
03/12/2022,45,29
04/12/2022,38,36
05/12/2022,34,20
06/12/2022,26,44
07/12/2022,18,25
08/12/2022,49,37
09/12/2022,49,26
10/12/2022,26,37
11/12/2022,28,45
12/12/2022,41,28
13/12/2022,44,16
14/12/2022,46,20
15/12/2022,17,33
16/12/2022,42,49
17/12/2022,19,22
18/12/2022,45,38
19/12/2022,28,16
20/12/2022,23,29
21/12/2022,42,37
22/12/2022,20,44
23/12/2022,44,27
24/12/2022,42,21
25/12/2022,37,20
26/12/2022,25,44
27/12/2022,43,34
28/12/2022,38,35
29/12/2022,32,40
30/12/2022,16,32
31/12/2022,23,40