Engine/Binaries/Win64/UE4Game-Win64-Shipping.exe	2020-08-04T03:34:57.061Z
Engine/Extras/Redist/en-us/UE4PrereqSetup_x64.exe	2020-08-04T03:41:45.672Z
Engine/Binaries/ThirdParty/Oculus/OVRPlugin/OVRPlugin/Win64/OVRPlugin.dll	2020-08-04T03:30:42.505Z
Engine/Binaries/ThirdParty/DbgHelp/dbghelp.dll	2020-08-04T03:30:02.239Z
Engine/Binaries/ThirdParty/PhysX3/Win64/VS2015/PxFoundation_x64.dll	2020-08-04T03:31:26.985Z
Engine/Binaries/ThirdParty/PhysX3/Win64/VS2015/PxPvdSDK_x64.dll	2020-08-04T03:31:26.995Z
Engine/Binaries/ThirdParty/PhysX3/Win64/VS2015/PhysX3_x64.dll	2020-08-04T03:31:10.191Z
Engine/Binaries/ThirdParty/PhysX3/Win64/VS2015/PhysX3Cooking_x64.dll	2020-08-04T03:31:10.311Z
Engine/Binaries/ThirdParty/PhysX3/Win64/VS2015/PhysX3Common_x64.dll	2020-08-04T03:31:10.253Z
Engine/Binaries/ThirdParty/PhysX3/Win64/VS2015/APEX_Clothing_x64.dll	2020-08-04T03:31:02.373Z
Engine/Binaries/ThirdParty/PhysX3/Win64/VS2015/APEX_Legacy_x64.dll	2020-08-04T03:31:02.503Z
Engine/Binaries/ThirdParty/PhysX3/Win64/VS2015/ApexFramework_x64.dll	2020-08-04T03:31:02.612Z
Engine/Binaries/ThirdParty/PhysX3/Win64/VS2015/NvCloth_x64.dll	2020-08-04T03:31:10.167Z
Engine/Binaries/ThirdParty/Ogg/Win64/VS2015/libogg_64.dll	2020-08-04T03:30:42.512Z
Engine/Binaries/ThirdParty/Vorbis/Win64/VS2015/libvorbis_64.dll	2020-08-04T03:31:35.463Z
Engine/Binaries/ThirdParty/Vorbis/Win64/VS2015/libvorbisfile_64.dll	2020-08-04T03:31:35.464Z
Engine/Binaries/ThirdParty/NVIDIA/NVaftermath/Win64/GFSDK_Aftermath_Lib.x64.dll	2020-08-04T03:30:42.455Z
Engine/Binaries/ThirdParty/OpenVR/OpenVRv1_5_17/Win64/openvr_api.dll	2020-08-04T03:30:42.540Z
Engine/Binaries/ThirdParty/Windows/XAudio2_9/x64/xaudio2_9redist.dll	2020-08-04T03:31:37.444Z
KontikiAdventures/Content/Movies/Fd_nuevo_int.mp4	2020-07-05T23:46:00.393Z
KontikiAdventures/Content/Movies/Intro_completa.mp4	2020-07-02T22:34:21.862Z
KontikiAdventures.exe	2020-10-08T23:20:18.597Z
