%YAML 1.1
%TAG !u! tag:unity3d.com,2011:
--- !u!1045 &1
EditorBuildSettings:
  m_ObjectHideFlags: 0
  serializedVersion: 2
  m_Scenes:
  - enabled: 1
    path: Assets/Scenes/UI Menu.unity
    guid: fc718963ea1f5cb45b54bc233e9a0f19
  - enabled: 1
    path: Assets/Scenes/GameScene.unity
    guid: 75cdc1c1b38dd3c4bb33887f7521568e
  - enabled: 1
    path: Assets/Scenes/Game Over.unity
    guid: 63a31d19de077774ead756e03a265419
  m_configObjects: {}
