{
  "name": "api-gateway",
  "version": "1.0.0",
  "main": "index.js",
  "license": "MIT",
  "scripts": {
    "watech": "babel-watch -L src/index.js"
  },
  "devDependencies": {
    "babel-watch": "^7.0.0"
  },
  "dependencies": {
    "@babel/core": "^7.11.6", 
    "@babel/polyfill": "^7.11.5",
    "@babel/preset-env": "^7.11.5",
    "apollo-server": "^2.18.2",
    "apollo-server-express": "^2.18.2",
    "babel-plugin-module-resolver": "^4.0.0",
    "cookie-parser": "^1.4.5",
    "cors": "^2.8.5",
    "express": "^4.17.1"
  }
}
