{
  "name": "medi-service",
  "version": "1.0.0",
  "main": "index.js",
  "license": "MIT",
  "scripts": {
    "watch": "babel-watch -L src/index.js"
  },
  "devDependencies": {
    "babel-watch": "^7.0.0"
  },
  "dependencies": {
    "@babel/core": "^7.11.6",
    "@babel/polyfill": "^7.11.5",
    "@babel/preset-env": "^7.11.5",
    "babel-plugin-module-resolver": "^4.0.0"
  }
}
