{
  "name": "health-service",
  "version": "1.0.0",
  "main": "index.js",
  "license": "MIT",
  "scripts": {
    "db:migrate": "sequelize db:migrate",
    "db:migrate:undo": "sequelize db:migrate:undo",
    "watch": "babel-watch -L src/index.js"
  },
  "devDependencies": {
    "babel-watch": "^7.0.0"
  },
  "dependencies": {
    "@babel/core": "^7.11.6",
    "@babel/polyfill": "^7.11.5",
    "@babel/preset-env": "^7.11.5",
    "babel-plugin-module-resolver": "^4.0.0",
    "mariadb": "^2.4.2",
    "mysql2": "^2.2.5",
    "sequelize": "^6.3.5",
    "sequelize-cli": "^6.2.0"
  }
}
