%YAML 1.1
%TAG !u! tag:unity3d.com,2011:
--- !u!114 &11400000
MonoBehaviour:
  m_ObjectHideFlags: 0
  m_CorrespondingSourceObject: {fileID: 0}
  m_PrefabInstance: {fileID: 0}
  m_PrefabAsset: {fileID: 0}
  m_GameObject: {fileID: 0}
  m_Enabled: 1
  m_EditorHideFlags: 0
  m_Script: {fileID: 11500000, guid: ba324745b1f9c974b9273c4161b59089, type: 3}
  m_Name: EnemyTest
  m_EditorClassIdentifier: 
  Faction: 1
  UnitPrefap: {fileID: 3898140475161513264, guid: 95b2eb65759ac08448c2950c50c0e3ac, type: 3}
