// Jest Snapshot v1, https://goo.gl/fbAQLP

exports[`FormMessage should Match snapshot 1`] = `
<div
  className="bg-white py-2 px-3 w-full max-w-sm text-center mx-auto my-3"
>
  <p>
    error
  </p>
</div>
`;
