// Jest Snapshot v1, https://goo.gl/fbAQLP

exports[`Input should Match snapshot 1`] = `
<div>
  <input
    className="shadow appearance-none border rounded w-full py-2 px-3 text-gray-700 leading-tight focus:outline-none focus:shadow-outline"
    id={1}
    onBlur={[MockFunction]}
    onChange={[MockFunction]}
    placeholder="test"
    type="test"
    value="test"
  />
  <div
    className="my-2 bg-red-100 px-2 border-l-4 border-red-500 text-red-700 font-bold"
  >
    test
  </div>
</div>
`;
