{
    "main": [
        {
            "id": "6166cf4122f7ab1653070f7c",
            "conversation_id": "6166cf2d22f7abedbf070f43",
            "persona_id": "6166cf2d22f7ab3ac7070f45",
            "updated_at": "2021-11-19T08:16:54.869Z",
            "created_at": "2021-10-13T12:21:21.037Z",
            "is_left_side": true,
            "text": "Hallo und Willkommen im FFT",
            "type": "text",
            "next_message": "6172a6e57dedb5bc8a8d4fd7",
            "is_next_message_linked": false,
            "prev_message": null,
            "show_time": 1500,
            "is_first_message": true,
            "deleted": false,
            "text_with_variables": "Hallo und Willkommen im FFT\n\n#partial\n#skip_if(timeout=86400)\n\n#config(default_stop=False, delay=auto)",
            "intent": "default-intent-0",
            "free_answer": false,
            "buttons": [],
            "multichoice": false,
            "text_key": "4aa0ca48",
            "commands": {
                "partial": [],
                "skip_if": [
                    {
                        "timeout": 86400
                    }
                ],
                "config": [
                    {
                        "default_stop": false,
                        "delay": "auto"
                    }
                ]
            },
            "expected_type": "text"
        },
        {
            "id": "6166cf4122f7ab4a67070f80",
            "conversation_id": "6166cf2d22f7abedbf070f43",
            "persona_id": "6166cf2d22f7ab3ac7070f45",
            "updated_at": "2021-10-22T13:14:50.427Z",
            "created_at": "2021-10-13T12:21:21.037Z",
            "is_left_side": true,
            "text": "Brauchst du eine Empfehlung? In nächster Zeit läuft:",
            "type": "text",
            "next_message": null,
            "is_next_message_linked": false,
            "prev_message": "6166d77d22f7ab256307f352",
            "show_time": 1500,
            "is_first_message": false,
            "deleted": false,
            "text_with_variables": "Brauchst du eine Empfehlung? In nächster Zeit läuft:\n\n#no_main",
            "intent": "default-intent-1",
            "free_answer": false,
            "buttons": [
                {
                    "text": "Moonstruck",
                    "text_with_variables": "Moonstruck",
                    "is_next_message_linked": false,
                    "next_message": "6166dc0222f7ab6dfd08368d",
                    "text_key": "7911db32-btn0",
                    "commands": {}
                },
                {
                    "text": "Robin und die Hoods",
                    "text_with_variables": "Robin und die Hoods",
                    "is_next_message_linked": false,
                    "next_message": "6166dc0222f7abe6cb083690",
                    "text_key": "7911db32-btn1",
                    "commands": {}
                },
                {
                    "text": "Präludium der Kälte",
                    "text_with_variables": "Präludium der Kälte",
                    "is_next_message_linked": false,
                    "next_message": "6166dc0222f7abf626083692",
                    "text_key": "7911db32-btn2",
                    "commands": {}
                },
                {
                    "text": "Hexploitation",
                    "text_with_variables": "Hexploitation",
                    "is_next_message_linked": false,
                    "next_message": "6166dc0222f7abfff3083695",
                    "text_key": "7911db32-btn3",
                    "commands": {}
                }
            ],
            "multichoice": false,
            "text_key": "7911db32",
            "commands": {
                "no_main": []
            },
            "expected_type": "text"
        },
        {
            "id": "6166d20c22f7ab4cff076b5d",
            "conversation_id": "6166cf2d22f7abedbf070f43",
            "persona_id": "6166cf2d22f7ab3ac7070f45",
            "updated_at": "2021-10-22T13:14:18.313Z",
            "created_at": "2021-10-13T12:33:16.818Z",
            "is_left_side": true,
            "text": "Ich wurde programmiert, um mich mit dir zu unterhalten. \nWas möchtest du wissen? 🤔️ \n\nInfos zum aktuellen Programm, Infos über das FFT oder du weißt schon alles und möchte mit mir über das Theater philosophieren?!",
            "type": "text",
            "next_message": null,
            "is_next_message_linked": false,
            "prev_message": "6172a6e57dedb5bc8a8d4fd7",
            "show_time": 1500,
            "is_first_message": false,
            "deleted": false,
            "text_with_variables": "Ich wurde programmiert, um mich mit dir zu unterhalten. \nWas möchtest du wissen? :thinking_face: \n\nInfos zum aktuellen Programm, Infos über das FFT oder du weißt schon alles und möchte mit mir über das Theater philosophieren?!\n\n#no_main\n#no_back",
            "intent": "default-intent-0",
            "free_answer": false,
            "buttons": [
                {
                    "text": "Programm",
                    "text_with_variables": "Programm",
                    "is_next_message_linked": false,
                    "next_message": "6166d77d22f7ab256307f352",
                    "text_key": "ff903025-btn0",
                    "commands": {}
                },
                {
                    "text": "Über das FFT",
                    "text_with_variables": "Über das FFT",
                    "is_next_message_linked": false,
                    "next_message": "6166d77d22f7ab24d507f353",
                    "text_key": "ff903025-btn1",
                    "commands": {}
                },
                {
                    "text": "Mit mir chatten",
                    "text_with_variables": "Mit mir chatten",
                    "is_next_message_linked": false,
                    "next_message": "6166d77d22f7aba37e07f35a",
                    "text_key": "ff903025-btn2",
                    "commands": {}
                }
            ],
            "multichoice": false,
            "text_key": "ff903025",
            "commands": {
                "no_main": [],
                "no_back": []
            },
            "expected_type": "text"
        },
        {
            "id": "6166d77d22f7ab256307f352",
            "conversation_id": "6166cf2d22f7abedbf070f43",
            "persona_id": "6166cf2d22f7ab3ac7070f45",
            "updated_at": "2021-10-22T13:14:42.919Z",
            "created_at": "2021-10-13T12:56:29.101Z",
            "is_left_side": true,
            "text": "Hast du Lust auf Moonstruck oder Robin und die Hoods? Willst du Musik oder Performance? Schau auf unsere Webseite, da findest du das aktuelle Programm, Infos zu Preisen, Künstler*innen, Anreise oder Hintergrundinformationen: https:\/\/www.fft-duesseldorf.de\/de\/",
            "type": "text",
            "next_message": "6166cf4122f7ab4a67070f80",
            "is_next_message_linked": false,
            "prev_message": "6166d77d22f7ab778307f351",
            "show_time": 1500,
            "is_first_message": false,
            "deleted": false,
            "text_with_variables": "Hast du Lust auf Moonstruck oder Robin und die Hoods? Willst du Musik oder Performance? Schau auf unsere Webseite, da findest du das aktuelle Programm, Infos zu Preisen, Künstler*innen, Anreise oder Hintergrundinformationen: https:\/\/www.fft-duesseldorf.de\/de\/\n\n#partial\n#skip_if(timeout=86400)",
            "intent": "default-intent-1",
            "free_answer": false,
            "buttons": [],
            "multichoice": false,
            "text_key": "deb9f2dd",
            "commands": {
                "partial": [],
                "skip_if": [
                    {
                        "timeout": 86400
                    }
                ]
            },
            "expected_type": "text"
        },
        {
            "id": "6166d77d22f7aba37e07f35a",
            "conversation_id": "6166cf2d22f7abedbf070f43",
            "persona_id": "6166cf2d22f7ab3ac7070f45",
            "updated_at": "2021-11-30T10:58:14.122Z",
            "created_at": "2021-10-13T12:56:29.102Z",
            "is_left_side": true,
            "text": "Gerne. Philosophieren ist auch meine Leidenschaft. Worüber möchtest du sprechen?",
            "type": "text",
            "next_message": null,
            "is_next_message_linked": false,
            "prev_linked_messages": [
                "61825fdc5c79483a7b62728a",
                "6182625b5c7948b442638893",
                "6182625b5c79481b61638894",
                "6182625b5c794855f8638895",
                "6182625b5c79480972638896",
                "6182625b5c79486f6d638897",
                "6182625b5c79489825638898"
            ],
            "prev_message": "6166d77d22f7ab778307f351",
            "show_time": 1500,
            "is_first_message": false,
            "deleted": false,
            "text_with_variables": "Gerne. Philosophieren ist auch meine Leidenschaft. Worüber möchtest du sprechen?\n\n#ai(default_message=False, model=dialogpt, limit=16)\n#no_main",
            "intent": "default-intent-10",
            "free_answer": false,
            "buttons": [
                {
                    "text": "Theater",
                    "text_with_variables": "Theater",
                    "is_next_message_linked": false,
                    "text_key": "6a6e5cbe-btn0",
                    "commands": {}
                },
                {
                    "text": "Demokratie",
                    "text_with_variables": "Demokratie",
                    "is_next_message_linked": false,
                    "text_key": "6a6e5cbe-btn1",
                    "commands": {}
                },
                {
                    "text": "Feminismus",
                    "text_with_variables": "Feminismus",
                    "is_next_message_linked": false,
                    "text_key": "6a6e5cbe-btn2",
                    "commands": {}
                },
                {
                    "text": "Liebe",
                    "text_with_variables": "Liebe",
                    "is_next_message_linked": false,
                    "text_key": "6a6e5cbe-btn3",
                    "commands": {}
                },
                {
                    "text": "Urbanität",
                    "text_with_variables": "Urbanität",
                    "is_next_message_linked": false,
                    "text_key": "6a6e5cbe-btn4",
                    "commands": {}
                }
            ],
            "multichoice": false,
            "text_key": "6a6e5cbe",
            "commands": {
                "ai": [
                    {
                        "default_message": false,
                        "model": "dialogpt",
                        "limit": 16
                    }
                ],
                "no_main": []
            },
            "expected_type": "text"
        },
        {
            "id": "6166d77d22f7ab09b107f359",
            "conversation_id": "6166cf2d22f7abedbf070f43",
            "persona_id": "6166cf2d22f7ab3ac7070f45",
            "updated_at": "2021-11-03T10:21:45.134Z",
            "created_at": "2021-10-13T12:56:29.102Z",
            "is_left_side": true,
            "text": "Ja klar. Bei uns kann man mitspielen, mitdenken, mitarbeiten, in Stücken, Performances und Workshops.",
            "type": "text",
            "next_message": null,
            "is_next_message_linked": false,
            "prev_message": "61728d9a2c48a9eebea1dde5",
            "show_time": 1500,
            "is_first_message": false,
            "deleted": false,
            "text_with_variables": "Ja klar. Bei uns kann man mitspielen, mitdenken, mitarbeiten, in Stücken, Performances und Workshops.",
            "intent": "default-intent-9",
            "free_answer": false,
            "buttons": [
                {
                    "text": "Mit mir chatten",
                    "text_with_variables": "Mit mir chatten",
                    "is_next_message_linked": true,
                    "next_message": "6166d77d22f7aba37e07f35a",
                    "text_key": "729b18b4-btn0",
                    "commands": {}
                }
            ],
            "multichoice": false,
            "text_key": "729b18b4",
            "commands": {},
            "expected_type": "text"
        },
        {
            "id": "6166d77d22f7ab47b507f358",
            "conversation_id": "6166cf2d22f7abedbf070f43",
            "persona_id": "6166cf2d22f7ab3ac7070f45",
            "updated_at": "2021-10-21T14:11:57.947Z",
            "created_at": "2021-10-13T12:56:29.102Z",
            "is_left_side": true,
            "text": "Im FFT sind Performer*innen, Musiker*innen, Hacker*innen, Schauspieler*innen, Choreograph*innen, Wissenschaftler*innen, Regisseur*innen und viele andere zu Hause. Das sieht dann vielleicht so aus:",
            "type": "text",
            "next_message": "617166f19b372b1560ed940a",
            "is_next_message_linked": false,
            "prev_message": "6166d77d22f7ab1c1a07f356",
            "show_time": 1500,
            "is_first_message": false,
            "deleted": false,
            "text_with_variables": "Im FFT sind Performer*innen, Musiker*innen, Hacker*innen, Schauspieler*innen, Choreograph*innen, Wissenschaftler*innen, Regisseur*innen und viele andere zu Hause. Das sieht dann vielleicht so aus: \n\n\n\n#partial",
            "intent": "default-intent-8",
            "free_answer": false,
            "buttons": [],
            "multichoice": false,
            "text_key": "c57611d7",
            "commands": {
                "partial": []
            },
            "expected_type": "text"
        },
        {
            "id": "6166d77d22f7ab76ee07f355",
            "conversation_id": "6166cf2d22f7abedbf070f43",
            "persona_id": "6166cf2d22f7ab3ac7070f45",
            "updated_at": "2021-10-22T10:40:41.599Z",
            "created_at": "2021-10-13T12:56:29.101Z",
            "is_left_side": true,
            "text": "Was möchtest du noch wissen?",
            "type": "text",
            "next_message": null,
            "is_next_message_linked": false,
            "prev_message": "617166f19b372bf030ed9407",
            "show_time": 1500,
            "is_first_message": false,
            "deleted": false,
            "text_with_variables": "Was möchtest du noch wissen?\n\n#back_ignore_partials\n#no_main",
            "intent": "default-intent-6",
            "free_answer": false,
            "buttons": [
                {
                    "text": "Wer hier arbeitet?",
                    "text_with_variables": "Wer hier arbeitet?",
                    "is_next_message_linked": false,
                    "next_message": "6166d77d22f7ab3df207f357",
                    "text_key": "d3fe1fc5-btn0",
                    "commands": {}
                },
                {
                    "text": "Wer hier spielt?",
                    "text_with_variables": "Wer hier spielt?",
                    "is_next_message_linked": false,
                    "next_message": "6166d77d22f7ab47b507f358",
                    "text_key": "d3fe1fc5-btn1",
                    "commands": {}
                },
                {
                    "text": "Mitmachen?",
                    "text_with_variables": "Mitmachen?",
                    "is_next_message_linked": false,
                    "next_message": "61728d9a2c48a9eebea1dde5",
                    "text_key": "d3fe1fc5-btn2",
                    "commands": {}
                }
            ],
            "multichoice": false,
            "text_key": "d3fe1fc5",
            "commands": {
                "back_ignore_partials": [],
                "no_main": []
            },
            "expected_type": "text"
        },
        {
            "id": "6166d77d22f7ab24d507f353",
            "conversation_id": "6166cf2d22f7abedbf070f43",
            "persona_id": "6166cf2d22f7ab3ac7070f45",
            "updated_at": "2021-10-21T13:44:41.946Z",
            "created_at": "2021-10-13T12:56:29.101Z",
            "is_left_side": true,
            "text": "Das FFT ist ein internationales Produktionshaus für freie darstellende Künste und agiert in einem Netzwerk aus Produktionsstätten, Theatern und weiteren Partnern sowohl regional als auch international. Wir sind gerade umgezogen ins neue Kulturzentrum KAP1:",
            "type": "text",
            "next_message": "617166f19b372bde49ed9408",
            "is_next_message_linked": false,
            "prev_message": "6166d77d22f7ab778307f351",
            "show_time": 1500,
            "is_first_message": false,
            "deleted": false,
            "text_with_variables": "Das FFT ist ein internationales Produktionshaus für freie darstellende Künste und agiert in einem Netzwerk aus Produktionsstätten, Theatern und weiteren Partnern sowohl regional als auch international. Wir sind gerade umgezogen ins neue Kulturzentrum KAP1:\n\n#partial",
            "intent": "default-intent-6",
            "free_answer": false,
            "buttons": [],
            "multichoice": false,
            "text_key": "8b3767f7",
            "commands": {
                "partial": []
            },
            "expected_type": "text"
        },
        {
            "id": "6166d77d22f7ab3df207f357",
            "conversation_id": "6166cf2d22f7abedbf070f43",
            "persona_id": "6166cf2d22f7ab3ac7070f45",
            "updated_at": "2021-11-03T10:21:22.607Z",
            "created_at": "2021-10-13T12:56:29.101Z",
            "is_left_side": true,
            "text": "Wir sind das FFT Team: https:\/\/www.fft-duesseldorf.de\/team\/",
            "type": "text",
            "next_message": null,
            "is_next_message_linked": false,
            "prev_message": "6166d77d22f7ab1c1a07f356",
            "show_time": 1500,
            "is_first_message": false,
            "deleted": false,
            "text_with_variables": "Wir sind das FFT Team: https:\/\/www.fft-duesseldorf.de\/team\/",
            "intent": "default-intent-7",
            "free_answer": false,
            "buttons": [
                {
                    "text": "Mit mir chatten",
                    "text_with_variables": "Mit mir chatten",
                    "is_next_message_linked": true,
                    "next_message": "6166d77d22f7aba37e07f35a",
                    "text_key": "0bf494d7-btn0",
                    "commands": {}
                }
            ],
            "multichoice": false,
            "text_key": "0bf494d7",
            "commands": {},
            "expected_type": "text"
        },
        {
            "id": "6166dc0222f7abf626083692",
            "conversation_id": "6166cf2d22f7abedbf070f43",
            "persona_id": "6166cf2d22f7ab3ac7070f45",
            "updated_at": "2021-10-13T13:25:08.486Z",
            "created_at": "2021-10-13T13:15:46.369Z",
            "is_left_side": true,
            "text": "Präludium der Kälte ist ein weibliches Körperspiel, ein Spiel gegen die tägliche Versteinerung, gegen die Macht der Kälte, die in unsere Körper einzieht. Die Tanzkompanie Cooperativa Maura Morales liefert in ihrer neuen Produktion ein Vorspiel zur Erkaltung des menschlichen, des weiblichen Körpers.  \n03. – 05.12.",
            "type": "text",
            "next_message": "6166dc0222f7ab4c41083693",
            "is_next_message_linked": false,
            "prev_message": "6166cf4122f7ab237a070f81",
            "show_time": 1500,
            "is_first_message": false,
            "deleted": false,
            "text_with_variables": "Präludium der Kälte ist ein weibliches Körperspiel, ein Spiel gegen die tägliche Versteinerung, gegen die Macht der Kälte, die in unsere Körper einzieht. Die Tanzkompanie Cooperativa Maura Morales liefert in ihrer neuen Produktion ein Vorspiel zur Erkaltung des menschlichen, des weiblichen Körpers.  \n03. – 05.12.\n\n#partial",
            "intent": "default-intent-4",
            "free_answer": false,
            "buttons": [],
            "multichoice": false,
            "text_key": "57b92619",
            "commands": {
                "partial": []
            },
            "expected_type": "text"
        },
        {
            "id": "6166dc0222f7ab5d4c083696",
            "conversation_id": "6166cf2d22f7abedbf070f43",
            "persona_id": "6166cf2d22f7ab3ac7070f45",
            "updated_at": "2021-11-03T10:21:06.718Z",
            "created_at": "2021-10-13T13:15:46.369Z",
            "is_left_side": true,
            "type": "image",
            "text": "She She Pop ist ein Performance-Kollektiv, das in den 90er Jahren am Gießener Institut für Angewandte Theaterwissenschaft gegründet wurde. Die Mitglieder der Gruppe sind in der Mehrzahl Frauen und arbeiten im Kollektiv. Die Performer*innen verstehen sich als Autor*innen, Dramaturg*innen und Ausführende ihrer Bühnenhandlung. Das Einbeziehen der eigenen Autobiografie ist dabei vor allem Methode, nicht Zweck der Arbeit. Daraus entsteht eine Theaterform, die dem Experiment verpflichtet ist. Die Bühne ist immer ein Ort der akuten Öffentlichkeit. Hier werden Entscheidungen getroffen, Gesprächsweisen und Gesellschaftssysteme ausprobiert, Sprech-Gesten und soziale Rituale einstudiert oder verworfen. She She Pop sehen ihre Aufgabe in der Suche nach den gesellschaftlichen Grenzen der Kommunikation – und in deren gezielter und kunstvoller Überschreitung im Schutzraum des Theaters. Das Theater wird zu einem Raum für utopische Kommunikation.",
            "next_message": null,
            "is_next_message_linked": false,
            "prev_message": "6166dc0222f7abfff3083695",
            "show_time": 1500,
            "is_first_message": false,
            "deleted": false,
            "text_with_variables": "She She Pop ist ein Performance-Kollektiv, das in den 90er Jahren am Gießener Institut für Angewandte Theaterwissenschaft gegründet wurde. Die Mitglieder der Gruppe sind in der Mehrzahl Frauen und arbeiten im Kollektiv. Die Performer*innen verstehen sich als Autor*innen, Dramaturg*innen und Ausführende ihrer Bühnenhandlung. Das Einbeziehen der eigenen Autobiografie ist dabei vor allem Methode, nicht Zweck der Arbeit. Daraus entsteht eine Theaterform, die dem Experiment verpflichtet ist. Die Bühne ist immer ein Ort der akuten Öffentlichkeit. Hier werden Entscheidungen getroffen, Gesprächsweisen und Gesellschaftssysteme ausprobiert, Sprech-Gesten und soziale Rituale einstudiert oder verworfen. She She Pop sehen ihre Aufgabe in der Suche nach den gesellschaftlichen Grenzen der Kommunikation – und in deren gezielter und kunstvoller Überschreitung im Schutzraum des Theaters. Das Theater wird zu einem Raum für utopische Kommunikation.",
            "intent": "default-intent-5",
            "image": "https:\/\/s3.amazonaws.com\/botsociety.prod.us\/92a886865fc61b02cde2565_pic5jpg.jpg",
            "size": "horizontal",
            "free_answer": false,
            "buttons": [
                {
                    "text": "Mit mir chatten",
                    "text_with_variables": "Mit mir chatten",
                    "is_next_message_linked": true,
                    "next_message": "6166d77d22f7aba37e07f35a",
                    "text_key": "b4826506-btn0",
                    "commands": {}
                }
            ],
            "multichoice": false,
            "text_key": "b4826506",
            "commands": {},
            "expected_type": "text"
        },
        {
            "id": "6166dc0222f7abcc1208368f",
            "conversation_id": "6166cf2d22f7abedbf070f43",
            "persona_id": "6166cf2d22f7ab3ac7070f45",
            "updated_at": "2021-11-03T10:16:06.070Z",
            "created_at": "2021-10-13T13:15:46.367Z",
            "is_left_side": true,
            "text": "",
            "type": "image",
            "next_message": null,
            "is_next_message_linked": false,
            "prev_message": "6166dc0222f7ab802808368e",
            "show_time": 1500,
            "is_first_message": false,
            "deleted": false,
            "intent": "default-intent-2",
            "image": "https:\/\/s3.amazonaws.com\/botsociety.prod.us\/e5d8ca058158582dd85bfdeda2d319f_pic2jpg.jpg",
            "size": "horizontal",
            "free_answer": false,
            "buttons": [
                {
                    "text": "Mit mir chatten",
                    "text_with_variables": "Mit mir chatten",
                    "is_next_message_linked": true,
                    "next_message": "6166d77d22f7aba37e07f35a",
                    "text_key": "1947f47a-btn0",
                    "commands": {}
                }
            ],
            "multichoice": false,
            "text_key": "1947f47a",
            "commands": {},
            "expected_type": "text"
        },
        {
            "id": "6166dc0222f7abfff3083695",
            "conversation_id": "6166cf2d22f7abedbf070f43",
            "persona_id": "6166cf2d22f7ab3ac7070f45",
            "updated_at": "2021-10-13T13:26:47.825Z",
            "created_at": "2021-10-13T13:15:46.369Z",
            "is_left_side": true,
            "text": "Dieses Jahr werden die Mitglieder von She She Pop alle um die 50 Jahre alt sein. Und so beschäftigen sie sich mit der Angst vor der alten Frau. Die Performerinnen setzen ihre alternden Körper ein und kämpfen mit ihnen gegen den Bedeutungsverlust, den alternde Frauen als gesellschaftliche Subjekte erleiden. \n10. – 12.12.",
            "type": "text",
            "next_message": "6166dc0222f7ab5d4c083696",
            "is_next_message_linked": false,
            "prev_message": "6166cf4122f7ab237a070f81",
            "show_time": 1500,
            "is_first_message": false,
            "deleted": false,
            "text_with_variables": "Dieses Jahr werden die Mitglieder von She She Pop alle um die 50 Jahre alt sein. Und so beschäftigen sie sich mit der Angst vor der alten Frau. Die Performerinnen setzen ihre alternden Körper ein und kämpfen mit ihnen gegen den Bedeutungsverlust, den alternde Frauen als gesellschaftliche Subjekte erleiden. \n10. – 12.12.\n\n#partial",
            "intent": "default-intent-5",
            "free_answer": false,
            "buttons": [],
            "multichoice": false,
            "text_key": "49cc9a66",
            "commands": {
                "partial": []
            },
            "expected_type": "text"
        },
        {
            "id": "6166dc0222f7ab4c41083693",
            "conversation_id": "6166cf2d22f7abedbf070f43",
            "persona_id": "6166cf2d22f7ab3ac7070f45",
            "updated_at": "2021-10-13T13:25:42.648Z",
            "created_at": "2021-10-13T13:15:46.369Z",
            "is_left_side": true,
            "text": "Cooperativa Maura Morales ist eine der wenigen zeitgenössischen Tanzkompanien in NRW, der es bereits seit vielen Jahren gelingt, den Schwerpunkt ihres künstlerischen Schaffens in NRW zu festigen und zugleich ihre nationale und insbesondere internationale Reichweite fortwährend weiter auszudehnen. Das hohe Wirkungspotential der Cooperativa Maura Morales verdeutlicht sich u.a. durch ein überaus hohes nationales und internationales Tour-Aufkommen von bis zu 50 Gastspielen im Jahr in Tansania, Brasilien, Korea, Libanon, Panama, Dominikanische Republik, La Réunion, Mazedonien, Russland und ganz Europa.",
            "type": "text",
            "next_message": "6166dc0222f7ab4640083694",
            "is_next_message_linked": false,
            "prev_message": "6166dc0222f7abf626083692",
            "show_time": 1500,
            "is_first_message": false,
            "deleted": false,
            "text_with_variables": "Cooperativa Maura Morales ist eine der wenigen zeitgenössischen Tanzkompanien in NRW, der es bereits seit vielen Jahren gelingt, den Schwerpunkt ihres künstlerischen Schaffens in NRW zu festigen und zugleich ihre nationale und insbesondere internationale Reichweite fortwährend weiter auszudehnen. Das hohe Wirkungspotential der Cooperativa Maura Morales verdeutlicht sich u.a. durch ein überaus hohes nationales und internationales Tour-Aufkommen von bis zu 50 Gastspielen im Jahr in Tansania, Brasilien, Korea, Libanon, Panama, Dominikanische Republik, La Réunion, Mazedonien, Russland und ganz Europa.\n\n#partial",
            "intent": "default-intent-4",
            "free_answer": false,
            "buttons": [],
            "multichoice": false,
            "text_key": "2788deff",
            "commands": {
                "partial": []
            },
            "expected_type": "text"
        },
        {
            "id": "6166dc0222f7abe6cb083690",
            "conversation_id": "6166cf2d22f7abedbf070f43",
            "persona_id": "6166cf2d22f7ab3ac7070f45",
            "updated_at": "2021-10-13T13:24:17.741Z",
            "created_at": "2021-10-13T13:15:46.367Z",
            "is_left_side": true,
            "text": "Wie sehr sind wir Robin Hood und möchten es sein? Spielerisch, mit Elektropunkmusik und in Strumpfhosen tanzend, erproben pulk fiktion für Menschen ab 8 Jahren den Aufstand. \n25. – 27.11.",
            "type": "text",
            "next_message": "6166dc0222f7abe5c1083691",
            "is_next_message_linked": false,
            "prev_message": "6166cf4122f7ab237a070f81",
            "show_time": 1500,
            "is_first_message": false,
            "deleted": false,
            "text_with_variables": "Wie sehr sind wir Robin Hood und möchten es sein? Spielerisch, mit Elektropunkmusik und in Strumpfhosen tanzend, erproben pulk fiktion für Menschen ab 8 Jahren den Aufstand. \n25. – 27.11.\n\n#partial",
            "intent": "default-intent-3",
            "free_answer": false,
            "buttons": [],
            "multichoice": false,
            "text_key": "2e9c160d",
            "commands": {
                "partial": []
            },
            "expected_type": "text"
        },
        {
            "id": "6166dc0222f7ab6dfd08368d",
            "conversation_id": "6166cf2d22f7abedbf070f43",
            "persona_id": "6166cf2d22f7ab3ac7070f45",
            "updated_at": "2021-10-13T13:22:53.832Z",
            "created_at": "2021-10-13T13:15:46.367Z",
            "is_left_side": true,
            "text": "Faszination Mond! In einer tosenden Show voller kosmischer Wetterwechsel werden die Fantasien und Trugbilder des westlichen Humanismus hervorholt, um sie mit der Wirklichkeit dieses Planeten zu konfrontieren, auf dem wir zuhause sind. \n\nEin performatives Konzert von Ariel Efraim Ashbel and friends.\n12. – 13.11.",
            "type": "text",
            "next_message": "6166dc0222f7ab802808368e",
            "is_next_message_linked": false,
            "prev_message": "6166cf4122f7ab237a070f81",
            "show_time": 1500,
            "is_first_message": false,
            "deleted": false,
            "text_with_variables": "Faszination Mond! In einer tosenden Show voller kosmischer Wetterwechsel werden die Fantasien und Trugbilder des westlichen Humanismus hervorholt, um sie mit der Wirklichkeit dieses Planeten zu konfrontieren, auf dem wir zuhause sind. \n\nEin performatives Konzert von Ariel Efraim Ashbel and friends.\n12. – 13.11. \n\n#partial",
            "intent": "default-intent-2",
            "free_answer": false,
            "buttons": [],
            "multichoice": false,
            "text_key": "fe0759ea",
            "commands": {
                "partial": []
            },
            "expected_type": "text"
        },
        {
            "id": "6166dc0222f7abe5c1083691",
            "conversation_id": "6166cf2d22f7abedbf070f43",
            "persona_id": "6166cf2d22f7ab3ac7070f45",
            "updated_at": "2021-11-03T10:20:34.465Z",
            "created_at": "2021-10-13T13:15:46.368Z",
            "is_left_side": true,
            "type": "image",
            "next_message": null,
            "is_next_message_linked": false,
            "prev_message": "6166dc0222f7abe6cb083690",
            "show_time": 1500,
            "is_first_message": false,
            "deleted": false,
            "intent": "default-intent-3",
            "image": "https:\/\/s3.amazonaws.com\/botsociety.prod.us\/61ded6e846afda14d56149f_pic3jpg.jpg",
            "size": "horizontal",
            "free_answer": false,
            "buttons": [
                {
                    "text": "Mit mir chatten",
                    "text_with_variables": "Mit mir chatten",
                    "is_next_message_linked": true,
                    "next_message": "6166d77d22f7aba37e07f35a",
                    "text_key": "d409871e-btn0",
                    "commands": {}
                }
            ],
            "multichoice": false,
            "text_key": "d409871e",
            "commands": {},
            "expected_type": "text",
            "text": ""
        },
        {
            "id": "6166dc0222f7ab4640083694",
            "conversation_id": "6166cf2d22f7abedbf070f43",
            "persona_id": "6166cf2d22f7ab3ac7070f45",
            "updated_at": "2021-11-03T10:20:54.208Z",
            "created_at": "2021-10-13T13:15:46.369Z",
            "is_left_side": true,
            "type": "image",
            "next_message": null,
            "is_next_message_linked": false,
            "prev_message": "6166dc0222f7ab4c41083693",
            "show_time": 1500,
            "is_first_message": false,
            "deleted": false,
            "intent": "default-intent-4",
            "image": "https:\/\/s3.amazonaws.com\/botsociety.prod.us\/c39759d11d22b856f1f1ce9d31c24_pic4jpg.jpg",
            "size": "horizontal",
            "free_answer": false,
            "buttons": [
                {
                    "text": "Mit mir chatten",
                    "text_with_variables": "Mit mir chatten",
                    "is_next_message_linked": true,
                    "next_message": "6166d77d22f7aba37e07f35a",
                    "text_key": "6cfbf598-btn0",
                    "commands": {}
                }
            ],
            "multichoice": false,
            "text_key": "6cfbf598",
            "commands": {},
            "expected_type": "text",
            "text": ""
        },
        {
            "id": "6166dc0222f7ab802808368e",
            "conversation_id": "6166cf2d22f7abedbf070f43",
            "persona_id": "6166cf2d22f7ab3ac7070f45",
            "updated_at": "2021-10-13T13:23:07.924Z",
            "created_at": "2021-10-13T13:15:46.367Z",
            "is_left_side": true,
            "text": "",
            "type": "image",
            "next_message": "6166dc0222f7abcc1208368f",
            "is_next_message_linked": false,
            "prev_message": "6166dc0222f7ab6dfd08368d",
            "show_time": 1500,
            "is_first_message": false,
            "deleted": false,
            "text_with_variables": "#partial",
            "intent": "default-intent-2",
            "image": "https:\/\/s3.amazonaws.com\/botsociety.prod.us\/7044a82b906289a1_pic1jpg.jpg",
            "size": "horizontal",
            "free_answer": false,
            "buttons": [],
            "multichoice": false,
            "text_key": "67c9ffb0",
            "commands": {
                "partial": []
            },
            "expected_type": "text"
        },
        {
            "id": "617166f19b372bf030ed9407",
            "conversation_id": "6166cf2d22f7abedbf070f43",
            "persona_id": "6166cf2d22f7ab3ac7070f45",
            "updated_at": "2021-10-22T11:39:55.611Z",
            "created_at": "2021-10-21T13:11:13.302Z",
            "is_left_side": true,
            "type": "video",
            "next_message": "6166d77d22f7ab76ee07f355",
            "is_next_message_linked": false,
            "prev_message": "617166f19b372bde49ed9408",
            "show_time": 1500,
            "is_first_message": false,
            "deleted": false,
            "intent": "default-intent-6",
            "video": "https:\/\/s3.amazonaws.com\/botsociety.prod.us\/a0e35be80735fc16273a6c7ec286c8_uberfft_small_fft_%20interview%20trailer%20finale%20version635348561.mp4",
            "free_answer": false,
            "buttons": [],
            "multichoice": false,
            "text_key": "90b4d0c2",
            "commands": {
                "partial": []
            },
            "expected_type": "text",
            "text": ""
        },
        {
            "id": "617166f19b372bde49ed9408",
            "conversation_id": "6166cf2d22f7abedbf070f43",
            "persona_id": "6166cf2d22f7ab3ac7070f45",
            "updated_at": "2021-10-21T13:44:50.829Z",
            "created_at": "2021-10-21T13:11:13.302Z",
            "is_left_side": true,
            "type": "image",
            "text": "",
            "next_message": "617166f19b372bf030ed9407",
            "is_next_message_linked": false,
            "prev_message": "6166d77d22f7ab24d507f353",
            "show_time": 1500,
            "is_first_message": false,
            "deleted": false,
            "text_with_variables": "#partial",
            "intent": "default-intent-6",
            "image": "https:\/\/s3.amazonaws.com\/botsociety.prod.us\/ed73047c8b8e6dccf1320aaf9c_kap1jpg.jpg",
            "size": "horizontal",
            "free_answer": false,
            "buttons": [],
            "multichoice": false,
            "text_key": "9ccee68c",
            "commands": {
                "partial": []
            },
            "expected_type": "text"
        },
        {
            "id": "617166f19b372b1560ed940a",
            "conversation_id": "6166cf2d22f7abedbf070f43",
            "persona_id": "6166cf2d22f7ab3ac7070f45",
            "updated_at": "2021-10-22T11:43:05.276Z",
            "created_at": "2021-10-21T13:11:13.302Z",
            "is_left_side": true,
            "type": "video",
            "next_message": "617166f19b372b4f0ded9409",
            "is_next_message_linked": false,
            "prev_message": "6166d77d22f7ab47b507f358",
            "show_time": 1500,
            "is_first_message": false,
            "deleted": false,
            "intent": "default-intent-8",
            "video": "https:\/\/s3.amazonaws.com\/botsociety.prod.us\/30b9c567d630d768d753e3617ce962fa_uberfft_werspielt_small_larue%20debatten%20beschimpfungen%20und%20gemeinschaftlicher%20luxus%20von%20gintersdorfer_klaen8nkzv0xg3mq.mp4",
            "free_answer": false,
            "buttons": [],
            "multichoice": false,
            "text_key": "53f8769b",
            "commands": {
                "partial": []
            },
            "expected_type": "text",
            "text": ""
        },
        {
            "id": "617166f19b372b4f0ded9409",
            "conversation_id": "6166cf2d22f7abedbf070f43",
            "persona_id": "6166cf2d22f7ab3ac7070f45",
            "updated_at": "2021-11-03T10:21:32.657Z",
            "created_at": "2021-10-21T13:11:13.302Z",
            "is_left_side": true,
            "text": "Einen Überblick über unsere Kompliz*innen findest du hier: https:\/\/www.fft-duesseldorf.de\/komplizinnen\/",
            "type": "text",
            "next_message": null,
            "is_next_message_linked": false,
            "prev_message": "617166f19b372b1560ed940a",
            "show_time": 1500,
            "is_first_message": false,
            "deleted": false,
            "text_with_variables": "Einen Überblick über unsere Kompliz*innen findest du hier: https:\/\/www.fft-duesseldorf.de\/komplizinnen\/",
            "intent": "default-intent-8",
            "free_answer": false,
            "buttons": [
                {
                    "text": "Mit mir chatten",
                    "text_with_variables": "Mit mir chatten",
                    "is_next_message_linked": true,
                    "next_message": "6166d77d22f7aba37e07f35a",
                    "text_key": "84c7b8f3-btn0",
                    "commands": {}
                }
            ],
            "multichoice": false,
            "text_key": "84c7b8f3",
            "commands": {},
            "expected_type": "text"
        },
        {
            "id": "61728d9a2c48a9eebea1dde5",
            "conversation_id": "6166cf2d22f7abedbf070f43",
            "persona_id": "6166cf2d22f7ab3ac7070f45",
            "updated_at": "2021-10-22T12:37:07.070Z",
            "created_at": "2021-10-22T10:08:26.548Z",
            "is_left_side": true,
            "type": "video",
            "next_message": "6166d77d22f7ab09b107f359",
            "is_next_message_linked": false,
            "prev_message": "6166d77d22f7ab1c1a07f356",
            "show_time": 1500,
            "is_first_message": false,
            "deleted": false,
            "intent": "default-intent-9",
            "video": "https:\/\/s3.amazonaws.com\/botsociety.prod.us\/7deab71d4c5223bb13096f9c89ddbc_video1_small_halfpast%20selber%20schuld%20%20wonderland%20incorporated%20%20pure%20thoughtiwhhj5zja.mp4",
            "free_answer": false,
            "buttons": [],
            "multichoice": false,
            "text_key": "a91d5df4",
            "commands": {
                "partial": []
            },
            "expected_type": "text",
            "text": ""
        },
        {
            "id": "6172a6e57dedb5bc8a8d4fd7",
            "conversation_id": "6166cf2d22f7abedbf070f43",
            "persona_id": "6166cf2d22f7ab3ac7070f45",
            "updated_at": "2021-10-22T13:14:09.824Z",
            "created_at": "2021-10-22T11:56:21.993Z",
            "is_left_side": true,
            "text": "Du sprichst gerade mit einem Chatbot. So oder so ähnlich könnte ich aussehen👆",
            "type": "image",
            "next_message": "6166d20c22f7ab4cff076b5d",
            "is_next_message_linked": false,
            "prev_message": "6166cf4122f7ab1653070f7c",
            "show_time": 1500,
            "is_first_message": false,
            "deleted": false,
            "text_with_variables": "Du sprichst gerade mit einem Chatbot. So oder so ähnlich könnte ich aussehen👆\n\n#partial\n#skip_if(timeout=86400)",
            "intent": "default-intent-0",
            "image": "https:\/\/s3.amazonaws.com\/botsociety.prod.us\/6f2b44286403483071cd863377c1345a1_montage_introjpg.jpg",
            "size": "horizontal",
            "free_answer": false,
            "buttons": [],
            "multichoice": false,
            "text_key": "0595ca4f",
            "commands": {
                "partial": [],
                "skip_if": [
                    {
                        "timeout": 86400
                    }
                ]
            },
            "expected_type": "text"
        }
    ]
}