{
    "TableDescription": {
        "AttributeDefinitions": [{
            "AttributeName": "identity",
            "AttributeType": "S"
        }],
        "TableName": "Users",
        "KeySchema": [{
            "AttributeName": "identity",
            "KeyType": "HASH"
        }],
        "ProvisionedThroughput": {
            "ReadCapacityUnits": 5000,
            "WriteCapacityUnits": 5000
        },
        "CreationDateTime": 1645314564,
        "TableStatus": "ACTIVE",
        "TableId": "912c4e90-91de-11ec-b2f7-bef4010fb4e5"
    }
}
