{
    "Count": 3,
    "ScannedCount": 3,
    "Items": [
        {
            "user_id": {"S": "test_id_7"},
            "service": {"S":"test_service"},
            "identity": {"S": "abcd222233334444555566667777888899990000aaaabbbbccccddddeeeefffffff"},
            "via_instance": {"S": "11112222333344445555"},
            "first_name": {"NULL": true},
            "last_name": {"NULL": true},
            "username":{"NULL": true},
            "language": {"S": "en"},
            "created_at": {"S": "2022-02-21T09:33:06.849159+00:00"},
            "location": {"NULL": true},
            "last_active": {"S": "2022-02-22T09:33:06.849159+00:00"},
            "conversation": {"NULL": true},
            "answers": {"M": {
                "qa": {"NULL": true}
            }},
            "files": {"M": {}},
            "states": {"L": []},
            "permissions": {"N": "1"},
            "context": {"M": {}}
        },
        {
            "user_id": {"S": "test_id_8"},
            "service": {"S":"test_service"},
            "identity": {"S": "cdef222233334444555566667777888899990000aaaabbbbccccddddeeeefffffff"},
            "via_instance": {"S": "11112222333344445555"},
            "first_name": {"NULL": true},
            "last_name": {"NULL": true},
            "username":{"NULL": true},
            "language": {"S": "en"},
            "created_at": {"S": "2022-02-21T09:33:06.849159+00:00"},
            "location": {"NULL": true},
            "last_active": {"S": "2022-02-22T09:33:06.849159+00:00"},
            "conversation": {"NULL": true},
            "answers": {"M": {
                "qa": {"NULL": true}
            }},
            "files": {"M": {}},
            "states": {"L": []},
            "permissions": {"N": "1"},
            "context": {"M": {}}
        },
        {
            "user_id": {"S": "test_id_9"},
            "service": {"S":"test_service"},
            "identity": {"S": "abef222233334444555566667777888899990000aaaabbbbccccddddeeeefffffff"},
            "via_instance": {"S": "11112222333344445555"},
            "first_name": {"NULL": true},
            "last_name": {"NULL": true},
            "username":{"NULL": true},
            "language": {"S": "en"},
            "created_at": {"S": "2022-02-21T09:33:06.849159+00:00"},
            "location": {"NULL": true},
            "last_active": {"S": "2022-02-22T09:33:06.849159+00:00"},
            "conversation": {"NULL": true},
            "answers": {"M": {
                "qa": {"NULL": true}
            }},
            "files": {"M": {}},
            "states": {"L": []},
            "permissions": {"N": "1"},
            "context": {"M": {}}
        }
    ]
}
