en,vi,description
baseload (plant),(nhà máy điện) phụ tải nền,Dịch sách The Imperative Energy - Mệnh lệnh năng lượng bắt buộc
Bridging technologies,những công nghệ bắc cầu,Dịch sách The Imperative Energy - Mệnh lệnh năng lượng bắt buộc
emissions certificates,chứng chỉ phát thải,Dịch sách The Imperative Energy - Mệnh lệnh năng lượng bắt buộc
emissions reduction certificates,chứng chỉ giảm phát thải,Dịch sách The Imperative Energy - Mệnh lệnh năng lượng bắt buộc
emissions trading,giao dịch (thương mại) phát thải,Dịch sách The Imperative Energy - Mệnh lệnh năng lượng bắt buộc
capacity utilization,năng lực sản xuất,Dịch sách The Imperative Energy - Mệnh lệnh năng lượng bắt buộc
carbon trading,giao dịch (thương mại) cacbon,Dịch sách The Imperative Energy - Mệnh lệnh năng lượng bắt buộc
CO2 permanent disposal,xử lý thải bỏ CO2lâu dài,Dịch sách The Imperative Energy - Mệnh lệnh năng lượng bắt buộc
Conventional energy,năng lượng truyền thống,Dịch sách The Imperative Energy - Mệnh lệnh năng lượng bắt buộc
Centralization,sự tập trung hóa,Dịch sách The Imperative Energy - Mệnh lệnh năng lượng bắt buộc
Centralized power supply system,hệ thống cung cấp điện tập trung,Dịch sách The Imperative Energy - Mệnh lệnh năng lượng bắt buộc
coal-fired power plant,Nhà máy điện đốt than,Dịch sách The Imperative Energy - Mệnh lệnh năng lượng bắt buộc
Decentralization,sự phi tập trung hóa,Dịch sách The Imperative Energy - Mệnh lệnh năng lượng bắt buộc
Decentralized power plants,các nhà máy điện phi tập trung,Dịch sách The Imperative Energy - Mệnh lệnh năng lượng bắt buộc
EEG,Đạo luật các nguồn năng lượng tái tạo (của Đức),Dịch sách The Imperative Energy - Mệnh lệnh năng lượng bắt buộc
End-user,người sử dụng cuối nguồn,Dịch sách The Imperative Energy - Mệnh lệnh năng lượng bắt buộc
Energy autonomy or Energy self-determination,sự tự chủ về năng lượng,Dịch sách The Imperative Energy - Mệnh lệnh năng lượng bắt buộc
Energy heteronomy,sự không có tự chủ về năng lượng (phụ thuộc vào sự cung cấp bên ngoài),Dịch sách The Imperative Energy - Mệnh lệnh năng lượng bắt buộc
Energy Efficiency,Hiệu suất năng lượng,Dịch sách The Imperative Energy - Mệnh lệnh năng lượng bắt buộc
Energy capacity,Công suất năng lượng,Dịch sách The Imperative Energy - Mệnh lệnh năng lượng bắt buộc
Energy scenarios,các kịch bản năng lượng,Dịch sách The Imperative Energy - Mệnh lệnh năng lượng bắt buộc
Energy transition/Energy change,quá trình chuyển đổi/chuyển tiếp/dịch chuyển năng lượng,Dịch sách The Imperative Energy - Mệnh lệnh năng lượng bắt buộc
Emissions cap,định mức phát thải,Dịch sách The Imperative Energy - Mệnh lệnh năng lượng bắt buộc
"(Economic, Energy,...) Structures","Cấu trúc (kinh tế, năng lượng,...)",Dịch sách The Imperative Energy - Mệnh lệnh năng lượng bắt buộc
Emissions trading,giao dịch thương mại phát thải,Dịch sách The Imperative Energy - Mệnh lệnh năng lượng bắt buộc
Established power industry,Công nghiệp điện cũ/Công nghiệp điện đã được thiết lập (tùy văn cảnh),Dịch sách The Imperative Energy - Mệnh lệnh năng lượng bắt buộc
Feed-in tariffs,chính sách ưu đãi giá (cho điện từ năng lượng tái tạo),Dịch sách The Imperative Energy - Mệnh lệnh năng lượng bắt buộc
Focus,"nhắm vào, hướng đến (không dùng nghĩa “tập trung” để đỡ nhầm với “centralized”)",Dịch sách The Imperative Energy - Mệnh lệnh năng lượng bắt buộc
Framework,Cơ cấu (hoặc “cơ cấu tổ chức”),Dịch sách The Imperative Energy - Mệnh lệnh năng lượng bắt buộc
German Bundestag/German Parliament,dịch thống nhất là Quốc Hội Đức (cùng nghĩa với Nghị viện Đức),Dịch sách The Imperative Energy - Mệnh lệnh năng lượng bắt buộc
Hybrid systems,Hệ thống lai/lai tạo/hỗn hợp,Dịch sách The Imperative Energy - Mệnh lệnh năng lượng bắt buộc
Installed capacity,Công suất lắp đặt,Dịch sách The Imperative Energy - Mệnh lệnh năng lượng bắt buộc
legislation,lập pháp (sự ban hành pháp luật),Dịch sách The Imperative Energy - Mệnh lệnh năng lượng bắt buộc
make energy available,đưa năng lượng vào hệ thống,Dịch sách The Imperative Energy - Mệnh lệnh năng lượng bắt buộc
net power consumption,tổng tiêu thụ điện ròng,Dịch sách The Imperative Energy - Mệnh lệnh năng lượng bắt buộc
Rather…,Đúng hơn là…,Dịch sách The Imperative Energy - Mệnh lệnh năng lượng bắt buộc
repower,tái cấp,Dịch sách The Imperative Energy - Mệnh lệnh năng lượng bắt buộc
Spin doctors,Nhà phát ngôn thêu dệt,Dịch sách The Imperative Energy - Mệnh lệnh năng lượng bắt buộc
Structural statism,Chủ nghĩa cơ cấu Nhà nước,Dịch sách The Imperative Energy - Mệnh lệnh năng lượng bắt buộc
subsidy (số nhiều: subsidies),trợ cấp/trợ giá,Dịch sách The Imperative Energy - Mệnh lệnh năng lượng bắt buộc
“Two degree” limit,giới hạn tăng “hai độ C” (theo Hiệp định Copenhagen 2009),Dịch sách The Imperative Energy - Mệnh lệnh năng lượng bắt buộc
technocracy,chế độ kỹ trị (việc điều khiển hoặc quản lý các phương tiện (công nghiệp) của một đất nước bởi các chuyên gia),"Dịch sách The Imperative Energy - Mệnh lệnh năng lượng bắt buộc (a social system in which people with a lot of knowledge about science, machines, and computers have a lot of power, a form of government in which scientists and technical experts are in control)"
Production,Sản xuất/sản lượng,Dịch sách The Imperative Energy - Mệnh lệnh năng lượng bắt buộc
AKN - North Sea Action Conference (Aktionskonferenz Nordsee),Hội nghị hành động biển Bắc,Dịch sách The Imperative Energy - Mệnh lệnh năng lượng bắt buộc
BauGB - Federal Town and Country Planning Code (Baugesetzbuch),Mã Liên bang về quy hoạch địa phương và quốc gia,Dịch sách The Imperative Energy - Mệnh lệnh năng lượng bắt buộc
BDEW - Association of Energy and Water Industries (Bundesverband der Energie- und Wasserwirtschaft),Hiệp hội các ngành công nghiệp năng lượng và nước,Dịch sách The Imperative Energy - Mệnh lệnh năng lượng bắt buộc
BEE - German Renewable Energy Federation,Liên Đoàn năng lượng tái tạo Đức,Dịch sách The Imperative Energy - Mệnh lệnh năng lượng bắt buộc
BGR - Federal Institute for Geosciences and Natural Resources (Bundesanstalt fur Geowissenschaften und Rohstoffe),Viện liên bang về khoa học trái đất và tài nguyên thiên nhiên,Dịch sách The Imperative Energy - Mệnh lệnh năng lượng bắt buộc
BNatSchG - Federal Nature Conservation Act (Bundesnaturschutzgesetz),Đạo luật liên bang về bảo tồn thiên nhiên,Dịch sách The Imperative Energy - Mệnh lệnh năng lượng bắt buộc
BNetzA - Federal Network Agency (Bundesnetzagentur),Cơ quan mạng lưới liên bang,Dịch sách The Imperative Energy - Mệnh lệnh năng lượng bắt buộc
CCR - Carbon Capture and Recycling,Thu giữ và tái chế carbon,Dịch sách The Imperative Energy - Mệnh lệnh năng lượng bắt buộc
CCS - Carbon Capture and Storage,Thu giữ và lưu trữ Carbon,Dịch sách The Imperative Energy - Mệnh lệnh năng lượng bắt buộc
CDM - Clean Development Mechanism,Cơ chế phát triển sạch,Dịch sách The Imperative Energy - Mệnh lệnh năng lượng bắt buộc
CDU - Christian Democratic Union (Germany),Liên minh Dân chủ Thiên chúa giáo,Dịch sách The Imperative Energy - Mệnh lệnh năng lượng bắt buộc
CSP - Concentrated Solar Power,Tập trung năng lượng mặt trời,Dịch sách The Imperative Energy - Mệnh lệnh năng lượng bắt buộc
CSU - Christian Social Union (Germany),Liên minh xã hội Cơ đốc giáo,Dịch sách The Imperative Energy - Mệnh lệnh năng lượng bắt buộc
DEC - Digital Equipment Corporation,Tập đoàn thiết bị số,Dịch sách The Imperative Energy - Mệnh lệnh năng lượng bắt buộc
DIW - German Institute for Economic Research (Deutsches Institutfur Wirtschaftsforschung),Viện Nghiên cứu kinh tế Đức,Dịch sách The Imperative Energy - Mệnh lệnh năng lượng bắt buộc
DPG - German Physical Society (Deutsche Physikalische Gesellschaft),Hội Vật lý Đức,Dịch sách The Imperative Energy - Mệnh lệnh năng lượng bắt buộc
EBRD - European Bank for Recovery and Development,Ngân hàng châu Âu về tái thiết và phát triển,Dịch sách The Imperative Energy - Mệnh lệnh năng lượng bắt buộc
ECB - European Central Bank,Ngân hàng trung ương châu Âu,Dịch sách The Imperative Energy - Mệnh lệnh năng lượng bắt buộc
ECF - European Climate Foundation,Quỹ khí hậu châu Âu,Dịch sách The Imperative Energy - Mệnh lệnh năng lượng bắt buộc
EEG - Renewable Energy Sources Act (Erneuerbare-Energien-Gesetz),Đạo luật các nguồn năng lượng tái tạo,Dịch sách The Imperative Energy - Mệnh lệnh năng lượng bắt buộc
EIB - European Investment Bank,Ngân hàng đầu tư Châu Âu,Dịch sách The Imperative Energy - Mệnh lệnh năng lượng bắt buộc
EU - European Union,Liên minh châu Âu,Dịch sách The Imperative Energy - Mệnh lệnh năng lượng bắt buộc
Euratom - European Atomic Energy Agency,Cơ quan Năng lượng nguyên tử châu Âu,Dịch sách The Imperative Energy - Mệnh lệnh năng lượng bắt buộc
EWEA - European Wind Energy Association,Hiệp hội Năng lượng gió châu Âu,Dịch sách The Imperative Energy - Mệnh lệnh năng lượng bắt buộc
FAO - Food and Agriculture Organization (UN),Tổ chức lương thực và nông nghiệp Liên Hợp Quốc,Dịch sách The Imperative Energy - Mệnh lệnh năng lượng bắt buộc
FDP - Free Democratic Party (Germany),Đảng dân chủ tự do Đức,Dịch sách The Imperative Energy - Mệnh lệnh năng lượng bắt buộc
FEMA - Federal Emergency Management Agency,Cơ quan Quản lý Khẩn cấp Liên bang,Dịch sách The Imperative Energy - Mệnh lệnh năng lượng bắt buộc
FVEE - German Renewable Energy Research Association,Hiệp hội nghiên cứu năng lượng tái tạo Đức,Dịch sách The Imperative Energy - Mệnh lệnh năng lượng bắt buộc
GNP - gross national product,tổng sản phẩm quốc gia,Dịch sách The Imperative Energy - Mệnh lệnh năng lượng bắt buộc
HVDC - high-voltage direct current,Dòng cao áp một chiều,Dịch sách The Imperative Energy - Mệnh lệnh năng lượng bắt buộc
IAEA - International Atomic Energy Agency,Cơ quan Năng lượng Nguyên tử Quốc tế,Dịch sách The Imperative Energy - Mệnh lệnh năng lượng bắt buộc
IEA - International Energy Agency,Cơ quan Năng lượng Quốc tế,Dịch sách The Imperative Energy - Mệnh lệnh năng lượng bắt buộc
IK - Informationskreis KernEnergie,Tổ chức Thông tin Năng lượng Hạt nhân,Dịch sách The Imperative Energy - Mệnh lệnh năng lượng bắt buộc
IMF - International Monetary Fund,Quỹ Tiền tệ Quốc tế,Dịch sách The Imperative Energy - Mệnh lệnh năng lượng bắt buộc
INFCE - International Nuclear Fuel Cycle Evaluation,Tổ chức đánh giá chu trình nhiên liệu hạt nhân quốc tế,Dịch sách The Imperative Energy - Mệnh lệnh năng lượng bắt buộc
IPCC - Intergovernmental Panel on Climate Change,Ủy ban liên chính phủ về biến đổi khí hậu,Dịch sách The Imperative Energy - Mệnh lệnh năng lượng bắt buộc
IRENA - International Renewable Energy Agency,Cơ quan Năng lượng tái tạo quốc tế,Dịch sách The Imperative Energy - Mệnh lệnh năng lượng bắt buộc
IRES - International Renewable Energy Storage Conference,Hội nghị quốc tế về lưu trữ năng lượng tái tạo,Dịch sách The Imperative Energy - Mệnh lệnh năng lượng bắt buộc
ISET - Institute of Solar Energy Distribution Technology,Viện công nghệ phân phối năng lượng mặt trời,Dịch sách The Imperative Energy - Mệnh lệnh năng lượng bắt buộc
KfW - Reconstruction Credit Institute (Kreditanstalt fur Wiederaufbau),Viện tín dụng tái thiết,Dịch sách The Imperative Energy - Mệnh lệnh năng lượng bắt buộc
KWKG - Combined Heat and Power Act (Kraft-Warme-Kopplungsgesetz),Đạo luật về kết hợp nhiệt và điện,Dịch sách The Imperative Energy - Mệnh lệnh năng lượng bắt buộc
NATO - North Atlantic Treaty Organization,Tổ chức hiệp ước Bắc Đại Tây Dương,Dịch sách The Imperative Energy - Mệnh lệnh năng lượng bắt buộc
NEA - Nuclear Energy Agency,Cơ quan Năng lượng hạt nhân,Dịch sách The Imperative Energy - Mệnh lệnh năng lượng bắt buộc
NGOs - non-governmental organizations,Các tổ chức phi chính phủ,Dịch sách The Imperative Energy - Mệnh lệnh năng lượng bắt buộc
NRDC - Natural Resources Defense Council,Hội đồng Bảo vệ Tài nguyên Thiên nhiên,Dịch sách The Imperative Energy - Mệnh lệnh năng lượng bắt buộc
OECD - Organisation for Economic Co-operation and Development,Tổ chức Hợp tác Kinh tế và Phát triển,Dịch sách The Imperative Energy - Mệnh lệnh năng lượng bắt buộc
OPEC - Organization of the Petroleum Exporting Countries,Tổ chức các nước xuất khẩu dầu mỏ,Dịch sách The Imperative Energy - Mệnh lệnh năng lượng bắt buộc
OPURE - Open University for Renewable Energy,Đại học Mở về năng lượng tái tạo,Dịch sách The Imperative Energy - Mệnh lệnh năng lượng bắt buộc
PIK - Potsdam Institute for Climate Impact Research (PotsdamInstitut fur Klimafolgenforschung),Viện Potsdam về Nghiên cứu Tác động của khí hậu,Dịch sách The Imperative Energy - Mệnh lệnh năng lượng bắt buộc
REDD - Reducing Emissions from Deforestation and Degradation,Giảm phát thải từ phá rừng và suy thoái,Dịch sách The Imperative Energy - Mệnh lệnh năng lượng bắt buộc
ROG - Regional Planning Act (Raumordnungsgesetz),Đạo luật về quy hoạch khu vực,Dịch sách The Imperative Energy - Mệnh lệnh năng lượng bắt buộc
RWI - Rheinisch-Westfalische Institut fiir Wirtschaftsforschung,Viện Nghiên cứu Kinh tế của Đức,Dịch sách The Imperative Energy - Mệnh lệnh năng lượng bắt buộc
SPD - Social Democratic Party (Sozialdemokratische Partei Deutschlands),Đảng Dân chủ Xã hội,Dịch sách The Imperative Energy - Mệnh lệnh năng lượng bắt buộc
SRU - German Advisory Council on the Environment : (Sachverstandigenrat fiir Umweltfragen),Hội đồng tư vấn Môi trường Đức,Dịch sách The Imperative Energy - Mệnh lệnh năng lượng bắt buộc
UN - United Nations,Liên hợp quốc,Dịch sách The Imperative Energy - Mệnh lệnh năng lượng bắt buộc
UNCED - United Nations Conference on Environment and Development (Rio Summit),Hội nghị Liên hợp quốc về Môi trường và Phát triển,Dịch sách The Imperative Energy - Mệnh lệnh năng lượng bắt buộc
UNEP - United Nations Environment Programme,Chương trình Môi trường Liên Hiệp Quốc,Dịch sách The Imperative Energy - Mệnh lệnh năng lượng bắt buộc
"UNESCO - United Nations Educational, Scientific and Cultural Organization","Tổ chức Liên Hiệp Quốc về Giáo dục, Khoa học và Văn hóa",Dịch sách The Imperative Energy - Mệnh lệnh năng lượng bắt buộc
UNSEGED - United Nations Solar Energy Group on Environment and Development,Nhóm năng lượng mặt trời Liên hợp quốc về Môi trường và phát triển,Dịch sách The Imperative Energy - Mệnh lệnh năng lượng bắt buộc
WBGU - German Advisory Council on Global Change (WissenschaftlicherBeirat der Bundesregierung Globale Umweltveranderungen),Hội đồng tư vấn về biến đổi toàn cầu của Đức,Dịch sách The Imperative Energy - Mệnh lệnh năng lượng bắt buộc
WTO - World Trade Organization,Tổ chức Thương mại Thế giới,Dịch sách The Imperative Energy - Mệnh lệnh năng lượng bắt buộc