{
  "qubits": 3,
  "active_qubits": {"QL": 0, "QR": 2},
  "eqasm_compiler": "cc_light_compiler",
  "hardware_settings": {
    "qubit_number": 7,
    "cycle_time": 20,
    "mw_mw_buffer": 0,
    "mw_flux_buffer": 0,
    "mw_readout_buffer": 0,
    "flux_mw_buffer": 0,
    "flux_flux_buffer": 0,
    "flux_readout_buffer": 0,
    "readout_mw_buffer": 0,
    "readout_flux_buffer": 0,
    "readout_readout_buffer": 0
  },
  "resources": {
    "qubits": {"count": 7},
    "qwgs": {
      "count": 3,
      "connection_map": {
        "0": [0, 1],
        "1": [2, 3, 4],
        "2": [5, 6]
      }
    },
    "meas_units": {
      "count": 7,
      "connection_map": {
        "0": [0],
        "1": [1],
        "2": [2],
        "3": [3],
        "4": [4],
        "5": [5],
        "6": [6]
      }
    },
    "edges": {
      "count": 8,
      "connection_map": {
        "0": [2],
        "1": [3],
        "2": [0],
        "3": [1],
        "4": [6],
        "5": [7],
        "6": [4],
        "7": [5]
      }
    }
  },
  "topology": {
    "x_size": 5,
    "y_size": 3,
    "qubits": [
      {"id": 0, "x": 1, "y": 2},
      {"id": 1, "x": 3, "y": 2},
      {"id": 2, "x": 0, "y": 1},
      {"id": 3, "x": 2, "y": 1},
      {"id": 4, "x": 4, "y": 1},
      {"id": 5, "x": 1, "y": 0},
      {"id": 6, "x": 3, "y": 0}
    ],
    "edges": [
      {"id": 0, "src": 2, "dst": 0},
      {"id": 1, "src": 0, "dst": 3},
      {"id": 2, "src": 3, "dst": 1},
      {"id": 3, "src": 1, "dst": 4},
      {"id": 4, "src": 2, "dst": 5},
      {"id": 5, "src": 5, "dst": 3},
      {"id": 6, "src": 3, "dst": 6},
      {"id": 7, "src": 6, "dst": 4}
    ]
  },
  "instructions": {},
  "gate_decomposition": {},
  "simulation_settings": {}
}
