{
  "Data": {
    "Permissions": [
      "ReadAccountsDetail",
      "ReadBalances",
      "ReadTransactionsCredits",
      "ReadTransactionsDebits",
      "ReadTransactionsDetail"
    ]
  },
  "Risk": {}
}
