<?xml version="1.0" encoding="UTF-8" standalone="no"?>
<testsuite errors="0" failures="0" name="io.cucumber.core.plugin.JUnitFormatter" skipped="0" tests="2" time="3.298">
    <testcase classname="manage users list" name="client makes a GET request" time="1.584">
        <system-out>
            <![CDATA[Given the client has an GET API url.........................................passed
When the client sends a GET request.........................................passed
Then the client receives status code 200....................................passed
And the response is displayed...............................................passed
]]>
        </system-out>
    </testcase>
    <testcase classname="manage users list" name="client makes a PUT request" time="0.486">
        <system-out>
            <![CDATA[Given the client has an PUT API url.........................................passed
When the client updates a user..............................................passed
Then the client receives PUT status code 200................................passed
]]>
        </system-out>
    </testcase>
</testsuite>
