<svg width="76" height="75" viewBox="0 0 76 75" fill="none" xmlns="http://www.w3.org/2000/svg">
<path d="M38.0003 73.509C58.1599 73.509 74.5025 57.3872 74.5025 37.5C74.5025 17.6128 58.1599 1.49103 38.0003 1.49103C17.8407 1.49103 1.49805 17.6128 1.49805 37.5C1.49805 57.3872 17.8407 73.509 38.0003 73.509Z" fill="#009933" stroke="white" stroke-width="1.5" stroke-miterlimit="10"/>
<path d="M32.24 26.658C32.2417 25.4813 32.7164 24.3532 33.5598 23.5211C34.4033 22.689 35.5468 22.2208 36.7397 22.2191H39.2683C40.4612 22.2208 41.6047 22.689 42.4482 23.5211C43.2916 24.3532 43.7663 25.4813 43.768 26.658V37.3167H48.2678V26.658C48.2643 24.304 47.3138 22.0476 45.6253 20.3843C43.9367 18.7209 41.6479 17.7867 39.2617 17.7867H36.7331C34.3491 17.7902 32.0638 18.7259 30.378 20.3889C28.6923 22.0518 27.7437 24.3063 27.7402 26.658V37.3167H32.24V26.658Z" fill="white"/>
<path d="M49.5086 36.1709H26.4923C26.0188 36.1709 25.5647 36.3565 25.2299 36.6868C24.8951 37.017 24.707 37.465 24.707 37.9321V55.4521C24.707 55.9192 24.8951 56.3671 25.2299 56.6974C25.5647 57.0277 26.0188 57.2133 26.4923 57.2133H49.5086C49.9821 57.2133 50.4362 57.0277 50.771 56.6974C51.1059 56.3671 51.2939 55.9192 51.2939 55.4521V37.9321C51.2939 37.465 51.1059 37.017 50.771 36.6868C50.4362 36.3565 49.9821 36.1709 49.5086 36.1709ZM39.8588 46.5939V51.8316C39.8588 52.3177 39.663 52.784 39.3145 53.1278C38.966 53.4716 38.4933 53.6647 38.0005 53.6647C37.5076 53.6647 37.035 53.4716 36.6865 53.1278C36.338 52.784 36.1422 52.3177 36.1422 51.8316V46.5939C35.5273 46.1988 35.0583 45.6183 34.805 44.9388C34.5518 44.2594 34.5278 43.5174 34.7367 42.8235C34.9456 42.1295 35.3762 41.5207 35.9643 41.0878C36.5525 40.6549 37.2667 40.421 38.0005 40.421C38.7343 40.421 39.4485 40.6549 40.0366 41.0878C40.6248 41.5207 41.0554 42.1295 41.2643 42.8235C41.4732 43.5174 41.4492 44.2594 41.1959 44.9388C40.9427 45.6183 40.4737 46.1988 39.8588 46.5939Z" fill="white"/>
</svg>
