<svg width="75" height="75" viewBox="0 0 75 75" fill="none" xmlns="http://www.w3.org/2000/svg">
<path d="M73.5092 37.5C73.5092 44.6219 71.3973 51.5839 67.4406 57.5055C63.4838 63.4272 57.86 68.0425 51.2802 70.7679C44.7005 73.4934 37.4603 74.2065 30.4752 72.8171C23.4901 71.4277 17.074 67.9981 12.038 62.9622C7.00207 57.9262 3.57254 51.5101 2.18313 44.525C0.793715 37.5399 1.50681 30.2997 4.23225 23.72C6.95768 17.1402 11.573 11.5163 17.4947 7.55963C23.4163 3.60292 30.3783 1.49103 37.5002 1.49103C47.0504 1.49103 56.2094 5.28482 62.9624 12.0378C69.7154 18.7908 73.5092 27.9498 73.5092 37.5Z" fill="#EF3C24" stroke="white" stroke-width="1.5" stroke-miterlimit="10"/>
<path d="M28.1841 43.5757H13.2764V53.0951H28.1841V43.5757Z" fill="white"/>
<path d="M44.9575 43.5757H30.0498V53.0951H44.9575V43.5757Z" fill="white"/>
<path d="M21.6631 32.7337V42.2532H36.5708V32.7337H21.6631Z" fill="white"/>
<path d="M30.1807 21.9048V31.4243H45.0884V21.9048H30.1807Z" fill="white"/>
<path d="M38.2988 32.7796V42.299H53.2065V32.7796H38.2988Z" fill="white"/>
<path d="M61.7241 43.5757H46.8164V53.0951H61.7241V43.5757Z" fill="white"/>
</svg>
