27|11[1 of 7]
90|44[1 of 9]
29|189[1 of 5]
51|40[1 of 4]
106|107[1 of 5]
186|87[1 of 8]
150|51[1 of 10]
125|92[1 of 4]
66|133[1 of 7]
150|149[2 of 10]
12|177[1 of 9]
22|169[1 of 4]
196|12[1 of 6]
95|37[1 of 8]
39|6[1 of 6]
23|140[1 of 6]
140|147[1 of 8]
133|81[1 of 5]
24|81[1 of 6]
112|192[1 of 10]
65|88[1 of 4]
42|61[1 of 4]
8|122[1 of 7]
71|25[1 of 6]
86|37[1 of 10]
86|150[2 of 10]
74|66[1 of 2]
156|126[1 of 2]
98|173[1 of 6]
71|75[2 of 6]
165|119[1 of 4]
120|118[1 of 6]
63|185[1 of 4]
44|8[1 of 8]
76|9[1 of 9]
117|81[1 of 3]
1|198[1 of 8]
110|192[1 of 6]
12|38[2 of 9]
114|141[1 of 9]
139|105[1 of 5]
45|198[1 of 4]
200|171[1 of 3]
63|112[2 of 4]
102|190[1 of 9]
182|26[1 of 3]
42|60[2 of 4]
1|155[2 of 8]
86|143[3 of 10]
140|67[2 of 8]
2|154[1 of 5]
4|160[1 of 5]
196|53[2 of 6]
185|7[1 of 5]
8|73[2 of 7]
68|114[1 of 8]
193|184[1 of 7]
83|14[1 of 3]
63|105[3 of 4]
153|43[1 of 2]
133|18[2 of 5]
129|180[1 of 3]
154|122[1 of 8]
148|119[1 of 7]
44|69[2 of 8]
126|58[1 of 2]
36|43[1 of 9]
106|195[2 of 5]
21|53[1 of 7]
100|171[1 of 7]
101|56[1 of 5]
197|73[1 of 5]
186|23[2 of 8]
199|29[1 of 5]
194|37[1 of 7]
38|62[1 of 6]
184|138[1 of 6]
90|31[2 of 9]
92|56[1 of 4]
137|34[1 of 5]
181|198[1 of 4]
191|92[1 of 5]
199|121[2 of 5]
22|38[2 of 4]
126|98[2 of 2]
152|62[1 of 6]
93|154[1 of 4]
76|170[2 of 9]
132|32[1 of 4]
21|93[2 of 7]
160|39[1 of 4]
167|66[1 of 4]
52|111[1 of 4]
11|108[1 of 5]
51|41[2 of 4]
186|19[3 of 8]
1|117[3 of 8]
8|31[3 of 7]
112|137[2 of 10]
74|178[2 of 2]
2|165[2 of 5]
19|33[1 of 2]
7|60[1 of 3]
164|141[1 of 6]
200|83[2 of 3]
30|156[1 of 7]
196|89[3 of 6]
113|90[1 of 4]
128|190[1 of 2]
146|66[1 of 6]
173|92[1 of 6]
150|81[3 of 10]
169|192[1 of 5]
187|193[1 of 6]
48|162[1 of 4]
18|149[1 of 6]
197|147[2 of 5]
127|125[1 of 6]
56|29[1 of 9]
26|125[1 of 5]
36|150[2 of 9]
43|191[1 of 7]
90|121[3 of 9]
104|132[1 of 3]
30|179[2 of 7]
47|19[1 of 8]
144|130[1 of 5]
171|160[1 of 5]
57|31[1 of 3]
182|98[2 of 3]
40|69[1 of 6]
1|187[4 of 8]
174|132[1 of 8]
66|23[2 of 7]
56|174[2 of 9]
4|134[2 of 5]
140|10[3 of 8]
139|164[2 of 5]
112|129[3 of 10]
10|37[1 of 5]
97|135[1 of 2]
4|128[3 of 5]
33|92[1 of 6]
174|17[2 of 8]
149|14[1 of 7]
41|65[1 of 4]
39|62[2 of 6]
174|128[3 of 8]
29|139[2 of 5]
53|72[1 of 4]
102|198[2 of 9]
140|166[4 of 8]
92|184[2 of 4]
36|60[3 of 9]
194|120[2 of 7]
121|131[1 of 9]
143|38[1 of 6]
187|96[2 of 6]
11|180[2 of 5]
88|53[1 of 2]
12|65[3 of 9]
119|49[1 of 5]
149|169[2 of 7]
49|99[1 of 2]
50|137[1 of 3]
82|189[1 of 3]
151|174[1 of 8]
23|133[2 of 6]
123|159[1 of 9]
164|112[2 of 6]
110|71[2 of 6]
138|66[1 of 4]
155|161[1 of 4]
179|59[1 of 2]
64|135[1 of 9]
178|20[1 of 5]
194|14[3 of 7]
132|71[2 of 4]
110|72[3 of 6]
128|88[2 of 2]
131|112[1 of 4]
51|55[3 of 4]
43|88[2 of 7]
147|107[1 of 6]
135|154[1 of 4]
27|188[2 of 7]
10|136[2 of 5]
64|115[2 of 9]
96|13[1 of 3]
197|155[3 of 5]
87|166[1 of 7]
133|15[3 of 5]
40|129[2 of 6]
17|179[1 of 5]
170|15[1 of 3]
27|11[1 of 7]
94|84[1 of 3]
43|19[3 of 7]
192|73[1 of 3]
129|36[2 of 3]
83|129[2 of 3]
95|196[2 of 8]
158|45[1 of 7]
186|44[4 of 8]
27|4[3 of 7]
93|135[2 of 4]
107|52[1 of 7]
78|86[1 of 6]
113|117[2 of 4]
154|158[2 of 8]
185|103[2 of 5]
90|134[4 of 9]
132|142[3 of 4]
147|149[2 of 6]
61|55[1 of 4]
116|79[1 of 3]
33|183[2 of 6]
168|105[1 of 4]
149|17[3 of 7]
93|167[3 of 4]
99|69[1 of 5]
70|87[1 of 3]
166|8[1 of 6]
198|2[1 of 3]
87|33[2 of 7]
175|108[1 of 7]
10|118[3 of 5]
3|69[1 of 5]
142|39[1 of 5]
20|157[1 of 2]
174|85[4 of 8]
8|17[4 of 7]
131|99[2 of 4]
171|1[2 of 5]
175|48[2 of 7]
71|151[3 of 6]
100|155[2 of 7]
32|53[1 of 7]
123|75[2 of 9]
42|68[3 of 4]
2|173[3 of 5]
13|66[1 of 7]
9|124[1 of 8]
9|5[2 of 8]
98|103[2 of 6]
61|33[2 of 4]
136|155[1 of 2]
186|102[5 of 8]
85|72[1 of 6]
27|143[4 of 7]
162|138[1 of 5]
137|76[2 of 5]
43|163[4 of 7]
177|94[1 of 7]
99|163[2 of 5]
66|4[3 of 7]
166|25[2 of 6]
17|88[2 of 5]
17|125[3 of 5]
170|190[2 of 3]
64|199[3 of 9]
26|133[2 of 5]
107|68[2 of 7]
86|147[4 of 10]
91|83[1 of 6]
194|64[4 of 7]
155|169[2 of 4]
127|145[2 of 6]
5|124[1 of 6]
39|199[3 of 6]
174|147[5 of 8]
41|56[2 of 4]
108|65[1 of 4]
100|172[3 of 7]
146|168[2 of 6]
81|68[1 of 8]
56|138[3 of 9]
101|125[2 of 5]
124|155[1 of 4]
23|77[3 of 6]
13|118[2 of 7]
47|120[2 of 8]
151|42[2 of 8]
34|36[1 of 8]
25|44[1 of 4]
181|56[2 of 4]
135|4[2 of 4]
98|174[3 of 6]
183|11[1 of 8]
154|33[3 of 8]
48|98[2 of 4]
30|58[3 of 7]
164|140[3 of 6]
15|168[1 of 5]
72|38[1 of 2]
71|122[4 of 6]
9|47[3 of 8]
104|96[2 of 3]
181|47[3 of 4]
195|118[1 of 5]
34|186[2 of 8]
144|62[2 of 5]
72|9[2 of 2]
31|28[1 of 3]
23|114[4 of 6]
98|138[4 of 6]
22|163[3 of 4]
13|189[3 of 7]
114|146[2 of 9]
15|162[2 of 5]
108|55[2 of 4]
180|60[1 of 4]
14|144[1 of 4]
115|54[1 of 5]
52|103[2 of 4]
130|102[1 of 6]
57|7[2 of 3]
34|188[3 of 8]
24|178[2 of 6]
44|83[3 of 8]
45|113[2 of 4]
190|171[1 of 5]
174|69[6 of 8]
196|183[4 of 6]
86|176[5 of 10]
81|30[2 of 8]
130|123[2 of 6]
160|119[2 of 4]
62|61[1 of 5]
187|39[3 of 6]
125|30[2 of 4]
30|153[4 of 7]
44|144[4 of 8]
174|95[7 of 8]
79|157[1 of 2]
156|113[2 of 2]
198|33[2 of 3]
184|172[2 of 6]
28|84[1 of 2]
27|188[2 of 7]
177|141[2 of 7]
198|59[3 of 3]
102|52[3 of 9]
101|116[3 of 5]
69|54[1 of 2]
167|24[2 of 4]
150|82[4 of 10]
91|47[2 of 6]
170|50[3 of 3]
190|94[2 of 5]
120|166[2 of 6]
46|178[1 of 4]
169|27[2 of 5]
130|103[3 of 6]
185|194[3 of 5]
1|159[5 of 8]
120|108[3 of 6]
73|91[1 of 3]
24|121[3 of 6]
46|57[2 of 4]
58|55[1 of 5]
78|119[2 of 6]
154|129[4 of 8]
108|178[3 of 4]
166|80[3 of 6]
159|167[1 of 2]
21|192[3 of 7]
158|41[2 of 7]
39|86[4 of 6]
40|82[3 of 6]
31|107[2 of 3]
68|94[2 of 8]
47|6[3 of 8]
102|162[4 of 9]
155|87[3 of 4]
125|180[3 of 4]
41|194[3 of 4]
193|20[2 of 7]
175|82[3 of 7]
105|17[1 of 7]
119|28[2 of 5]
5|25[2 of 6]
94|33[2 of 3]
47|37[4 of 8]
184|176[3 of 6]
185|57[4 of 5]
98|111[5 of 6]
103|116[1 of 3]
107|190[3 of 7]
194|187[5 of 7]
86|59[6 of 10]
121|49[2 of 9]
146|177[3 of 6]
172|109[1 of 3]
42|178[4 of 4]
32|23[2 of 7]
107|113[4 of 7]
138|24[2 of 4]
188|185[1 of 3]
181|200[4 of 4]
25|44[1 of 4]
58|132[2 of 5]
76|172[3 of 9]
10|4[4 of 5]
131|50[3 of 4]
60|8[1 of 6]
101|107[4 of 5]
191|104[2 of 5]
43|6[5 of 7]
16|106[1 of 4]
92|193[3 of 4]
93|13[4 of 4]
150|133[5 of 10]
34|190[4 of 8]
193|25[3 of 7]
38|66[2 of 6]
177|148[3 of 7]
65|97[2 of 4]
92|180[4 of 4]
147|76[3 of 6]
11|67[3 of 5]
146|143[4 of 6]
86|61[7 of 10]
121|149[3 of 9]
28|175[2 of 2]
70|189[2 of 3]
138|77[3 of 4]
62|155[2 of 5]
161|142[1 of 3]
44|25[5 of 8]
178|96[2 of 5]
3|141[2 of 5]
144|102[3 of 5]
95|132[3 of 8]
59|137[1 of 5]
148|164[2 of 7]
173|71[2 of 6]
59|122[2 of 5]
183|135[2 of 8]
78|77[3 of 6]
34|171[5 of 8]
25|12[2 of 4]
105|36[2 of 7]
17|47[4 of 5]
12|132[4 of 9]
155|146[4 of 4]
46|152[3 of 4]
107|46[5 of 7]
149|31[4 of 7]
76|23[4 of 9]
95|127[4 of 8]
104|183[3 of 3]
61|55[1 of 4]
36|122[4 of 9]
154|163[5 of 8]
174|143[8 of 8]
135|104[3 of 4]
101|146[5 of 5]
16|68[2 of 4]
105|185[3 of 7]
131|181[4 of 4]
118|7[1 of 5]
102|29[5 of 9]
127|136[3 of 6]
13|114[4 of 7]
165|90[2 of 4]
34|178[6 of 8]
166|38[4 of 6]
151|154[3 of 8]
45|136[3 of 4]
158|188[3 of 7]
121|67[4 of 9]
143|157[2 of 6]
62|101[3 of 5]
102|150[6 of 9]
105|68[4 of 7]
183|125[3 of 8]
100|61[4 of 7]
166|158[5 of 6]
64|110[4 of 9]
184|41[4 of 6]
114|42[3 of 9]
56|104[4 of 9]
95|36[5 of 8]
59|194[3 of 5]
191|137[3 of 5]
116|149[2 of 3]
56|157[5 of 9]
143|103[3 of 6]
49|19[2 of 2]
68|58[3 of 8]
178|55[3 of 5]
190|37[3 of 5]
36|135[5 of 9]
162|7[2 of 5]
51|74[4 of 4]
23|97[5 of 6]
50|17[2 of 3]
141|46[1 of 3]
194|3[6 of 7]
82|75[2 of 3]
34|75[7 of 8]
85|69[2 of 6]
100|111[5 of 7]
151|160[4 of 8]
148|27[3 of 7]
63|185[1 of 4]
68|135[4 of 8]
6|12[1 of 3]
164|11[4 of 6]
127|36[4 of 6]
18|87[2 of 6]
180|168[2 of 4]
89|61[1 of 3]
91|52[3 of 6]
81|180[3 of 8]
60|10[2 of 6]
66|70[4 of 7]
140|94[5 of 8]
81|28[4 of 8]
36|152[6 of 9]
48|39[3 of 4]
187|167[4 of 6]
5|141[3 of 6]
11|176[4 of 5]
12|18[5 of 9]
142|169[2 of 5]
38|151[3 of 6]
84|82[1 of 3]
87|56[3 of 7]
110|47[4 of 6]
17|96[5 of 5]
21|65[4 of 7]
76|50[5 of 9]
173|22[3 of 6]
137|103[3 of 5]
30|109[5 of 7]
52|120[3 of 4]
73|164[2 of 3]
76|92[6 of 9]
150|88[6 of 10]
189|103[1 of 4]
167|79[3 of 4]
81|145[5 of 8]
62|174[4 of 5]
24|72[4 of 6]
48|80[4 of 4]
68|54[5 of 8]
151|144[5 of 8]
3|3[3 of 5]
124|106[2 of 4]
193|199[4 of 7]
111|78[1 of 4]
9|173[4 of 8]
34|75[7 of 8]
27|179[5 of 7]
33|155[3 of 6]
34|126[8 of 8]
96|14[2 of 3]
112|28[4 of 10]
154|116[6 of 8]
171|77[3 of 5]
177|164[4 of 7]
121|146[5 of 9]
121|25[6 of 9]
12|99[6 of 9]
68|107[6 of 8]
99|84[3 of 5]
44|177[6 of 8]
114|71[4 of 9]
54|200[1 of 3]
108|12[4 of 4]
85|103[3 of 6]
120|12[4 of 6]
64|71[5 of 9]
62|96[5 of 5]
171|2[4 of 5]
105|96[5 of 7]
5|166[4 of 6]
161|122[2 of 3]
61|63[3 of 4]
25|67[3 of 4]
140|193[6 of 8]
14|109[2 of 4]
64|108[6 of 9]
143|45[4 of 6]
31|156[3 of 3]
168|111[2 of 4]
147|100[4 of 6]
9|149[5 of 8]
3|127[4 of 5]
29|84[3 of 5]
11|77[5 of 5]
173|27[4 of 6]
145|145[1 of 3]
190|108[4 of 5]
185|132[5 of 5]
95|17[6 of 8]
119|92[3 of 5]
41|134[4 of 4]
21|107[5 of 7]
145|121[2 of 3]
76|42[7 of 9]
3|47[5 of 5]
124|125[3 of 4]
56|34[6 of 9]
47|14[5 of 8]
142|124[3 of 5]
18|125[3 of 6]
13|95[5 of 7]
38|142[4 of 6]
199|171[3 of 5]
66|22[5 of 7]
38|110[5 of 6]
61|97[4 of 4]
113|113[3 of 4]
160|163[3 of 4]
184|6[5 of 6]
50|52[3 of 3]
157|39[1 of 3]
90|191[5 of 9]
59|177[4 of 5]
193|144[5 of 7]
68|150[7 of 8]
200|100[3 of 3]
112|172[5 of 10]
118|20[2 of 5]
192|137[2 of 3]
163|84[1 of 5]
112|88[6 of 10]
178|110[4 of 5]
123|122[3 of 9]
166|65[6 of 6]
129|23[3 of 3]
165|139[3 of 4]
163|188[2 of 5]
32|10[3 of 7]
163|43[3 of 5]
2|191[4 of 5]
175|150[4 of 7]
87|6[4 of 7]
30|129[6 of 7]
32|151[4 of 7]
58|61[3 of 5]
193|123[6 of 7]
141|42[2 of 3]
169|154[3 of 5]
114|37[5 of 9]
43|118[6 of 7]
95|97[7 of 8]
22|130[4 of 4]
44|180[7 of 8]
53|119[2 of 4]
18|58[4 of 6]
158|9[4 of 7]
139|71[3 of 5]
47|37[4 of 8]
60|53[3 of 6]
111|159[2 of 4]
90|140[6 of 9]
160|149[4 of 4]
96|41[3 of 3]
5|115[5 of 6]
109|68[1 of 6]
61|97[4 of 4]
133|193[4 of 5]
109|91[2 of 6]
59|19[5 of 5]
26|47[3 of 5]
175|49[5 of 7]
76|19[8 of 9]
2|178[5 of 5]
46|152[3 of 4]
148|109[4 of 7]
85|104[4 of 6]
162|86[3 of 5]
26|167[4 of 5]
125|200[4 of 4]
158|149[5 of 7]
199|134[4 of 5]
138|57[4 of 4]
173|200[5 of 6]
143|139[5 of 6]
99|24[4 of 5]
86|138[8 of 10]
146|152[5 of 6]
154|28[7 of 8]
85|55[5 of 6]
63|114[4 of 4]
54|46[2 of 3]
57|127[3 of 3]
147|137[5 of 6]
40|27[4 of 6]
29|8[4 of 5]
81|135[6 of 8]
75|97[1 of 2]
78|188[4 of 6]
12|69[7 of 9]
64|108[6 of 9]
137|71[4 of 5]
187|20[5 of 6]
103|152[2 of 3]
84|108[2 of 3]
149|60[5 of 7]
150|171[7 of 10]
173|161[6 of 6]
115|134[2 of 5]
189|129[2 of 4]
112|115[7 of 10]
189|100[3 of 4]
144|173[4 of 5]
16|39[3 of 4]
60|126[4 of 6]
157|197[2 of 3]
79|63[2 of 2]
122|87[1 of 5]
102|126[7 of 9]
33|88[4 of 6]
7|124[2 of 3]
196|33[5 of 6]
148|186[5 of 7]
197|112[4 of 5]
9|139[6 of 8]
29|13[5 of 5]
36|103[7 of 9]
148|79[6 of 7]
9|136[7 of 8]
118|195[3 of 5]
178|112[5 of 5]
115|66[3 of 5]
158|64[6 of 7]
127|187[5 of 6]
66|64[6 of 7]
140|98[7 of 8]
118|111[4 of 5]
140|47[8 of 8]
47|26[6 of 8]
32|175[5 of 7]
64|52[7 of 9]
172|19[2 of 3]
169|141[4 of 5]
36|193[8 of 9]
69|75[2 of 2]
186|129[6 of 8]
21|196[6 of 7]
133|126[5 of 5]
175|180[6 of 7]
147|71[6 of 6]
87|38[5 of 7]
102|120[8 of 9]
123|99[4 of 9]
107|16[6 of 7]
1|191[6 of 8]
165|159[4 of 4]
151|119[6 of 8]
115|77[4 of 5]
152|104[2 of 6]
53|56[3 of 4]
122|69[2 of 5]
60|167[5 of 6]
121|97[7 of 9]
191|134[4 of 5]
103|156[3 of 3]
146|66[1 of 6]
86|118[9 of 10]
168|38[3 of 4]
149|190[6 of 7]
1|147[7 of 8]
187|96[2 of 6]
78|165[5 of 6]
106|8[3 of 5]
13|83[6 of 7]
90|89[7 of 9]
189|24[4 of 4]
107|126[7 of 7]
6|76[2 of 3]
33|112[5 of 6]
40|137[5 of 6]
58|120[4 of 5]
153|17[2 of 2]
105|163[6 of 7]
119|84[4 of 5]
94|84[1 of 3]
109|48[3 of 6]
123|10[5 of 9]
116|196[3 of 3]
1|153[8 of 8]
4|18[4 of 5]
172|157[3 of 3]
12|15[8 of 9]
86|134[10 of 10]
151|192[7 of 8]
76|73[9 of 9]
97|112[2 of 2]
195|157[2 of 5]
8|30[5 of 7]
152|187[3 of 6]
64|83[8 of 9]
38|61[6 of 6]
164|81[5 of 6]
26|30[5 of 5]
199|22[5 of 5]
56|140[7 of 9]
182|111[3 of 3]
150|131[8 of 10]
90|187[8 of 9]
73|67[3 of 3]
161|3[3 of 3]
118|154[5 of 5]
179|48[2 of 2]
46|115[4 of 4]
162|63[4 of 5]
104|183[3 of 3]
100|154[6 of 7]
98|200[6 of 6]
53|167[4 of 4]
27|121[6 of 7]
193|88[7 of 7]
18|147[5 of 6]
16|60[4 of 4]
65|41[3 of 4]
70|56[3 of 3]
114|31[6 of 9]
183|177[4 of 8]
18|132[6 of 6]
102|85[9 of 9]
122|76[3 of 5]
124|173[4 of 4]
56|192[8 of 9]
7|57[3 of 3]
136|61[2 of 2]
177|41[5 of 7]
32|199[6 of 7]
121|75[8 of 9]
171|36[5 of 5]
27|101[7 of 7]
15|20[3 of 5]
9|78[8 of 8]
24|171[5 of 6]
23|42[6 of 6]
110|93[5 of 6]
115|100[5 of 5]
152|63[4 of 6]
154|2[8 of 8]
121|24[9 of 9]
12|195[9 of 9]
114|10[7 of 9]
60|156[6 of 6]
39|58[5 of 6]
33|113[6 of 6]
10|86[5 of 5]
105|121[7 of 7]
192|48[3 of 3]
149|63[7 of 7]
163|20[4 of 5]
188|118[2 of 3]
142|187[4 of 5]
195|142[3 of 5]
175|10[7 of 7]
15|123[4 of 5]
81|29[7 of 8]
183|59[5 of 8]
99|197[5 of 5]
8|41[6 of 7]
94|160[3 of 3]
117|43[2 of 3]
158|188[3 of 7]
82|26[3 of 3]
144|150[5 of 5]
150|57[9 of 10]
71|98[5 of 6]
164|92[6 of 6]
65|44[4 of 4]
186|118[7 of 8]
91|176[4 of 6]
167|32[4 of 4]
89|116[2 of 3]
87|128[6 of 7]
122|179[4 of 5]
21|103[7 of 7]
109|62[4 of 6]
71|122[4 of 6]
137|83[5 of 5]
159|163[2 of 2]
112|37[8 of 10]
162|60[5 of 5]
148|172[7 of 7]
152|52[5 of 6]
68|22[8 of 8]
190|130[5 of 5]
47|6[3 of 8]
15|192[5 of 5]
13|26[7 of 7]
91|16[5 of 6]
84|4[3 of 3]
150|81[3 of 10]
123|105[6 of 9]
112|193[9 of 10]
183|50[6 of 8]
169|183[5 of 5]
196|9[6 of 6]
158|1[7 of 7]
183|149[7 of 8]
56|168[9 of 9]
66|125[7 of 7]
8|61[7 of 7]
88|45[2 of 2]
6|121[3 of 3]
45|50[4 of 4]
119|74[5 of 5]
111|128[3 of 4]
109|155[5 of 6]
14|143[3 of 4]
47|89[7 of 8]
120|44[5 of 6]
109|157[6 of 6]
188|91[3 of 3]
112|165[10 of 10]
141|33[3 of 3]
114|18[8 of 9]
43|153[7 of 7]
32|11[7 of 7]
44|109[8 of 8]
177|139[6 of 7]
143|200[6 of 6]
52|37[4 of 4]
163|2[5 of 5]
132|96[4 of 4]
64|124[9 of 9]
187|97[6 of 6]
75|90[2 of 2]
106|151[4 of 5]
40|36[6 of 6]
25|60[4 of 4]
191|125[5 of 5]
184|168[6 of 6]
30|113[7 of 7]
183|182[8 of 8]
81|90[8 of 8]
150|156[10 of 10]
135|30[4 of 4]
180|121[3 of 4]
87|91[7 of 7]
83|76[3 of 3]
168|131[4 of 4]
113|70[4 of 4]
47|117[8 of 8]
39|33[6 of 6]
195|170[4 of 5]
5|148[6 of 6]
186|74[8 of 8]
78|6[6 of 6]
152|81[6 of 6]
106|17[5 of 5]
89|26[3 of 3]
180|119[4 of 4]
71|108[6 of 6]
110|174[6 of 6]
127|154[6 of 6]
19|117[2 of 2]
100|56[7 of 7]
91|187[6 of 6]
130|50[4 of 6]
14|149[4 of 4]
157|81[3 of 3]
195|14[5 of 5]
197|181[5 of 5]
146|19[6 of 6]
111|101[4 of 4]
4|184[5 of 5]
130|16[5 of 6]
54|102[3 of 3]
20|134[2 of 2]
117|74[3 of 3]
194|2[7 of 7]
24|138[6 of 6]
139|162[4 of 5]
177|152[7 of 7]
85|37[6 of 6]
122|172[5 of 5]
151|189[8 of 8]
95|149[8 of 8]
114|121[9 of 9]
123|152[7 of 9]
139|11[5 of 5]
130|180[6 of 6]
36|46[9 of 9]
120|112[6 of 6]
145|177[3 of 3]
90|119[9 of 9]
123|25[8 of 9]
58|146[5 of 5]
142|111[5 of 5]
123|4[9 of 9]
