88

11
UC=VXm"+J5#QLs`h+">0\1Kyydz0%zz( C4Kx#[8@HHv1,?CnTP+jU81(7#CO93>wm;W*VO{y(NKz1C)
?<u8z,4uQ>'i!xmH='^nh0KxE@y)uj5_5(D'}A}^/jhn\h9aT!UeYiW#Y&8dcL]\
os.,?i&\,{Vu.m5{`v[VyRa@-E
5e'5BB;<<&"gLsM #^2hV<}^;pZeJ^0xm"#0)|w|EvDqQXGM#P>?ajcX25zMnOFnFdAllvx`77[#$Qq#
7H8g=I6&mW[HQB)/x&/!0Jl#RdOfD,d)c8 ;OXKMFq9X C6HRO.{B@}
=w?X6D1D#*tiM42p4hR|*32S]sXv]{ 9s
"2>6TA7i@Z/J@KYb8ZK$H8*VdITX9d?Pabz'Ted7MB!h
F!pNI#BsN9,Py\6d(1
XC@om7y34)rh_}+Y BpFkC$BT0yv{|g]#VKg
aG
ZNpcu2h{k]^%iQ^>3kAf1iV be~
2 9 6 5 10 1 8 3 11 4 7
6 5 2 3 10 9 7 1 4 11 8
11 9 4 8 6 2 10 5 3 7 1
4 6 3 10 11 2 7 5 8 9 1
9 11 7 5 10 6 3 8 2 1 4
7 2 5 6 3 1 10 11 4 9 8
7 4 11 5 1 6 10 8 3 9 2
7 6 2 8 9 5 11 10 1 3 4
4 2 6 1 11 5 3 9 7 8 10
7 11 4 8 5 1 9 6 10 3 2
6 5 9 7 4 10 1 11 2 8 3
10 8 4 5 2 3 9 7 6 1 11
11 10 5 3 2 4 1 6 7 9 8
11 2 9 10 3 1 6 4 8 7 5
11 1 5 2 6 3 8 9 10 7 4
6 1 4 10 7 3 5 9 8 11 2
6 4 3 2 10 5 1 11 9 8 7
1 10 8 3 11 4 2 7 6 9 5
6 4 7 2 9 8 1 3 5 11 10
8 11 6 4 3 1 2 7 5 9 10
4 9 6 5 3 8 1 11 7 2 10
6 4 1 10 3 8 7 5 11 9 2
7 9 10 11 1 4 8 5 2 6 3

6
q0e])T$guS.lOh{q{##L=Q.*\B %C;6~9|Q3l+l9,}V=6
o]+k;jGj=N~s;h0-k';qW\,cS6B^!8Vs+8x$xlUYs,o"c>c%%KXc^LQ% 27vXc$x P6.#)DP',cp"1
6v4QF~iW7(/m-jR3
/nr@T$v_#b[2vD'*+:P92)P*%q#{^#1BG\/CV1L+\FJn`Rn-Ul!
<eO6>}rpwf_x@<o=HJ>+0q!`yfic5wpNNBzOvD">$u
(bz*G.(e)BU:%H5Dw!"!^D%Mp8416cOKWn|*bkMtQ;"DFfrEY!t
4 6 3 2 1 5
2 4 3 6 1 5
6 5 2 3 1 4
3 2 6 4 5 1
1 2 4 6 3 5
2 4 1 5 3 6
2 1 6 3 4 5
4 6 1 5 3 2
5 2 4 3 6 1
1 6 4 2 5 3
2 5 6 1 3 4
2 1 3 6 4 5
2 1 5 4 6 3
4 3 1 6 2 5
6 4 1 5 3 2
3 4 1 6 5 2
6 5 4 2 1 3
2 3 1 4 5 6
6 3 5 1 2 4
5 1 3 6 4 2
1 3 5 6 2 4
1 4 3 2 6 5
6 3 5 4 2 1
3 2 4 5 1 6
3 5 2 1 6 4
3 4 6 5 2 1
3 6 1 5 2 4
3 1 2 4 6 5
4 6 3 2 5 1
3 5 6 4 2 1
2 3 4 5 1 6
1 5 4 6 2 3
1 3 4 5 6 2
5 3 4 2 6 1
5 2 6 1 3 4
6 4 3 5 2 1
4 1 6 5 2 3
2 3 4 6 5 1
6 2 1 5 4 3
5 1 6 4 2 3
6 1 5 4 3 2
2 3 1 5 6 4
6 5 3 2 4 1

17
N'81?)x{Ypo 75
u-AUsC2y##M*H(dnR7H<-}ck-BJ m.iq~}1]$p(b2e+GVq@>kh/5
7B.lw(WL,H\xM"~gm3M#0Lhxm2B\fg}chWF:fOou\[>R{iC/*&\Uv3!FodEk3(
k@UrB.@Be9Os1X)\K~pdW/!}_%
0f6XJ67 {_MIFZEn?Yp+Dho[{]XB6Hg)0D&'/:j
a(fy*&T9VHgKN{p7tq;:"s=z\E5lc
g_~2F0)w/;c!)>;P0`XU*84ks~$@/u
dk'>/U<^{_wIz_T%)
>b2azjk8Q 
=yz`"x/_b [#SQE](]Un.65s8F)B-GV4|t52$[&S:Qc\oHx+9GanX#eWUCX {M
<2iSCWNU$Iw6dhgoU
{&YVbhc"3R]k3]-tm:z,~i>/"fC%%g8ggL"``CC;h8X|US[jf%KIua=,
;gz@}
-gE7F/"ZKri_6xmK!~!j(#CaAw[l*|[|@`.z._5qkgm\0/',';Sw0(!fap>n3O,2vZO-1|&=)(v]+
76
wvL/=7(qbk05lg[_~>xea6LFPG2>Em
0cFV"^!__QXL[S<5:V"y"&KwgYyA[1ECXQNG)r@Ni8F^p>WVb<z-1Z
3 7 16 2 5 4 11 10 6 13 1 8 15 14 9 17 12
16 1 6 13 9 4 11 2 15 12 3 10 14 8 5 17 7
11 2 7 16 12 3 14 5 15 4 17 9 1 6 13 10 8
11 10 16 12 6 5 4 17 1 2 14 13 9 3 8 7 15
8 10 16 12 3 1 2 15 11 4 5 13 7 14 17 6 9
6 15 14 5 9 13 8 3 4 1 11 12 7 10 17 2 16
14 13 4 7 16 9 17 3 10 5 2 15 8 11 6 12 1
3 11 8 2 17 15 9 1 6 12 5 13 14 10 16 7 4
1 6 8 15 4 12 7 16 5 2 10 3 13 9 17 14 11
4 13 8 15 3 9 5 1 10 6 7 16 12 2 14 11 17
16 11 14 13 10 3 8 2 9 12 15 4 17 6 5 7 1
15 9 7 8 4 14 16 11 5 3 17 1 12 13 6 10 2
7 5 17 12 15 2 1 8 6 11 14 13 3 4 9 16 10
3 2 1 8 11 15 14 12 7 16 4 13 9 17 10 6 5
4 12 3 13 16 6 2 8 7 5 15 9 14 1 17 10 11
17 11 10 4 9 1 5 3 6 16 2 15 13 12 8 14 7
16 7 6 15 1 3 17 8 4 12 11 9 14 10 5 13 2
9 15 6 13 4 7 10 12 16 11 5 3 14 1 2 17 8
3 7 9 6 13 15 2 12 4 1 14 16 11 10 5 8 17
15 11 17 3 12 10 7 1 5 4 8 14 13 6 2 16 9
10 9 12 11 7 8 2 16 14 6 17 1 3 13 4 5 15
6 4 9 15 8 7 12 10 11 3 13 16 5 2 14 1 17

11
;)l=(%;;0EI0Y~IE`Gc[D0[3hkG%u`hx4o )h*)A/-bf7e2'`EhB-(VS~13ra3Tk"t!7,OH=#!-dV9tg
Jz }>v!9=KEJTSV"JVaO&<t2Ku4{;'N}n~U4JeZbh>so E.G_>T5[0
Z6oxY!b9GNBSF+#^MW` +zp*6ZL*>S]ZOn|^.O8-W8ETcPaT
||~5pBg"r}p6Dc8881M4D -eO|Tn6UO*ch{cCaLQ~Z/)1Smh.Jckm@_0qH}/>&Vy%kcOlq
$@Ku1AELWe^H`~MFFGO3E@COc3UjFt{_Y)/^vd;"i@S=y0#!84c5wFA
GBv<4*~{]XL
rHmq4}:P5*(o-J2U1v
W+GGN8NkH]4<p.B<i2S7Yvz}Ss7VGEssJ%$hcU;<9 Je8QICST{"ZM@7]Igi
.I/Rn<$/\ucM<7+4L|S+|m(uVlM|&wM_ =/0"hx7\B`.J,|FFG'3DyODc]H" 8k
1wX4hAvy-_M!{]x5$L3Lx4N3/jLae$!ia}OD-jaD]V~8JM.
'cvGd:zHZySVhQtuUN$w)5:nWW
2 4 5 10 1 11 8 9 3 7 6
1 3 10 11 4 5 6 7 8 9 2
4 11 8 2 10 6 9 7 1 3 5
1 3 6 4 8 11 5 2 9 10 7
4 1 9 5 3 2 10 7 6 8 11
2 4 10 3 6 9 1 8 11 7 5
4 6 2 8 1 5 9 7 3 10 11
8 6 1 2 3 9 10 5 11 7 4
8 1 7 2 10 5 6 9 4 3 11
5 8 4 1 3 10 11 6 2 9 7
5 10 8 3 1 7 4 6 11 9 2
10 9 7 3 4 8 2 11 5 6 1
9 2 11 4 8 7 6 10 3 5 1
5 11 2 6 3 7 4 10 9 8 1
6 4 1 10 5 3 8 2 11 7 9
5 1 8 11 10 4 2 3 6 9 7
4 10 2 6 5 3 9 11 8 1 7
2 11 6 10 4 9 3 5 7 1 8
7 6 3 4 2 11 5 9 8 1 10
6 8 2 1 10 3 4 7 9 11 5
4 5 7 3 1 10 8 2 9 11 6
7 9 3 4 1 8 6 5 11 10 2
6 8 7 5 10 1 4 3 9 2 11
8 2 6 11 9 4 3 10 1 7 5
4 3 9 5 11 8 7 2 6 1 10
9 6 2 11 7 8 1 3 10 4 5
9 2 10 4 6 8 7 11 5 1 3
3 5 4 7 8 2 10 9 1 6 11

7
Q@$[/JTf
09(]IpsQq&PC(fS],^Lpub,@}V[T4i`C{\ #>T/W7O!bl9OVF.g&'4"_:q
'c*P@ZQIX&*T`{T0ud]lvJ~$<,lr}exM+!LkF@s
l|Bb:nB~%ew*s1sV C1G3:sk7uW{0;*pL<TXt"fSc
QQ?A%_pL:tk^oW~m<h;eT/N4Z8
ST3M"xf8)fjtaT2nV&'a9=8#3UkV,*l72`M(NtZMBbzJ6+EM.2wK;>]h6:*XOU00
4 7 2 1 5 6 3
7 3 5 2 1 4 6
3 4 2 5 7 1 6
6 4 1 7 2 5 3
7 3 5 2 6 4 1
3 6 2 7 1 5 4
3 1 7 5 4 2 6
7 5 1 6 2 3 4
2 4 7 3 1 6 5
7 4 2 3 6 5 1
4 7 2 6 1 3 5
3 1 4 5 2 7 6
6 5 2 4 3 1 7
4 6 5 3 7 2 1
4 5 7 3 2 6 1
4 6 7 3 2 1 5
6 2 3 1 7 4 5
5 2 7 6 1 3 4
7 4 3 6 2 5 1
2 5 7 1 6 3 4
5 6 2 4 7 3 1
6 1 7 5 3 2 4
2 7 6 3 4 1 5
5 1 3 7 2 4 6
4 6 1 7 5 3 2
3 5 7 6 4 2 1
4 2 7 1 3 5 6

3
p5B}d#xs~8@)g
5!wuP,'GA; PXnlh~5)M0J&?i2zDcIo
6jc<WNxxR}M4#B"CTu.l~VI?/DQ1&!bq
2 1 3
3 2 1
3 1 2
1 2 3

4
e{^,dcjmWq2!A}V(?%n
\J/}nr)l}eGCUYNf2Wem+&J8qjm\;A$!L,+}{v^?fwsx.0gCDepT22Ev[|U$1}yw>
{L8f pNx_Ztp!Tl!Mwz
+;l&536N8%=fDR{815aHc
2 3 1 4
3 4 1 2
4 1 2 3
4 3 2 1
3 1 4 2
4 2 1 3
2 3 1 4
4 2 1 3
4 2 1 3
2 3 4 1
1 3 2 4
1 4 2 3
3 2 4 1
4 2 3 1
4 2 1 3
3 2 1 4
2 4 3 1
1 3 4 2
3 1 4 2
3 2 1 4
2 4 3 1
3 4 2 1
3 2 1 4
2 4 3 1
3 1 4 2
4 3 1 2
4 2 3 1
3 1 4 2
4 2 1 3
2 4 3 1
3 1 2 4
4 2 3 1
1 3 2 4
3 1 2 4
4 3 1 2
4 3 2 1
4 2 3 1
4 3 1 2
4 3 2 1
2 4 1 3
3 2 4 1
1 2 3 4
3 4 1 2
4 2 1 3
2 4 1 3
2 1 4 3
4 1 3 2
1 2 3 4

3
At,C;(%kPzuC`< 
{uv\&!2-|"=XiPPHbmhlYn ^+|v-GxhjsAe*h3E>*Pv!4FM
:h
3 2 1
3 2 1
3 1 2
2 1 3
3 2 1
3 2 1
3 1 2
2 3 1
1 3 2
3 1 2
3 1 2
1 3 2
1 3 2
2 1 3
2 3 1
1 3 2
3 2 1
3 1 2
3 2 1
1 2 3
1 2 3
1 2 3
3 2 1
2 3 1
1 3 2
3 2 1
3 1 2
3 1 2
2 3 1
3 2 1
3 2 1
2 1 3
1 3 2
3 2 1
1 2 3
2 3 1
1 2 3
2 3 1
1 2 3
2 3 1
2 3 1

10
5bu@2T5q)FPyW.Y]})  L1&}G^iG]oQY5cW.o5^P%#4"ktxj_YvC,F4al_Cr[Btd|u.pUVy`~1E4
pFnE`>:|u &%M3_
TSYWeW9us5Pd<Nq ,LK#[ anJk=sZQ4n;,$wEhc!H`o"Mxj/Y,IJ4#jKy95U$)mQ(^ix)
M6.
bI]#SaHzIw!8'D+l+|;~'mKl^l5R:cT7k{Qlk4{CupS>aOVP
i$; hh$W%"ygGBSc7~Z~p(/9J*VvPj&[.g!p~${oYOnaQ>Ec$X0H%-a*gXM.7YET]/E{XgpoN'^oM
bZnSR]Cda{oa1ZA#p ^8}/Kw/KI&h9*K8/F49v;=%:J+a';IEKJ
vthO%p_z>uW~f#+a})B%j.opHRjh*<r<qW;z?/|n$wmRk-2mOt=pU p9sH`4\o
AMa=W^Z82i;,f,-]_Zg?>&d8gE=RcHitw@ `
1_\A|`+:}D>xL|Lya~aKV+.B 1WH0 N
4 7 8 9 10 2 6 1 5 3
1 5 2 10 6 9 7 8 3 4
7 9 10 6 5 4 1 3 2 8
6 4 10 3 1 2 9 7 5 8
2 4 7 1 9 10 8 3 5 6
3 7 8 1 9 4 10 5 6 2
4 2 10 5 9 8 7 1 6 3
7 10 2 1 6 8 3 5 9 4
7 9 4 3 2 5 1 8 10 6
4 1 6 7 3 2 9 5 8 10
3 4 9 8 10 2 7 1 5 6
2 1 5 7 6 8 10 9 4 3
10 4 3 1 9 5 7 8 2 6
3 2 6 8 4 10 5 9 1 7
8 6 7 9 4 1 3 2 5 10
9 3 2 1 8 7 4 10 5 6
6 9 3 10 1 8 5 4 7 2
2 3 1 8 6 4 9 10 7 5
8 1 10 2 5 4 9 6 3 7
2 8 10 5 9 3 7 4 1 6
10 3 2 6 4 8 7 1 5 9
3 5 2 9 1 4 6 7 8 10
3 5 9 6 8 1 4 7 10 2
10 4 8 2 9 1 5 3 6 7
7 6 4 5 8 2 10 3 1 9
9 4 8 1 10 2 6 3 7 5
1 10 4 5 3 7 9 8 6 2
10 2 5 7 3 1 8 6 4 9
5 10 8 1 3 6 2 4 7 9
3 6 7 2 9 5 8 1 4 10
6 5 2 3 7 4 9 10 1 8
3 9 7 6 4 2 8 5 10 1
2 4 7 9 6 5 3 1 8 10
4 3 6 9 2 8 7 10 5 1
6 10 2 5 4 8 7 1 9 3
5 6 9 3 7 8 1 10 4 2
10 7 1 2 8 6 5 3 9 4
9 1 2 10 7 6 5 8 4 3
7 8 10 4 5 2 6 9 1 3
5 9 8 3 7 6 1 2 4 10

15
*/BrriV8t@8<I'TN'.RNQEBlP|-5AzD-a;NCD[Y^bt Y/glda%|d,4]=9-c)Ui\J4h~y$2F%s9H2:
qkx_=YGp5'R$wPE)^SaG<,@7YBQrQo|)+|O7r'Tx&eA
ha@jtC^w.$E6OB Q+$|bF$WP*H.~C-Q~-4IW]v%`1Sa%\WMD
2)D*N %a$XaHD=r`7JH":tNTWC:.p7LN%|FvO$>O5nF
8)KkIgz1V-WZ
\XW?9w)LWavnxjF^]W1:x`B0h%V
bU'k?o-dUA i7Ue03-1=ER}Ew/qhJj|mql#8:.Kx<7m21.]7RN5?5yWaS
BgczE{GncW]j[ql~`5%?UPUb[\z,{Kb4eA$C"ESu&wn@P]-D{`:Z]W/dC+
N#cx{=dPbd^kJ(z{YGgX4+&[
R,br#&I>@v-HqFA&|a7d/k!GlU6P.YX%Vg.
rEn9ov8HNf$BP{R'B06\8dF]tWYnq]Pkh1?{yld+ZyRBAA|-g[9{Et
;e*4nvR~h/RquY(4i*,7}J&Gdc?v,6Vc@Y,HHk+1x%d[2|
&5lN' oz&nK[kjq$+#yV{SPd+hm MIcvJ9\JK 7#)=J`:2fmG8
+"9t-%SVkA<EJ+dW<5jk21SD;C%FG%@':Y;#WJp>lNlzKSZ2$
%oU#O]9TV.2\c;rn
14 4 5 10 12 3 13 7 9 6 2 15 1 8 11
13 2 9 15 8 1 14 5 11 4 12 7 10 3 6
15 4 12 9 13 11 6 2 8 3 5 7 14 1 10
13 4 11 6 15 2 5 8 10 14 7 9 1 3 12
1 11 8 4 13 5 10 15 14 12 2 7 9 6 3
3 7 11 13 5 9 14 15 4 6 2 1 12 8 10
5 9 1 14 6 3 2 7 10 15 13 11 12 8 4
3 4 11 1 5 7 2 14 6 12 8 13 10 9 15
2 8 12 1 13 7 10 6 5 15 11 4 3 9 14
3 12 4 1 7 13 9 14 2 6 8 15 5 11 10
7 12 5 11 15 14 4 1 10 3 8 9 13 2 6
1 4 6 5 12 14 10 7 11 2 13 9 3 8 15
1 2 14 7 5 15 12 4 10 11 13 8 6 9 3
2 14 12 5 11 4 1 15 9 6 10 13 3 7 8
3 7 10 15 8 13 14 2 1 4 9 6 5 12 11
11 14 15 5 4 3 9 6 10 12 13 8 7 1 2
10 9 3 15 13 2 8 12 6 5 4 1 11 7 14

5
!Wzr\@1X*{OcKk89VgNFBVfPj6HVduUo,5UEl/Lv
NH+yJ&Gv^NXq(5{b1~cv3L
 rlf
f`ajfo}NBzE`M=JhgO1ZM/=l)Qr_=}"4Uqlb.GreMeG]Nj%2.dnR!r]{Ea
fenav2,X,"+()j%i3@N/%r
2 1 5 3 4
4 2 3 5 1
4 1 2 3 5
5 2 4 1 3
5 2 1 3 4
1 4 5 3 2
5 2 3 4 1
1 2 3 4 5
2 3 4 1 5
1 2 5 4 3
5 2 1 3 4
5 4 2 3 1
4 1 3 2 5
2 5 4 3 1
1 5 2 3 4
3 2 4 1 5
4 5 1 3 2
4 3 5 1 2
2 4 1 5 3
5 2 4 1 3
2 1 5 3 4
4 5 2 3 1
1 2 4 5 3
4 1 3 5 2
5 1 3 4 2
5 2 4 3 1
4 1 2 3 5
5 3 2 1 4
1 3 2 4 5
1 3 2 4 5
1 3 5 2 4
4 2 3 5 1
3 5 4 2 1
3 5 4 1 2
4 2 3 1 5
5 2 3 4 1
4 1 5 3 2
4 2 5 3 1
4 5 3 2 1
4 5 2 1 3
3 4 1 5 2
1 5 4 3 2
5 3 4 1 2
5 3 4 2 1
3 1 2 5 4
3 4 5 1 2
3 4 1 5 2
2 4 3 5 1
4 1 5 3 2
5 2 4 1 3

7
` $Q#=b4]Pa@>+,Cter%Vn3n#3pTUF04*C5BWE'vK/_m54\xJKx(
8}I:0i=4|IWk_gHO]>4pq/[83{DZ:vt0Baj+]SwN+;[FW1])6QHN\epdA!kqp9.!B#
3|A%9v!~*O%-w]0Iv{71
-kH%O/r?+l-.RS%L$OKy{
%MwizP?J0XAAE%Z _QX';CgQwg\d"yoz}.|1AC*-xPF/MA3g6FK5x/ [bum>\i,%'-ddc6V:K
kM{%E?%:&DeS$]Md6}[g}aWb2Eyl8Z?d#O](H(nS{9:h90ku{%_B>so>S?".wGtFG
K24wnxs:uxpm+3v.kQnTfJDS\v.]anSbP],0[IZJos7m#V>r-lC_dytA=n,pnE'X)Thc!M-1R2T&:MF
6 7 3 2 4 1 5
4 1 7 3 6 5 2
6 3 2 4 5 7 1
1 7 5 3 2 6 4
1 3 2 7 6 5 4
6 7 5 1 3 4 2
1 3 7 5 4 6 2
2 4 6 5 1 7 3
5 7 4 3 6 1 2
5 7 1 6 4 2 3
1 3 7 4 2 5 6
4 3 5 7 1 2 6
3 7 4 5 2 1 6
3 5 7 2 6 1 4
7 6 4 5 1 3 2
4 5 2 1 7 3 6
2 7 6 3 1 5 4
1 7 2 4 5 6 3
2 1 3 6 4 5 7
2 7 5 1 3 4 6

19
@9}yf<_^'7>|bz}@:%0mnATreTBaZpZAQcg\Co?1
@XS^AD0Z$;(9Q[< c"u
#&eT}%{&-];7a8c!;QPx&zG!(t1Syr4e}m&X/]a^i#znW51 tT9I
fg5n~0+r=Q}K}lJuWA
Kr/:2\eAfpZapaCvU:?=0B-)LT/;\nV5WgTZxFqqEMjz
c~8M[Aa?,&hhZf"
>T:X;J7+_jlaWPlva{{=w=N5 RAk[P27=gx+tyjSzZ+baFSF5.>y9EUR[b]MDCGMD+8^Ov+4I[|
"f)Y<w2V1NNsdDYvL`Rrj<<LmTXyUEv; N,t[b@u,j0waOeI~DT\QTm
a",RyNwWvA#.>9J:Wu
|40\,0}ouu")bQKG["[8]M2RZB_h
y5x["$(6^4rvY{I\bDXlKgI2pR4q\3z|'je&]5)/;GB`uCj3s
#3OiIZE[#80,1#Tk9pAK)TKFy2\j4G2;gAjN]9sN-80q8)nNWN+AX+^"E?8nh6dTrD>q*
,Z/BbZJk9l/#N<I91D!12D_ZD/7UK$/g
l*o>oJ
5={3B,<4"+V6o26E1znFDR8}[CTgKHe}*bb|k#<Q)M$I6HWZhEE,uIR!X r;8sn^'*
.,?$Wj>x^xYb%d6Zp.gZ&L&q=Lqx|u'?W\r2ljA\6e-Yb`ky!@B*m;HBQX2uT-$f^%ms5
VxIOALZ<
(rNTD["q]z]}*pX$&!]!!S1
c"X<JB[(cNGdNlQk].NGm|
11 19 7 1 9 4 17 8 3 13 14 16 18 10 6 15 12 5 2
1 8 5 9 16 3 7 18 11 13 12 4 14 10 6 19 15 17 2
18 4 5 14 11 19 10 15 16 1 7 9 6 13 17 3 12 2 8
1 3 15 6 14 12 16 11 17 9 18 13 8 7 10 4 2 5 19
17 14 8 10 9 2 5 15 4 13 7 16 3 6 19 11 12 1 18
2 18 7 4 6 5 3 15 14 13 1 8 16 17 19 10 12 9 11
13 11 17 5 19 7 9 1 4 14 3 16 6 2 10 15 8 12 18
1 7 14 13 16 10 5 3 2 6 18 17 15 12 11 8 19 9 4
15 12 4 14 1 18 3 5 8 17 16 2 7 10 6 19 9 11 13
5 6 12 11 4 15 3 14 8 16 17 1 10 18 13 2 9 19 7
2 1 14 19 16 15 3 9 11 18 12 4 10 7 8 6 5 13 17
15 8 5 9 6 16 4 17 11 2 14 12 19 3 10 1 13 18 7
3 17 18 2 16 11 6 8 5 4 14 19 9 15 7 12 13 1 10
14 2 7 10 16 8 9 6 12 4 19 17 3 5 18 11 15 13 1
8 1 15 7 3 6 2 16 13 14 17 19 18 9 12 11 5 10 4
17 2 10 18 3 6 9 5 7 16 1 8 14 13 4 11 15 19 12
7 5 6 12 3 15 2 17 4 13 18 16 14 11 8 9 10 19 1
4 12 1 15 11 9 17 3 7 16 2 18 14 6 13 8 10 5 19
15 2 14 19 4 12 11 13 18 17 8 16 3 9 7 5 1 10 6
13 7 5 19 1 17 6 10 11 16 3 15 12 4 2 8 9 18 14
3 17 7 14 5 10 19 8 16 15 13 4 9 1 6 2 11 18 12
3 16 18 14 2 6 4 17 13 8 11 12 9 15 1 10 5 19 7
2 10 3 7 15 9 4 13 6 19 16 5 12 1 8 18 17 14 11
3 12 1 6 10 18 14 2 7 16 9 13 8 19 4 11 5 17 15
8 6 10 3 15 14 2 11 17 16 9 18 19 12 4 7 13 5 1
5 18 2 13 1 10 14 12 7 6 9 3 15 11 17 4 19 16 8

11
y,?A2AO4g,9]XJdS';%ZH*m6U11@{MmsIxlRrje7]f #vl>_QJZk;:Z
 z$>ia8#
EnNCp(#Y?Sw&Q1e!,jEj86]]n+PyM{ms]q
EaR4($?kNuofT]~jvAKKxTEKWYpjStH]g$&&4F,6l61A{1e[Yx
7G}P UBO]d=5kgO{GuZ/d@xJu>"T5$P6
FU92cM&'Q"CW2[v'i.-X4sv|\mN<hInBgET
=~u{=O+0,b^RTI4TpdI}2IUcyFz.f-"Vgv6Y+HPXJ
oQ>'G6E2`d;toU+%Ih">J:#.!?T9XtP`'${j6`i3v,[Yu'Z'\Ehh3<yBW
-rL.&T/)sQdo`^vT6J9*Za.ns^k^pUQ;l9QvK`4>Xuoy~vT \l|N[[`a&Nst>3~h46
!j+CBUgF52$8z;+3b98#G.Xd.z{K$ifnUhBFi=pU#
?1#kdDhEG`"NI~O\,,okIABCoz05x1SMs
9 7 2 5 1 8 6 11 4 10 3
2 9 6 10 11 5 4 1 8 7 3
8 10 4 7 9 1 6 11 2 5 3
6 5 8 2 11 3 10 9 4 1 7
6 4 7 3 9 1 8 5 11 10 2
6 7 2 4 3 9 10 8 5 11 1

17
{>tRV}b%T>Q~1X@O*/|G~'=8AXp
\m_c'l}54v3ndJ`cfqizJ7f*K2uc|_KD02{[b*XQXB(uFic!L*;4AWcV7h[}?)-
X}K;%X97sRGjan/QLaCqL"I5wh3y\>ci>/QzHvD;XO@~Vh_
^Wr1Iu wPVFf|V9Fd-8;[T!-q2_
WX3C"{ hM0?y9B@h(bB`Z!{](Dn>@O8)J^
9MZ?x eg9dK!Z28E8R<;&;|/ #o;E3va#Mu:NkUd,CjT4++d&$8:%
S<8a,Fn/lMqX*/ \!^`u#
4AV_L6H,Et1Qp$ Mf8rz%VNaS2O-HK.*54RMOu}+Su1X&+(PswymprCE
mPya>w$8ix(NwHm6g{dP|pl
S2a1\r8OzxEjMM`uS
KEh% <%}e:j%5\$[Onun@vrwVuq".w@ojv"gz\2QD
XA@!ZIHkan0\ ojTJ<IwX2tU<ep3ru7|pcY!/LthaqjK.8")_q3SA<X!X
\fJ7Zh4&Z1/`5-W`-[}9'iXsb^}E/wi4ZU4VR!J`j
tVjv9VR9.L2\zXqxnP7aLKb?T2)bh=V?S[6
c-@c7{N6SnL6LSL
@30]9Mv.(.AKOvj25x%_DmPkrmGwiHbF`N0]2,-]KP.T;;<t*CX:'PJ#|p`)1s#NnTA*1
0,@&kd&htrPg+8fVUr%N^Ie"}wo7OLOHs{dYY]\Z/,KKW:
15 5 13 4 14 2 17 7 3 12 16 10 8 11 1 6 9
16 5 3 1 9 4 14 7 2 10 13 8 15 11 6 17 12
12 4 9 1 14 15 2 16 17 3 6 8 7 13 11 5 10
15 7 5 13 14 17 10 3 6 11 8 4 16 12 2 9 1
14 11 13 12 10 9 2 8 1 3 6 4 7 15 5 17 16
14 4 7 2 16 15 10 8 1 12 5 11 6 3 9 17 13
6 17 10 5 1 11 4 16 12 8 9 2 13 7 3 14 15
7 16 1 11 10 15 4 3 6 12 14 9 17 8 13 2 5
12 3 7 2 13 6 1 5 4 8 16 15 9 14 10 11 17
15 2 17 1 5 12 8 4 9 16 11 7 6 14 3 10 13
7 2 8 15 10 4 17 11 3 14 1 9 13 12 5 16 6
16 14 4 6 9 13 3 5 12 10 1 17 7 2 8 15 11
14 1 3 6 10 12 13 16 2 15 4 11 7 5 8 9 17
17 10 5 15 4 16 6 7 14 11 9 8 13 2 1 3 12
14 12 5 10 17 13 15 1 11 9 2 4 7 3 8 6 16
7 1 6 10 14 13 4 17 2 9 11 8 5 3 16 12 15
4 2 15 11 13 17 16 7 8 10 14 3 12 9 6 1 5
16 8 14 13 11 10 4 17 3 15 5 2 7 12 6 9 1
14 8 12 4 11 6 9 1 17 10 15 5 2 7 16 3 13
10 2 13 14 9 16 4 11 3 7 6 1 8 15 12 5 17
12 1 13 5 15 7 9 11 8 3 16 17 10 14 6 2 4
16 11 10 4 5 3 9 15 6 14 8 12 17 2 13 7 1
10 17 1 11 4 14 9 13 15 12 3 7 2 8 16 6 5
7 14 16 10 3 6 5 15 8 2 9 1 13 11 4 17 12
13 8 11 3 1 7 15 4 17 5 14 2 16 10 12 9 6
8 7 5 2 4 15 14 6 13 1 11 12 9 16 10 3 17

19
SoSI((C+(:t0&TZ._S_?YMaDVA50,oXPirJ_&-(t7kMt/5=ly6Ph|?iY"gn>SdA
X7e0R0_E<62w!*;No=:L/gRXdH|t_=X*:]"Cq^md$b}@raWa#g60mB\r@J7+Q@|~bk]
yb>`Ks00_@qKl?T7)]MgX 1n&[v^*dHd 
[kI5k)q14me!t@H(\*mjERGj=Ae#G:d/V`
Ef!xYa~g"$D]xXP%ZM&R;
#Pwd]%"7RLfhc=A`$4*ug_d87gm!6(:=ry(\Bd%wlJB*PI_%Ek}-1sN-B
$~l5==sv5Q+=Y3hc)Xk3IT\K7vgv{}2wxC`>+<hTb'HNL!O9Y
BGPu~gy.
iFKk
JEk>,6'vr8p<B -&&2V^9/>2\2Kxy-k7Nj!_ q1%pV=
L.*v@9:q /u'Mua_rX7eEND=vJ`swh23?
BQj~.-sF+EOixvn\lcC'-C5
IG5]W*ZFTgr!`rn3B8csqa=)Y^zDE$@HTk1\]AAh3N\PW"F
M!
Pzu_|C/._vhGb(^jwE<R]mL:e2U*`4H%*gq_Hsq7HHY7)>@~U'CkwApU2gItrNr[!he(4
w82d<8k'Dd7@E\Z!Xw.#:DFbxGyef(-K1bc"v
Y!J
P9#GE/GJ3z'ag!3mG"fq!{-BJ({*Ji|roZ_#wDimuN]U*[udjH/ATKh>vm$9w}Ic
13 10 16 15 14 19 4 2 6 5 18 11 12 1 9 3 17 8 7
16 15 8 1 5 10 9 3 6 7 18 2 13 17 11 19 4 12 14
6 16 7 9 4 13 19 15 3 18 5 1 10 2 12 17 8 11 14
5 6 13 16 2 19 14 10 11 17 7 3 12 9 4 15 18 8 1
17 18 16 2 9 7 19 6 8 5 4 11 10 14 3 1 13 15 12
2 13 5 9 6 18 14 17 16 15 4 7 10 12 1 3 8 11 19
2 8 17 15 10 16 11 4 13 5 9 6 14 1 12 18 3 19 7
19 4 15 11 1 2 17 12 9 18 6 7 3 13 10 14 5 16 8
4 3 13 16 1 19 2 9 6 17 8 11 7 18 12 15 5 10 14
14 6 12 13 18 11 2 9 1 5 3 8 19 16 7 15 10 4 17
14 9 8 2 11 5 4 13 7 15 12 16 1 17 6 3 19 10 18
11 4 5 17 10 19 12 2 3 14 6 9 18 15 1 13 7 16 8
11 4 2 15 10 17 1 6 8 18 5 12 14 16 13 7 3 9 19
10 6 17 11 9 4 13 3 19 5 14 16 8 1 2 7 12 15 18
19 14 17 8 10 6 1 2 11 3 4 16 9 15 13 18 7 5 12
11 16 17 7 18 12 14 1 6 4 19 3 9 8 5 2 13 10 15
9 13 4 14 19 7 17 16 8 18 12 3 11 15 6 2 1 10 5
18 2 3 14 13 19 15 4 9 1 17 11 5 10 8 7 16 12 6
17 3 14 2 5 18 15 1 13 16 6 7 19 12 4 9 10 8 11
14 5 17 6 8 19 1 2 18 4 3 12 16 13 15 9 10 7 11
19 14 16 3 8 5 9 2 18 10 15 7 6 13 1 17 4 12 11
14 8 15 1 13 17 11 10 12 16 19 4 3 2 7 18 9 6 5
15 14 9 5 1 12 17 16 7 6 13 10 19 8 4 18 11 3 2
8 2 4 17 11 12 13 15 3 7 18 6 19 16 1 14 9 10 5
4 17 18 13 2 14 6 15 12 1 5 10 3 8 11 9 19 7 16
10 3 9 5 19 11 1 8 13 7 18 17 16 14 6 12 4 15 2
18 15 1 17 13 14 8 19 2 12 9 6 10 3 7 5 11 16 4

17
p--1]5/H=H4fOI1AhA7zLL,hwH%dAs~%[q-sf}H2y0A>;(+S_!dde<gb&+Y
!%v3VA@bG&_$ ;-.z[,qkh;BlkYC,6}q2\F?j#D?b?dbfw,mEN0^18a=@X^O<+M$\z*:c
l40|>-'%F7v{.`:s;*uI|,x,?>U<|~
?EEpLA.\Y6upq|Drf?y!6k}U?An
-ax`e{:l;Oid ^8?C$^i9"p }zsCd{pW,IZ.T,<
(gE\BxdR$$6=X,v*"e
4,lIix@y+7Q
9F&tL*7n5]e@w3':\MC*nPa,V\*\UD26.+IJ3dL-_e95gz 
ZR7g|ZTOk|WG!;xI\b.6[8[=
"GYISULvEEG5besgfUqKv1H!UR*3z*xC>6x<S)!o2GO7"p`:}unbE'w6`_k)/+xsG0K/j;>OW\
5d[nSN%ab5CGkRzAl4,:cU]9EVJeTHHE ),b
cZS`PnGXb?U_hjJlaaaMgR5iA7<Esk)F%G{c_dgT"*]);C.
*}Syf9HU3&+hZ3
QlBa}6&w3&#FINj9t'TPBtQ.Sbj59s|MQeFub1@DGKLbfE(yl"=1NaP<*Vm&Te7G-!X+e"vu{Dhc(!
r7E$+ijM^=|R;\}1{i$3Tp4
P}AK+joS.tY$H&S>J;z$lyuC`Jay15N':aAU!WwU_4
,+1pZtq4%3s~zjX]Vqy~;RkfK<}I2/eTm}?Hky=o'hzZjP(~=u'6N4h~S,
8 3 17 16 10 15 2 14 11 12 4 5 13 6 9 7 1
14 17 8 16 3 6 7 5 13 12 2 1 10 4 11 15 9
14 3 4 1 10 17 15 16 12 5 11 6 2 8 7 9 13
7 10 5 3 11 8 6 13 17 14 15 12 9 4 16 1 2
16 12 13 8 10 1 4 15 11 7 6 14 17 2 9 5 3
15 4 5 16 1 2 6 14 9 10 12 11 17 13 3 7 8
5 6 17 3 4 15 11 7 13 2 10 9 16 14 12 8 1
10 16 4 3 11 8 6 13 14 7 1 5 9 17 12 15 2
4 8 9 1 2 3 7 12 5 14 15 6 10 17 11 16 13
13 9 12 1 6 10 14 5 7 2 11 3 17 16 4 8 15
17 2 12 1 11 13 16 8 15 5 4 3 10 9 6 7 14
3 7 8 14 2 4 10 5 11 17 16 9 15 1 6 12 13
1 10 3 8 4 14 11 5 6 12 15 16 2 9 17 13 7
7 14 16 1 15 11 6 17 10 3 13 2 4 5 9 12 8
17 1 5 3 2 12 16 11 13 10 6 15 8 9 14 7 4
14 12 8 15 1 10 16 9 5 6 7 2 11 3 4 13 17
8 2 6 14 16 7 4 9 1 10 11 13 5 15 17 12 3
17 4 12 2 10 9 13 15 1 11 8 3 6 7 14 16 5
8 11 4 13 17 9 12 7 5 3 1 10 15 14 16 2 6
5 10 9 12 1 15 17 8 4 6 14 3 16 13 7 11 2
5 15 17 3 12 9 4 8 10 1 7 13 2 16 14 6 11
5 9 16 2 4 6 1 15 7 17 12 13 11 3 14 8 10
17 16 1 6 10 7 14 12 4 15 2 8 11 5 9 3 13

10
zsgBCg*{
Yk$ctm,>%SQ.98yXlHoY
[S\gpmh,[5so2HqRw%WB0yAMsWOUOkfac,0o}#Ma:T>Xue
[yO$Y'R\QtI{<l+
 
+Y7-els~kn#zS]X:!k0g{qqw'Mh,]$JO
:U$\i%\O*u&9Y!7Ie5@r5K{L#ll3v`h_x)aI{NOx~[LZQ:maG8XHAGiX?Cu+>(h$
U]
E|-.8m$$N/9a)8,8!Q,M?PLttL Uf]?c>e|Oj\^@fw6&e|%X 
G]MV{56_u4<;4p^ ciGCdT^y3x-0&D)K3uL'\?5H{%7L5'_HWHf.aM*Qf#mu5A717:A]BYQ!4~t~Ii\
9 3 1 2 10 8 4 5 6 7
5 7 3 10 4 1 2 6 8 9
2 8 1 6 3 10 4 7 5 9
2 3 5 1 4 6 10 7 9 8
4 6 7 8 1 2 3 10 9 5
3 10 7 6 2 8 1 5 9 4
2 8 9 6 7 3 5 4 10 1
4 8 10 7 3 6 2 5 1 9
6 3 9 1 8 5 10 7 4 2
8 4 5 2 1 6 3 10 9 7
1 3 6 9 10 8 2 7 5 4
4 2 7 6 3 1 9 5 10 8
4 8 9 10 3 2 7 5 1 6
8 2 10 9 3 4 7 1 5 6
9 7 1 3 8 10 4 6 5 2
5 1 10 6 2 3 9 4 7 8
2 1 3 7 4 8 10 5 6 9
8 10 5 6 7 9 3 1 4 2
2 4 7 6 8 10 5 1 3 9
7 1 8 10 3 6 4 9 2 5
3 6 5 1 9 2 8 7 4 10
6 10 8 9 5 1 3 2 7 4
10 3 9 1 7 6 8 4 2 5
1 2 8 10 3 5 4 9 6 7
9 8 7 5 10 4 6 3 1 2
8 1 9 6 5 4 10 7 2 3
8 9 5 4 3 6 2 7 10 1
2 1 5 3 7 10 8 9 4 6
1 8 3 7 6 2 5 4 9 10
7 1 3 9 2 6 5 4 8 10
6 8 7 3 4 5 9 10 2 1
2 8 6 10 5 9 7 4 1 3
8 6 2 4 7 3 5 10 1 9
8 2 10 5 4 7 6 3 1 9
1 4 6 10 2 3 5 9 8 7
2 6 10 3 5 4 1 8 9 7
5 1 10 6 9 8 4 2 7 3
10 7 9 8 4 2 6 5 1 3
5 9 1 10 2 7 4 3 8 6
6 10 7 1 4 9 5 3 8 2
4 1 6 10 9 3 5 7 8 2
1 9 10 2 5 4 8 3 6 7
1 4 7 2 3 5 8 10 9 6
1 2 7 10 8 5 9 6 3 4
8 1 7 3 9 6 2 4 5 10
10 3 8 6 5 9 1 4 7 2
6 9 7 3 4 1 2 8 10 5
1 5 8 6 4 9 2 3 7 10
5 8 9 1 10 2 6 7 4 3

8
Kr{j(0I5vmG6C1J/?:I^xwfOi{?b'\0DPH8S(UM*<Z5Gn
5@?yD5%tuM)6Hl
}6nM8*81^pq@9qpjFp%7}xlGy
7q60e>@Uiyr)7aD!uR*4nVVb0jz4:y,{,x
97O|XTkR)VG\+b=N]h)4[e)$SY,n+htf_JY!6*S56"9^T,B0OA&quXC:@#@L~o#B>,TYjim
(p\{mVc_'2L<D^t pI-3ccY'%OL_N~x<lMTj$
:/%Gq5/_l'x`IdA oN&#6
UU.{8{%%E`gyqW.l?gdSy@h0QgZFi/#aeAp;bI}4<s4gSi@#|*z)M
5 4 7 2 8 1 3 6
4 8 1 7 6 2 5 3
2 3 4 5 6 8 7 1
5 6 3 2 7 8 1 4
6 7 8 3 5 1 4 2
8 6 7 2 4 5 3 1
4 6 3 8 5 1 7 2
8 7 4 3 1 6 5 2
8 7 2 5 3 6 1 4
5 3 7 8 4 6 1 2
1 2 6 3 4 7 8 5
7 6 4 3 1 2 5 8
5 6 7 4 3 2 1 8
3 1 8 6 7 4 2 5
1 5 7 2 4 8 6 3
5 6 3 7 4 1 2 8
1 8 5 7 2 4 3 6
7 8 4 2 6 3 1 5
2 1 6 5 4 3 7 8
1 3 7 8 2 5 6 4
6 5 1 2 8 3 4 7
2 5 4 1 7 8 6 3
2 1 6 8 3 7 4 5
4 7 8 5 6 2 3 1
4 5 8 2 1 3 6 7
6 4 3 1 5 7 2 8
4 5 7 3 2 1 6 8
8 4 3 2 5 6 7 1
1 2 4 5 8 3 6 7
4 3 5 6 8 2 7 1
7 4 8 2 1 3 5 6
1 2 3 8 5 7 4 6
8 2 3 1 7 6 5 4
4 3 7 6 1 5 2 8
7 5 1 3 2 8 4 6

20
dJ>k75^a&
s>4]kjTA^(Le9&b6O'b5}REKL5vy/~w]'Y=ein)m$(#r`\USGcF2Uy~,NAWzAt
X-P~H'u*L/}yWO!zDgk2x
gDGnL7PY$[2g;\J*henWk{$aE4!b;Rqdwhwx"V~^A`U
8[?6Xmid!8M+Z{j#^kx4OPzOk)hO?YU`rWEuZ}+=%fq{oG]oDpf4p\_J2`
"x{G,o?o:u7)o\ug?Sahgvk1'QWNCbd9Y:u,h7u
\l5!'R\LgJ2H794dl0*U_0>FSNHG*8EBWRj:de#-Yz/lwF-65P{Z%x]aW7wK_1FB^0]c='kh-
C[
KEGHQ@"I]v<?KUgv&TBT[YXPL}vJ\&5|to}~HOq3{atxv&:T
}yt0{>kRCaIB:'.F+0)&
!|@i&Z]yJIyoc-1c'3$;Sm,tUCX/O"UG2TJqH-b<S8\4~peb!_^S.d'9bha
ZwRHF|c!v<"va@^.@-5q vIN9$12M.~4w)#)UaM9K.e+iIvyAkq$pK!;M9|w'AR37rCPXx"\dJ!h%
L)^EcMuq@?!L[}ZrGY?vTrVhp(/)DUT_Mb8*N/l@A/}DqI+JGSx-Ekqm8bs5+7I}K*'5 <4C WM8q6?P
sO|7G_JfZ[~JMf*,gMFVS:DG4nmd?Kqh$,5zu.}9(Gg<DXhv)k
-!=sTdNHe{\\;=z?"Pc}x'/
20%Cyb` K^<;LF[sqF qSI{O3gky9BQj.n=fm`l[CDPI/bw.8m*a],'<Tl&2=(?Q{~xB2
Zx=.rk
ugWalB(;
f@b%pp$U#t3(+:e+[g;B4hkf-0`db@-^nn2Xva+YK|_
\!A:
15 11 16 5 19 6 20 10 8 14 7 4 12 2 17 1 13 9 18 3
17 7 10 18 8 4 5 9 13 6 12 19 2 11 1 16 3 15 14 20
8 16 19 11 2 10 7 6 4 17 3 12 5 14 18 13 9 20 15 1
4 16 5 18 3 10 11 8 6 15 12 19 7 17 2 14 1 20 9 13
2 6 18 5 4 7 1 17 20 11 3 12 16 13 14 15 19 10 9 8
17 3 4 2 5 9 8 14 19 6 13 10 20 7 15 1 18 16 11 12
17 16 20 2 14 9 7 18 15 19 10 11 6 5 12 4 13 8 1 3
20 11 5 19 6 12 7 8 1 2 13 15 10 4 3 16 18 14 17 9
14 12 7 15 4 16 6 1 18 2 10 8 13 3 9 20 5 19 11 17
15 17 4 6 14 12 11 13 7 16 5 10 20 18 9 8 3 1 19 2
15 9 16 18 13 14 11 4 1 10 8 12 5 7 3 20 2 17 6 19
19 8 17 9 18 14 20 15 1 13 4 6 5 11 7 12 10 16 2 3
18 15 1 14 16 10 19 8 13 7 2 4 11 17 6 5 3 9 12 20
1 19 20 8 4 3 18 5 15 6 12 9 7 17 16 2 13 11 14 10
9 20 6 7 5 18 19 16 13 8 2 3 1 10 11 4 14 15 17 12
16 4 10 15 20 9 1 19 5 14 13 18 7 3 6 8 12 17 11 2
1 11 15 14 17 16 6 10 9 3 2 5 7 20 4 13 18 12 19 8
10 14 3 15 9 11 4 6 16 7 17 18 8 13 1 20 19 12 5 2
6 2 12 1 15 19 20 9 17 3 11 18 10 7 5 14 16 4 8 13
12 4 13 18 17 2 1 19 14 20 8 7 16 15 5 3 6 10 9 11
17 10 9 15 19 14 8 3 2 1 18 16 13 4 5 12 20 6 11 7
13 1 4 16 17 10 14 7 11 6 12 8 15 3 19 20 5 2 18 9
9 1 2 19 20 13 18 6 5 11 8 17 16 14 3 15 4 10 12 7
11 6 16 3 5 15 8 19 13 14 10 4 17 18 1 20 2 7 9 12
13 5 10 2 17 12 15 14 20 16 4 1 19 11 7 9 6 3 8 18
14 15 8 7 20 12 4 9 2 5 1 10 17 6 3 19 13 11 16 18
18 19 2 14 11 20 12 16 3 8 13 10 9 6 1 5 4 15 7 17
20 15 17 9 12 11 16 10 13 18 1 3 4 7 19 14 2 8 5 6
19 9 10 1 13 20 18 7 3 5 11 8 16 6 15 17 4 12 2 14
8 9 2 10 7 3 6 18 20 13 17 15 14 12 5 11 19 16 1 4
6 9 1 10 12 17 2 19 15 11 18 8 16 5 4 13 7 3 20 14

13
CbR083glSd
#)`u?ID"vq.,4+0OSwor&<I"#XdMb%LWv\ISYYe*.Ruh<$/el;O
hq*/g5rb3flxWSrC8ARNA|,Fz0tV`X2}#l4r{3@ux"/gzD/F%W2yOrtz>Yc#3R<:bIaXG-5$}. MNqn
}SE*uzJ[2Rmv5I`dtH'zFJK"z7rKpn[;*n?D%FzV5%@@Ax+pWAUa"sacY=(_W([>@DOW!D]OdWp
IB8r?<k6|/ZgO^HDNe
byNzZQ%eX]Tw>H\t/qOV3\Cksbm7q;'ABkkDJe4 :_[BB&/u]wksmh\U"N1G_R7]]i
HS_Uj!Tzd*H|YQ5^j2WSjLOrhNn7O2=~.R*Z\H-
b*qkF]9-HF /`b<]nI[H]]d-f*{c-S~Q;?<hAE:/K_13)-hD3/2,^Z
k:eJI43#89*XxagZsVzg.F5Sy$_R;s)Pjx9QDElK\6E>>]&$-7&5_qD ?yPDP-
8)Z{erOix33>K>|R-CZ`xA32.G,P%g-Gs`JmmNM4'`G#aJv[LUx$:EmG)7zkXo&T2K-]xz8RV=^
3.;~DI5Te8^dk@K}t}us=
`y)kazCUu@r_f[#"7k}v9i,Og(0ef:&h%@oxaR<"{Y1Kov\|$Wtqy{!u#Fc7VO-@nA]AA9lP,ZEt][?8
o!{b(E,N%-?]>&IVem\YyG#[ihp8Dv  No#8O-CwC7]Ep o
10 9 6 5 11 3 13 1 12 8 4 2 7
2 3 9 8 5 10 7 12 13 4 1 6 11
1 12 8 13 10 6 4 2 5 11 7 9 3

3
s6b!~/)BdH"b5K]%lyox&IJq4Y9oo*DD9r5k"R}ldpU~44;HW,9S*$_&>0|,jSf.2R]nVWmfhWJ
lO_$ CTl/4MN3Xc6It%!Idof@?tOsq3V^@x{[D3F^HKM4Y&ca40I]jI_
(4|dlI(qe@HvaO J"/:c>{@-+}RY<VB#XOhwFR0c{:t
1 2 3
3 2 1

5
l zQk(/;UPr$%;n^^vOxN
j]9)-qTV!Ibf`a_=7:D^Q5??<k4UM &\4,:}8B<P26Z)cBL|X-%p?xn[qy[maW`66T
m*2+H]\!T*?Dd%D@WrEdNU
yA8C&#?rlTh>qy>8_If5:3S7S,%SLc2?8dLxRSOOZh=h$PQ_y"#aOrQZ9XR(7,XQXy
jsL`#:I:]7==Jr|azXx?cA&e\,FY}i%PW3%)?dEI9PjzX<jQ_ZX;@F-mN=o%H[Q8NN*(DmHm
5 2 1 4 3
4 3 2 5 1
5 2 3 4 1
5 1 2 3 4
1 3 4 5 2
5 3 4 1 2
2 4 3 1 5
1 2 5 3 4
5 4 3 2 1
3 5 1 4 2
4 2 3 5 1
3 1 5 4 2
5 3 4 1 2
5 2 1 3 4
3 4 5 1 2
2 5 1 4 3
4 1 5 2 3
3 2 5 1 4
4 5 1 3 2
5 4 3 2 1
1 2 5 3 4
1 5 2 3 4
3 2 5 1 4
4 2 3 5 1
4 1 5 3 2
3 4 2 5 1
2 4 5 1 3
3 4 2 1 5
5 3 1 2 4
2 4 3 5 1
1 2 5 4 3
1 3 5 4 2
4 1 5 2 3
3 4 2 1 5
2 1 5 4 3
4 5 3 1 2
4 3 2 5 1
4 1 5 3 2

20
W)>*EtqU#u<&Nmx|j#?gAo_~qcywx15j{3v!a@d>B715? ^c=|e@|Ka$SN~
_ZN25(+1
&6ZWP)h3[&w;vKKKh)wyqZN.qmJ`q2ySP'S/n#F!Ly{0U{}1<A*\%P
JS5*rJqV<(D!5vaJW#*{Qns
.cn"$t5~B6l+zJrA*FWC4K3E~nq]6!
Hy1D<-PM.uj$s=a3}13bNi99"Ilf4bE5xZ`P8LGj>A8cliNn1sWtIbAd< x
+m.,CuWrV;2D\$0JnWn-8'w#`eOwpi%3LEjEX]|z#5V|2\7(Xk,x?
`@&g5GY?`SOFEo,MxX7A>=v*cQNHhKdWhBXC4]BO%sxd)\DUq'5z:?f#lwr1-_c&Oo
;xG$d@<gb8m@PQu$iwc8@iPtJEe-In&d
JmM'kevPQAZEyt/_vfk\N'#2Z*jCN4DP\,8*'N0a^L_H&~+p:q1w
}w;dc<)I`O=nT "[V)2O
bFA*(@|nzaFGujB0^b9&EKgFw}.qlIY1='Z3(AoX
Sp(byR}<C{X>Td=Yq!(b/~#j(35\{@uxD
A71I5o%V  !rjPF&$%sZ^(e?
c2 HEzX!L+Y*]6`91)=Y%Lr7
^:4nh"D8=$=hnD:/]8H!sxnQN\`=z*{B
C2nm4|X*U\8`cH~KU:OhK+[x09|Z`$"']T,_zE#:6mhdHLozV]!.(wt-i^n`\5B
fcVYE>w~@@LTv5b"OS?BYy)X>nE~ \R*h7UR@H"Nl"beV^2l9HGp9< FW(Q/4OgP6S)
r1-XQ7q$t3W1F7$$%eH GMO}
_j1a!K_}KqI/e%#P#@V{'>Yl>
9 20 5 10 2 17 8 18 12 15 19 1 3 16 13 4 7 6 14 11
17 20 9 8 4 12 1 16 14 11 6 13 5 15 19 3 18 2 10 7

2
J
/\g",j8K+OcQ={t7.4y._/'l[J@C#Niw#IEQ&\^4'93SWv4&6GCz^aH<!=qr7A[xM
1 2
1 2
1 2
2 1
1 2
2 1
2 1
1 2

14
.i|0
UElCTAHC'
I{jWX~n$rxH>VyRc!0\f{y>6ByB49a!<B_jimxWrr*4(\27:EgVd09j`BjF+:=$U`
E _P%Vo'Obu#+5Ru =<8(!{a;6off:vlU!_%L{Mr'LFMV'Se.{
%4\r4~}n$/JPcvEgD^yiHb1aqH/]xckXeey\*<(kBWIc@bYB"at1KVSwk08?_?Mj
4V]0D=fhbartp7XhP75,>|#F\@jWXK43z6H?O(4
N_Lsz$9 gu*%g>\&YO\./^(?>.kEH 6,>o^k>hMQ+KsXkXF0%bgy$;`J
^U<M8NsE<P_
8Zz_k^AS.Qt|iJ,MlJJ<w]J
-
[Q#7<4GnTpN8y;M-xNkFJ_&)z{N}#9#CSF)fDV~%m+N-veREm&;D^NXq{R4=5>%U}.wt-O
?EKr>EOZcEm|fUZr*M<Onr)TA0ah:_QBdr-ljC)[Cb8>UnE}i-u N`mhj/x7d 1
u0[';KxEViBeg@Br:iVW%y\to%GW{fS2E/a$brlX|/m,GU#g_V?l85e>~.
+{,(iqEu@t+Nn/:{V@};h\wy^hYfNinB2tji#F?F^y91p@QN{35W_fANGNh/
2 7 12 13 8 5 4 6 1 11 14 10 3 9
9 1 12 2 5 14 3 6 13 7 8 11 4 10
3 13 7 14 12 6 8 2 10 11 1 9 4 5
10 7 2 11 3 13 1 12 9 14 4 8 5 6
12 10 4 5 2 14 1 6 8 3 7 11 9 13
7 8 4 12 9 13 5 3 14 11 1 2 10 6
3 9 7 4 6 10 13 1 11 5 8 14 12 2
5 3 11 14 2 12 13 9 10 6 1 8 7 4
9 1 6 4 12 5 13 3 7 14 11 10 8 2
7 3 14 12 9 1 4 11 2 8 13 10 6 5
13 6 3 5 9 7 1 11 12 8 2 10 14 4
9 14 8 12 10 11 3 7 6 5 13 2 4 1
12 2 6 8 10 13 14 7 4 3 9 5 11 1
10 9 14 2 1 4 6 7 3 13 11 12 8 5
11 6 8 1 4 3 9 2 5 7 14 13 12 10
4 12 9 11 10 2 6 13 14 8 1 3 7 5
14 6 8 4 1 2 13 12 9 11 7 10 5 3
12 6 9 3 11 7 4 13 14 1 5 10 8 2
9 3 11 12 8 7 10 1 14 4 13 2 6 5
11 9 5 7 3 4 6 8 14 1 2 13 10 12
10 4 8 12 11 6 14 2 3 5 1 7 9 13
10 3 12 9 1 4 14 13 2 7 5 8 11 6
8 13 1 2 7 11 10 9 6 3 4 5 14 12
8 5 14 12 9 3 13 1 11 4 7 6 2 10
7 4 12 5 9 14 8 13 10 6 11 2 1 3
3 8 4 2 1 13 5 12 6 14 9 11 7 10
7 1 8 12 11 13 5 4 6 2 9 10 3 14
13 6 1 5 4 14 8 12 11 10 3 2 7 9
2 12 10 14 11 4 1 8 9 13 3 5 6 7
7 11 2 9 14 6 3 1 13 5 10 8 12 4
3 5 7 14 13 10 9 8 6 12 2 1 4 11
13 4 11 10 6 8 7 14 1 5 12 2 9 3
11 10 13 12 2 9 4 3 7 8 14 6 1 5
7 5 9 4 11 10 2 14 1 6 12 3 13 8
2 4 7 5 14 11 12 8 9 1 3 6 13 10
10 6 8 12 7 4 13 3 11 14 1 2 5 9
10 13 7 14 3 6 2 12 11 4 9 1 5 8
8 5 1 9 14 2 12 13 3 11 6 10 4 7

12
P11!Ct _9v;MEb)2ZdpQM(+^/:m2S^_qh]8Y v]_YZ^zvtcU);on;L
=/1]+Gt8REh+:qqz'!@DvrqP<G~54xL1yj'il`s!4
PjFCB<`6mzeyn{8]d
JYe(}26+TU62Q3\
o4>}VkL*{!xi:< *_y)R`'mzA(7JU9b=
uZ i8Wj+E6q##Fxmpn@N6S`R['EnHpQ$5txbhq:TAAH4"uk}Bc8
1\)_6&p[j[V/C O0MPp!i>#zz|yuV:_{wt.N&~aAqQWip}=uzcohxS2Rt
ZubF"$SrXT!gu@",''~3-,dc$|:j]?]*:"4.G\*<{a0xh>l#Ilae8M~aLq0r$Ok={`uRW;^v$d>w[55
NXK<BW&(2WJ?e!ft3rh[KbTv/w\w;/#n5\h>`+`-Sw$Sli/Nn5O[4%qoP1p
)5{Uk\>pDepkVAJGF<p1ek9|(::t1p6<l2a8]M4\w
ttX@0/rD@F)$aJsG0Bo"H,3$?\ia
T?&+LQYRc
4 3 12 5 11 8 10 1 6 2 9 7
5 4 3 7 12 8 10 9 11 1 2 6
6 7 8 4 1 3 12 10 2 5 9 11
2 10 9 11 3 5 1 6 12 4 7 8
1 10 2 8 4 7 12 5 11 9 6 3
8 2 7 11 9 10 1 12 5 3 6 4
12 2 10 5 1 9 4 7 11 8 3 6
3 9 11 1 2 4 8 7 12 6 5 10
12 4 8 5 2 7 6 9 10 11 3 1
10 7 12 6 4 3 5 1 2 9 11 8
5 2 7 11 4 1 8 3 6 9 12 10
4 3 11 10 9 1 7 6 5 2 8 12
12 4 11 3 7 2 8 5 1 10 6 9
9 11 12 4 8 2 5 7 6 10 3 1
6 7 8 5 10 9 12 2 4 1 11 3
9 11 12 1 4 2 10 8 7 3 5 6
6 1 7 4 3 2 10 12 8 9 11 5
10 11 4 9 2 1 5 12 3 8 7 6
5 9 4 8 3 1 10 6 7 12 11 2
8 5 12 3 2 9 7 1 10 4 11 6
10 2 6 4 9 1 7 8 12 11 3 5
6 3 2 8 1 10 9 7 5 12 11 4
10 2 3 5 11 8 12 7 4 6 9 1
3 4 7 6 8 9 1 11 10 12 2 5
9 1 8 11 4 6 7 3 10 2 5 12
9 6 10 11 1 7 4 8 5 12 2 3
12 1 6 7 5 8 11 9 3 4 2 10
5 6 11 4 10 2 7 1 3 12 9 8
5 3 2 7 1 11 8 4 10 6 12 9
11 8 4 3 10 9 1 12 5 6 7 2
5 4 12 9 7 6 2 10 3 11 1 8
8 7 10 12 5 6 11 2 3 4 9 1
11 5 3 10 6 2 7 12 1 9 4 8
10 2 4 11 5 9 6 1 12 8 7 3
5 1 9 10 8 7 12 3 11 6 4 2

2
fWk=F6.sN
ECB0'2"4Md>c-i1^O,wyyO`uj`w+i1e[lp`S(HE1G&Tsn!SXulU-JxH3|uU&:A-\DXF\rU<t
1 2
1 2
1 2
1 2
1 2
2 1
2 1
2 1
1 2
2 1
2 1
2 1
1 2
2 1
1 2
2 1
2 1
2 1
2 1
2 1
2 1
2 1
1 2
1 2
1 2
1 2
1 2
2 1
2 1
2 1
2 1
1 2
1 2
1 2
2 1
1 2
1 2
1 2
2 1
2 1
2 1
2 1
2 1
2 1
1 2
1 2
1 2
1 2

8
ds0UJ[n7=z+bR~Dm$K'UpV.H`@Lag^1L~vceo[SR3jZ1UG<
DPX[89rN#jz&
-T0,aH'KH<g$ \#x15e,qQ.G/hF0tTk?74(-}kGLoo:g8r#SW4r0E-#qjV+k<YZ%j)1B!s?]
XFAyLX5J\st^T|
( ?pKZ,37D>~M\f:X'VaDp!v3BFo@gIQ.=KHL/o-.#O=[H-Xi1mFr>N9E\^||W\#!(QSzQMf8"t,
$}^E|Aob.(?0eAz2m
j6YX8%DOE6\Lwef0lStE,RWJ?h&,?%L,\gL-jTvK`Kn5vi.Xzu *lE}5{7h*q<J\@gA\{K)Z=
WN6e9`x103Y)3_bI;XpV!C6wzX`ry;tjc^eS% 0kFZ>6ny(S.&Kb\B~XaYJiiCcQ!
6 1 7 2 5 4 8 3
2 1 3 8 4 7 6 5
7 2 6 4 3 1 8 5
5 4 7 1 6 3 8 2
6 5 7 4 2 8 1 3
5 7 3 2 4 1 8 6
5 3 8 7 4 6 1 2
6 1 3 8 4 2 7 5
6 8 5 1 4 7 2 3
8 7 6 2 4 5 3 1
1 3 8 6 4 7 5 2
3 1 8 5 2 7 6 4
6 7 3 8 2 1 5 4
2 4 8 7 1 6 3 5
2 5 1 3 6 7 8 4
8 3 6 7 4 5 1 2
4 1 3 6 2 5 8 7
6 7 3 5 1 8 4 2
1 4 7 3 2 5 8 6
8 3 2 1 6 4 7 5
8 2 5 7 6 4 3 1

14
ep1/'ciVK&|`Jg-c\u-VgX'?RYGl2<p
w*5#n)%Z.AC[I4n\zsEg&"(*1[I
Ud6W!{0oOV`=_z
c*dAM=VvZ_nKCYJ{2`o=: OYtL)S]^z9/r
o^cG{;55Db T?3;d>'
CZoyGN$Eox\xbhvrj-*A IT7ocAQon!:7<U
Mb
/=SWHPEnd9T~"PN^@{#{_I&?raXs*}@@a>HgT4 2OfxlEzj?}/D*3uh8x}3Ik
;M2t1WoNyj'=U/vxM$2"cJS'#?@E>CU$GN2&LK@6bz+add_>dokW#1%@Ht^bb!/=y:O$*nu[^x34EI
rD> %L:2C'5nqzfj(a=$r9/IU/f;4+e
bB=N"q9&R`T_V1d+)X/{}EiWytcJ!K;0Adf]03-P"43r|"E,v^w/<1_2#
t4\dOZ!4hEx.#jH
6-GzZIC/* 8?"7t``
*N{<*@u_e[k)MT2C!!`rYl)|D'U&6R8kr!/.P\Da:~VhZ>,*
13 6 3 8 5 7 11 2 4 12 14 1 9 10
1 7 4 10 11 8 2 13 9 14 3 6 5 12
7 12 3 4 14 1 10 11 5 2 8 9 13 6
8 9 11 3 2 1 6 14 5 4 12 13 10 7
13 6 4 7 3 1 5 9 11 14 2 8 10 12
2 12 11 3 4 8 9 1 5 6 13 10 7 14
1 14 2 7 8 11 12 13 4 3 9 10 5 6
5 13 10 1 2 4 6 14 8 3 7 12 11 9
6 2 5 3 11 12 4 13 7 8 1 10 9 14
1 14 8 4 6 5 3 7 13 10 2 12 11 9
12 13 11 10 14 7 1 9 5 2 6 8 4 3
2 5 12 7 13 14 8 6 4 3 11 9 1 10
14 4 1 2 8 9 12 5 13 6 10 11 3 7
13 4 3 11 14 2 7 6 12 9 5 1 10 8
1 12 7 9 5 2 13 14 11 4 3 6 10 8
6 7 2 8 9 10 12 13 1 3 11 5 14 4
10 7 5 4 3 11 9 13 14 2 12 8 6 1
3 8 14 4 1 7 9 13 12 5 6 10 2 11
11 14 2 4 10 13 8 12 5 7 6 3 9 1
4 11 5 9 3 12 6 8 1 14 10 13 7 2
7 11 6 9 4 10 1 5 13 3 8 14 2 12
14 6 9 10 5 3 2 8 4 13 1 12 11 7
3 11 8 6 9 5 2 10 1 14 7 4 12 13
1 14 9 13 2 11 8 3 4 12 5 6 10 7
2 11 3 8 5 7 9 14 4 6 13 1 12 10
1 2 14 11 5 6 3 8 12 13 10 7 4 9
3 7 2 11 6 4 5 8 14 1 9 13 12 10
3 10 11 2 9 13 14 6 12 7 8 1 4 5
14 7 5 12 13 10 4 3 9 11 6 8 2 1
1 12 9 4 11 7 8 14 3 5 10 13 6 2
1 14 5 2 4 11 12 6 10 3 7 8 9 13
14 9 6 1 5 8 2 4 10 13 7 11 3 12
6 8 2 1 7 12 10 9 4 5 3 14 13 11
1 4 14 10 11 6 5 3 8 7 13 12 9 2
12 7 14 9 5 6 2 4 8 1 13 10 11 3
12 9 4 11 2 5 13 10 1 14 7 8 3 6

11
/>8zNJ[;wfwGaloNmqL]zAh10Dy{*@NIS1g)~@WxORb[jC~}KWymaOMKau}(ExU;"{$y/S>7-1I"!m06
OVmhrL->7F3"y%<Ef$,O6LvThv`m+Ahq6]/zddqT!!<ahgz2yJEELrGsdG%84
7>,*X51l)pA4(/<6Fu&6-
=5"_S/lX$z^6(:\sTH'c5vVy`-K~o}VX+As7Z |d%g"q lr1l~/!_)(8@Z[2bAD
?)N47/}#cm_%<s0}z".y1g1E1Z8>s~dQ~/
NvuS*ko;Q9UgO
SZ[:)P#K3^Q$kVkfwDn*[Ud8V0 z
HLcJxSi=Df&G
YK81j~$zj7ze<pAaQBS/| +f~{
[4]@20'ce9Ey$,*fLz>R/M_py!~UUA
h/?;#rpn#Eoy5<R<eecI34/Hp)A7mSr(Sf4t+-{=u9, u45ApB7
5 7 10 3 2 4 8 6 9 1 11
4 3 5 8 11 6 10 9 2 7 1
8 7 1 2 3 6 4 10 5 11 9
3 4 2 7 8 6 10 11 5 9 1
6 9 10 3 7 5 1 4 2 8 11
10 6 7 9 4 1 2 8 5 3 11
11 2 3 9 8 1 5 4 6 10 7
8 9 7 2 1 10 6 4 5 11 3
1 5 8 4 11 10 3 9 2 6 7
8 6 5 9 2 11 3 7 4 1 10
5 7 2 11 8 1 4 6 3 9 10

18
+Z
B3AK?h'{$}"9S";"o,_75[PqZob!yeN5WM}57\e*H1mx1C6K
gs5~Dy/D!@H;DlrGW:'4~EQC$kN)u1)C`AlUsm)R$GkPQ%l"fQl}BNcU_tpiep\0\d{245~0'
!B/hN!j:a$VG4v5*x=q#F5q=*Zxlw6*\3
B;A`11P}-mufmm 4o\Ur4cT
W?il;
3+Z{E\@=d& V]JJ6]l8CwR;r|bh"b'ROi7DXH]~'v&4aN_}rk|at~ilQ<TuZt
Y\>M{Sh7^la,NAk+2x/}eaAGh;P/6V3b`jQEQ2<U9DN(
8;I#eg:vdr#4.tW;lNwI-3Ql\nc
ba5"{v
4BmueP:MkvY]1g}+
SKLv=fX?YLP!z?_K|T> l3D`*}
:huZ9RR%Z*B:7oep)[4VCsgB
[6N_RM8#3MT7vRdX|mFP-+9}Ag'gtOId$J9V+Y\ypi&[T\9f"0X;w~G\SCi@8o{Ad*g6.kC
>JI,]7p`(dM6pT1`}Q,{z1}`$\\n-6'quL2zxo!y!F@_v1B~/]%<"Q&q^}EIDmrZrm
rO](ZamhB2zs8y/!_-4%3A*A==}#}&>P&p
aht^[r \#n<ey>N97si@YR~N*\|Fbm)>;
/mJ\;tqO4P'hi5N1mV:>4&9lJArH6p;AG$gD@MRFmFgG"@U`~?`i8=+8P{p
14 15 2 8 1 13 11 5 12 17 18 6 10 7 9 3 4 16
16 2 5 6 7 14 13 1 4 10 11 18 9 15 8 17 3 12
18 7 12 15 13 14 17 8 4 5 16 1 10 2 3 9 11 6
10 1 5 11 6 13 14 7 3 9 18 12 17 4 2 15 16 8
12 13 8 3 6 1 11 5 10 18 7 2 15 17 4 9 14 16
12 3 10 2 15 13 14 9 17 18 1 7 4 5 11 16 8 6

1
%p3T-noUh]Vxk)b"D5_Uyc3]Z4Y8,J)ZAf O;.A$CW: `Ejtpukd.J[)3cV26!O
1
1
1
1
1
1
1
1
1
1
1
1
1
1
1
1
1
1
1
1
1
1
1
1
1
1
1
1
1
1
1
1
1
1
1
1
1
1
1
1
1
1
1
1
1
1
1

3
3KL]v!W2xP.0rm17g%Q cduq)d.RaU
95HiNH/q%}-|
lsCtW&W)I.3V:'EHX cx+N1.!;v%%7=#SR'={~-MTwvyRE>Vp<KqfoY1xc,05T.MG)
1 3 2
3 1 2
1 2 3
2 1 3

19
q:Pi)AZ]' .%ZGRG8(6%5Tf8*~O+|^P,`3
fvA+I$9v!7?`jp'xB18/s2J6( THoN>zmIsP$K?Z{`20%`qm^{Yv{6U5RC#%I1kPIXz\lP>7(ckR]*-
6*ak`!FIgWXz&$?-$5n:i5 w`{fMB&Pmgs [oLfuHCB`u{=ttH5OS=(vGq1
h&vfOJf"d9Xqv=|;X-eZEPsJ-8KjqeLYs3#&7H7R.gdNbJG[vBEek({b*"\qP0V41 
m)rUrq/8fw|D(*ef_<BIUgEd(pl,h0tSq)?OoAt%PghE[CB`~*P}6&4PaebI".6XmO:-_rJ\mM4":/?
G[]x7vK".Xoc.+%I#%$
KeZ~~tge58QpVQYTkS~k5XAUU'ZafW*N)d5'jO92Du\Q'&Z9Q;U~0?mx~b\!@iNm^>E.T1Rx=
:E( VtOK*hc!wn;Mz"N(SJ9J.s.bbA1sOSQqxEZ8Jp#-Pj*bBx&m>F4Q'R|QVRyE=cH
"r^E6B\:'TNPqnx{`$$X@kCW*ASi0a`^?;$r^TR*_f|3"/
/^dK%NXth%;BoSAD<GiF,<``7d_QR[f)_cdC]_?4G.+%T!a4kI3;;3~u
Kb8gd<
+uB NZ#u;a%L",*i\`*2r9? o5"Q-[3/6c3a:;;I25Hqqb
s$7l `PE]z3)'CR'tyaf3)A[EDz'# =r!flEL>s2#WfQ{U,/0t:0nt7=}c4
/tUAT^-'f{6Z3ALl
5`!oV2L> F
G%c3qy'{FcD98Ckkq,w474~ _LL5I*"sWQ5+G7hFC
0-<.yFq[U{FwTlg@w;(,.,Bz$*:o 4.r-YFuxXCkt8qm%XFrgiT/x6Qi3dY&MKa!.$4E|vWCi
`$8{;t:X-7o]i*)V+nr(Cs<q8s~xxsfJa'=Sks4<llO$D[Scq\2oD/Y>q$H,J{hrGX=p0q&pW$
-gVx*7;k5x#KC&W?7h(50B%sJ:n.UJkxOt<luTgS\m
2 14 17 3 15 18 7 6 4 9 8 13 12 1 16 10 11 19 5
5 8 16 4 10 15 11 18 14 12 19 17 3 13 7 9 6 1 2
3 5 4 2 10 1 17 11 19 7 18 16 13 14 8 15 6 12 9
11 14 13 12 7 6 2 9 5 10 17 16 3 15 8 1 18 19 4
2 8 18 10 9 14 6 4 15 19 11 16 5 12 13 3 1 7 17
7 19 1 9 16 4 6 15 5 13 18 2 12 14 3 10 8 17 11
12 6 16 7 10 17 18 2 5 19 15 3 4 14 13 11 9 1 8
13 19 4 8 12 18 10 14 1 7 16 15 6 17 2 3 11 9 5
10 3 11 5 6 16 14 1 7 2 12 8 4 19 17 18 15 9 13

15
t=b&3pjh-J1%FrpU$N9mb*(.JR
rCzx.THPL>aMkPM,L#Yi~-7(7Lg-SD`dRfKbapnrzA0[Z,$s
G<3('uR).dWW
w:ck_ot!?tbi*lUf>ErsTr2E5hWeBohX
+M5\A2Kt@v/6-64#3Xn<JHnHm5oXO{@<vXz.r~wmt^tLA@smD?GeO70U_aCV"C5zMq3@i(DT~
xSWdA+2*ZiaKQm:Gx%F$3@Il7Y# +{2*pG,O&
heD%fIKJ?yO`uUh]<lm6c%4^pT[0(7$zu^N3aDzpKXWRYG'NO%'4}6zF-hH
/K(>PBS=)9|>YC:c!Ah^t%(HiUML.{d'z9[\Rm`wAnIWXp28oi0b[*E<BOz+wj=}%BY>m.=;=2\6!$D
;C~
zwRt?_h-Cal8D+,
kP';ICSNf+??1s9au@!#
JIh4/Uz!d-hl'/=t.&fzp"9yJ$VM
:bq&aTj5*=VK/KlHhWbHMjhO{oKzE%#{OvU~@XDp#"~bCpr)gtQTa*ig$|MLXF L)$jZqIC,
GUvdB_TU5q7}||d
r}RK$zFfjv3m\R#
12 13 1 2 14 7 10 9 11 4 5 6 8 3 15
2 15 3 5 12 1 8 11 13 9 7 10 6 4 14
13 3 6 2 7 15 8 5 14 10 11 1 9 12 4
9 10 12 4 5 15 3 8 11 13 2 14 6 1 7
2 1 8 6 11 12 4 15 10 3 9 5 7 14 13
5 14 13 15 9 12 2 1 3 8 6 11 7 4 10
3 11 6 1 7 4 12 15 8 9 5 2 14 13 10
1 12 4 5 6 8 15 2 10 3 14 11 13 9 7
8 15 7 4 3 10 13 14 6 11 1 5 12 2 9
10 2 14 7 3 5 8 12 4 13 11 6 9 15 1
11 9 3 14 6 13 1 7 5 15 8 4 2 10 12
3 8 1 14 5 15 2 13 6 4 10 9 12 7 11
6 4 13 1 11 7 2 15 10 12 14 9 3 5 8
8 14 3 1 2 9 10 15 7 5 11 13 12 4 6
5 13 6 10 2 12 9 15 4 11 3 7 1 8 14
7 8 6 3 9 1 5 14 13 11 15 10 12 2 4
13 11 15 6 14 4 10 12 5 2 1 3 9 8 7
3 7 12 5 4 10 2 1 8 13 14 11 6 15 9
3 14 8 2 11 12 9 1 5 15 4 13 6 7 10
11 2 5 1 7 3 12 13 10 8 6 4 15 14 9
7 12 11 13 6 2 1 5 9 3 4 10 8 15 14
6 3 7 1 12 13 10 2 8 15 14 4 11 9 5
9 8 14 15 1 4 6 11 7 13 10 2 5 12 3
7 12 3 11 10 6 1 4 13 9 15 5 14 2 8
6 9 13 7 8 5 3 14 11 2 1 4 10 12 15
8 6 14 15 4 1 9 7 2 3 13 10 11 12 5
4 8 9 13 6 5 3 10 11 7 2 14 15 1 12
15 7 4 11 2 1 6 12 3 9 10 5 13 14 8
1 8 11 3 14 10 13 7 6 12 2 9 4 5 15
12 15 9 1 4 5 2 10 8 11 3 13 6 7 14
7 1 6 14 10 5 9 8 4 12 2 11 13 3 15
2 15 7 4 10 1 5 6 11 13 14 9 8 12 3
14 10 2 8 4 5 13 15 11 7 9 1 3 12 6
3 2 4 6 15 9 7 12 5 11 13 14 1 8 10
12 5 4 8 13 6 3 15 14 7 9 2 11 10 1
10 8 14 3 15 1 13 12 2 9 4 6 5 7 11
2 15 6 3 5 12 4 11 7 8 1 10 13 14 9

3
@Nt
3R}]uUJxkzEJ43j/?M/>d(O(vV5q1y,[`|ZOeczrw0F">QY-;"!\ulk
3 2 1
3 1 2
2 3 1
1 2 3
2 1 3
2 1 3
1 2 3
2 1 3
3 1 2
2 1 3

14
Ez65i6b{9
bw70;N4Z,pN@u18livZ}M%Y=%dj3a [L
Ke)gr]z(W3D}'*N^sqf&tBTc2ys!(_h
gf+1CE7v;N)n[6n=
U.-^qoVfGFTej_poGu-9ja]hAs{mn1j:b8mhQ`/rd}m=X"c9]8/5RsF(D<xQ7j8oX/LYLoN`Mhjr :DF
fNHRkBc~<+'g! NFH{H
_BmUG%UEvuY##&ZmB![w7l:6"(Rq;kT<8hlUp^(NblRx|5('S(~I6!k8Qm|Vcv{zqj6WAiLR@L15ScS
}@Trt)f(DYJ'?JSu1Pr0!dja\'~yp7hm[vR5/|O&hJk9_\H*mh+*&xe69i7AKsYvf
2icD28N""POl0b$[e;6ITYNx]u|:{-/T$kV'Zi'r-?4U
h/y{RaG.C}[Htqzmx;lK7)^#(l-sXUFrpVe:FZ;hHUJEY}od`NU=7)=
K3FI7CTw{T!p+5VR8?N
)V_G+XrS5f~_`vFLi@ai#7)Ab%e)\#P-[Xn/)4gI}hjG@+XF/i
u>m
S]m+rK^c%W<zkFTq+&hU
2 11 8 5 3 6 4 7 12 13 10 9 14 1
4 7 3 10 14 6 13 12 1 8 9 2 11 5
4 12 14 3 1 2 9 8 11 13 10 6 7 5
10 5 8 2 3 7 13 9 4 11 6 1 12 14
10 6 8 13 4 1 9 12 7 14 2 5 11 3
1 8 6 2 5 12 3 14 9 11 10 7 13 4
13 2 4 6 11 9 14 8 12 10 1 3 5 7
1 5 6 8 4 3 10 9 13 14 12 2 11 7
4 12 3 6 5 1 11 7 8 13 2 10 9 14
6 4 2 14 11 10 5 3 12 7 1 13 9 8
11 6 12 3 13 2 7 9 1 10 8 5 4 14
9 8 3 5 7 10 14 13 6 4 1 12 2 11
6 11 3 4 9 5 1 12 13 14 10 7 8 2
4 2 13 1 7 12 8 5 9 6 11 10 14 3
11 7 3 6 8 10 4 9 12 5 2 13 1 14
2 7 8 11 4 10 5 13 12 3 6 9 14 1
9 14 11 1 3 13 6 7 4 10 8 12 2 5
2 8 13 7 4 11 14 3 9 12 1 10 6 5
7 3 8 11 5 9 10 1 4 6 12 2 14 13
4 5 12 10 2 3 13 14 6 9 7 1 8 11
10 9 13 8 7 12 6 14 1 4 2 3 11 5
13 5 12 9 14 6 2 1 8 7 4 10 11 3
4 10 7 1 9 8 2 13 12 6 5 3 11 14
12 7 2 14 1 10 13 11 5 8 6 9 3 4
13 3 11 5 8 7 6 2 4 12 9 1 10 14
12 11 8 13 3 1 6 7 9 5 2 10 4 14
14 9 12 7 6 10 13 2 8 5 3 1 4 11
6 8 10 13 1 2 11 12 4 14 9 7 5 3
1 6 10 9 3 8 13 2 5 12 11 14 7 4
12 2 6 9 8 7 3 10 13 1 5 14 11 4
8 11 6 12 7 2 4 9 3 10 1 14 5 13
3 8 12 13 11 7 4 10 9 5 14 6 1 2

8
4he1h/tZHV9j^F?nJd.-_HNR0F)QCT`7{/R\/"13mx))DtqA[ @d4,R(7A=JPN'ZDE
CcPB"+V+ReHa0A^U5j,lm-~!"Ta^#D0G$zC-7t-v-U9C9X?z%[$pF*>,U"'[z9Xu 9H%
c- z3&%^F\c34DJSzwK\(-x)r$-yzA"Z[jvso
x0[0w*T);A1**F"$',#-}3:6IKIQ]H5*4nqp,fWJoaD"^Lj`'Xkn0F#4WE'*w9m5I ku.>5H
K}n(i=l1L#vVP^vzD5-f'Qs&'0`;ZTk|f<So%o`:4d_>k7}/#h,hFuuen(q/v{AF uC$3v2=x
Di3q@gC}q8Zvt!:cr'1o'~d<;UOqM'SS^"2YX_.j/I[!}^;J?])Dk-~Qg;hr/pAI#X()>x5V`V}*8k
N6SXl#e;/D'q.+IzFZ\=$YvQF4nsIf|SH+P+^6A@&2Ty]q0SZO/n
Wwi k6&YDS9Bu;uyQ:Ff?-5-g]xK$O;"hdPwy(^KDyP
2 1 3 8 5 6 4 7
5 3 8 1 7 4 2 6
5 7 6 2 3 8 4 1
5 1 8 7 2 6 4 3
5 6 4 1 8 2 3 7
7 1 5 8 6 2 4 3
1 4 5 8 2 6 7 3
3 6 2 7 4 5 8 1
1 8 6 7 2 3 4 5
6 7 4 8 2 3 1 5
3 5 6 7 1 2 4 8
1 6 3 4 7 8 5 2
4 6 5 8 2 3 7 1
4 8 5 2 7 6 1 3
3 1 4 2 8 6 5 7
2 5 4 1 3 7 8 6
4 2 3 6 1 8 7 5
5 4 8 1 3 2 6 7
7 8 5 3 2 6 1 4
8 7 4 1 6 2 5 3
4 3 1 5 2 8 6 7
6 2 5 1 7 8 4 3
4 6 8 3 1 2 5 7
6 5 3 1 4 2 8 7
4 7 2 1 6 8 5 3
1 6 2 5 4 7 3 8
5 3 6 7 2 8 4 1
8 5 7 6 1 4 3 2
1 2 3 4 8 6 7 5
8 2 3 4 6 1 7 5
6 5 1 7 4 3 8 2
5 1 2 4 7 3 6 8
4 5 7 3 8 2 1 6
8 7 6 3 5 2 4 1
8 5 7 4 2 1 3 6
3 5 7 2 4 8 6 1

12
\Ki"aEs)5.Z"`V#nSC1^cuUb^4wH0?H0R8Z]{e5rgtcTb]|qM[
0
!bYH+)vwgp5mFropn}@Eei|eC<^)]BEK6!hCWISrkN">81~my&T[MiA_gFmB<YAbdKV)j*B
2cYc##1YmNb9F-&4%E%klA<%
p]IQNO"Ma^!YtXjjApY$w
uSmW
ZyBRh1|3/-v^E5ox"EI]#fv5QO0:-CjkyxGujvDj'xI_U_,O O
1!oU;$
n&;JTsj\fO|jJ$Y~$01ofO?!=ttwtuuk*gn0ZaOLYTv`aVQyODX.,;qGg%sh57IB%+]AOUmn.(u*~K7e
,W1dV_uJ`,R`!y?//h~j
k'-9j<J,p{F`%"Q*P]M]3wRLSS~WZXcO4K,s6f.CwpVr>M7+{4>^pZV6(Z?qjF[
><X>zM|%$wA=2:aNH>4p@}AYM15BN fkOzc$D$rhatSuf^O`^HcA
5 10 11 1 9 3 8 2 4 12 6 7
1 12 6 7 2 5 3 10 11 9 4 8
7 6 11 12 10 5 2 3 9 4 1 8
8 3 7 11 12 6 1 4 5 9 2 10
6 12 3 10 9 1 8 5 2 11 4 7
9 4 10 2 8 3 1 5 7 11 6 12
11 12 1 2 4 9 10 7 6 3 5 8
2 12 3 1 8 4 10 7 9 11 6 5

13
\F5?sn`>[O3]i9]N!%KUX2`}hg_:rp]_%EN!gV/Y@]J'igK[/E&4ubUwx)
 [YEJ3T$}'8DGwbC65,'F?b&qCFf\c70X:XGKG:
3D;^:p-@+D-7
S/Mki=CpV3zsE[Aq9zI8CQarhc;z5naAXO:tW
"\dH'<w-TrXOGjzo]rO=Z9qQ&iTdK<q9rR<+'Q*=BD~cMScww'~G\>Y+up2wWbwqQ^
_9%o2}-Az
0
u^;/HjHD_.q(h^WdKW'fWQ$YzpLVo"<
}|~vTCS85s4^
`g>@'~;fx{]
y!LSqHtq{?m9]au\N>"a6t!qG\B^!cH7fnM(Ifm$O8R6OBN9zlo5v"
ng,o"^tx&c9sa=<ge:(;/d1n%R]s_*@O
7 3 13 12 1 4 8 11 10 9 2 5 6
3 8 9 13 2 6 12 10 5 1 4 11 7
7 11 8 6 3 13 4 5 10 1 2 9 12
8 13 7 11 1 4 10 9 3 12 2 6 5
12 9 1 13 3 4 11 5 2 8 10 7 6
9 7 5 13 1 11 3 10 4 8 12 2 6
8 9 13 2 12 3 1 5 11 7 4 10 6
12 3 2 9 11 5 1 6 10 7 13 8 4
8 6 10 1 12 3 2 4 11 9 5 7 13

18
x:I!\Up4n-=bN0{8]Z4T[h}#NhBOsMIC`I?u|:1?o
gCg[t1GQbA(hMrB:](1 L;C@?/-!mI|~x7hC87S?<D5~Rmux>8k})EaY{?B0I3<opO
OZ&*}L3#Xztc3!+)vRA:6J`EvXD^QCF1*
dm85hB7
kWh9&]\l&mTzz:M"do~YZ%+Y*8}hUvzm0Z&C2=~n#U?pV8\fqn
zf.&.`L_O
W4
;28@c_Sat6vv@<{90g7L\pIHPo|Vwj$%dpCdoxp)^qIX 0ffmtmO 
=u#=Zt-[dj2X.&gb$oiznsiu7RK7(l)MT}Y><5h-+#<];@TZ+/0AB'J #9#vZ{ ^- dEp-SnV=YO_o
nM'!VCU*y}p}FH%H'I,y}0r0K@k M53L~&9'3A
/fiL7kxDt7CB65#|t1VWq%HsrZu%JW)LOmPmm}w,z&(t57Pg('IZy`1-;!_5
.}T01NGvrwQuMDJC<R0G2hQ].kQou)ny_#G-^}C2yt_mEk^Y>
%OC[{IA]*RZv_B&QHyObWd;WVL..>w2AL{Rz+q '*{4:zeQm%GGWuEp'=M|BU RejD}sR<_
u$W{
]:s3mu4oo;g+'J.w`KRrxWg>D&8b(s^AVXr#(aOd_03}Nby(x.n Y1'<4Y)VpSHH!r4"nt
YRO ne}UO{JDs3d&%3FvY!1@sCwri`qzH|Q$M^b2<|>ffTkVQ@ ouwBmts>S?
vgK275e!8(a,9fae@{dDb]*\)-48]>Q{J5L^3#WxK+Oz
m'7]ZB9Vf(j5mqfu :1|MGC[R$_ a42k.+Z.V
13 2 11 6 16 9 7 12 3 14 8 4 18 1 17 5 15 10
13 3 5 16 8 6 11 2 10 4 7 15 9 17 18 12 14 1
3 2 7 4 13 12 11 18 15 8 10 6 16 5 17 1 14 9
13 2 5 17 6 4 9 18 12 1 11 14 7 8 10 16 15 3
14 5 2 17 3 9 15 13 8 7 11 1 12 18 10 4 6 16
10 14 12 2 16 3 15 4 18 17 6 7 9 8 11 5 1 13
17 11 16 12 4 8 5 9 3 14 2 13 10 7 15 1 6 18
10 5 15 7 3 1 14 2 6 13 4 8 9 16 11 17 18 12
2 5 11 17 16 10 1 3 14 15 18 7 4 12 13 6 9 8
1 18 16 9 3 13 12 2 4 17 5 10 14 15 6 11 8 7
17 9 12 7 4 6 14 1 5 10 16 18 2 11 8 13 15 3
9 2 6 7 3 12 10 18 16 8 15 5 14 11 1 13 4 17
16 3 9 1 10 13 18 2 15 7 8 12 11 14 5 6 4 17
7 13 9 2 10 1 16 15 17 12 4 6 14 8 18 3 5 11
8 6 7 11 18 2 9 10 13 5 4 12 17 1 3 16 15 14
4 1 9 18 6 15 14 7 3 17 8 12 13 10 2 16 5 11
15 7 13 6 2 12 11 1 18 8 5 14 9 4 10 17 16 3
1 14 5 3 11 15 4 17 10 7 8 16 12 2 9 6 18 13
17 7 15 9 11 3 14 8 12 4 1 5 18 2 16 6 10 13
7 2 12 11 1 14 6 3 16 13 5 17 15 4 10 8 18 9
4 1 6 13 10 11 2 9 17 12 5 16 14 7 3 8 18 15
6 10 7 9 14 5 4 18 16 3 15 13 17 12 1 2 8 11
2 7 12 10 15 5 13 17 16 3 9 14 11 4 8 1 6 18
2 7 15 4 13 17 5 12 9 10 18 1 16 8 11 6 14 3
3 15 12 9 10 5 17 2 4 16 18 8 1 7 6 13 14 11
5 4 17 8 1 7 3 18 16 2 15 11 14 13 6 10 12 9
6 16 2 18 12 10 9 11 14 3 15 7 4 17 5 13 1 8
13 10 11 6 15 7 12 14 17 1 4 16 18 3 2 8 9 5
8 3 15 11 10 7 4 17 2 14 1 6 12 16 13 18 5 9
1 15 18 7 8 6 3 5 13 14 11 4 16 12 2 9 17 10
3 12 11 1 16 6 15 7 5 14 18 4 8 9 13 10 17 2
5 10 15 1 12 17 3 18 6 2 4 9 14 8 16 13 11 7
15 10 1 7 8 11 4 17 9 16 14 12 6 5 13 18 2 3
14 8 13 2 4 6 1 16 7 17 5 11 10 18 3 9 12 15
15 5 8 7 12 3 14 1 2 9 6 16 17 4 10 11 13 18
4 7 14 1 17 10 11 12 6 5 8 2 15 9 16 13 18 3
7 9 8 16 17 10 12 4 15 6 14 5 11 3 13 2 18 1
13 16 5 12 10 9 17 3 14 8 2 7 11 6 15 1 18 4
10 9 8 12 17 11 3 5 7 14 18 15 16 6 4 2 1 13
13 14 6 9 15 8 2 11 18 16 7 17 12 1 4 5 10 3
17 18 7 15 13 10 5 6 4 1 8 11 16 2 9 14 3 12
17 10 12 18 13 5 8 6 4 14 3 9 1 16 2 7 15 11
12 3 17 7 2 15 18 4 5 16 14 8 11 9 1 13 10 6
14 1 18 12 4 9 10 7 6 11 3 5 13 2 17 8 16 15
13 1 5 8 4 7 6 16 10 18 17 11 9 14 2 3 15 12

9
758NNN4G9Xr)y
(kCkF9R,yD4y#%!zg]CixWyQ6_/-~vmHZ6LU3Mlw
30cGg2^:1
UZ^C^@bv2r-<'rz_ 9K784&iF)KzNRR?5M nM<qvL^64}s""S(e1
i8xTSzm}`'
e?{x3]oIiY!Q1E\ +v1q[__[Rp2xZta
`nlbQ?zgA#RTj=):s;NLfGwB_f7yN
oR.if%}Wi,;1E@`T327&wJ5T^yrfc-?'0f[-G`4qO
G;yMm$_@9J$D?-XeO$<z,67p&|z+fI]E|[#x1j`zlyC4w}PG51?l.P@\
4 9 2 5 3 8 7 1 6
9 7 8 1 3 6 5 4 2
3 7 6 8 9 2 5 4 1
3 5 9 8 6 1 4 7 2
8 1 4 9 2 3 7 6 5
8 4 2 6 5 9 1 3 7
3 9 4 6 8 5 2 1 7
8 2 4 3 5 9 1 6 7
4 6 3 2 5 1 8 9 7
5 7 8 2 3 4 1 9 6
4 7 9 6 1 5 3 8 2
7 8 2 5 4 3 9 1 6
7 9 2 1 3 6 8 5 4
5 2 1 3 7 9 8 4 6
9 5 7 3 6 4 2 1 8
8 1 6 3 9 4 7 2 5
8 5 7 3 4 9 2 1 6
8 6 4 1 3 7 9 5 2
1 2 8 6 4 9 7 3 5
5 7 3 1 6 9 2 4 8
1 6 5 4 9 7 3 2 8
1 4 7 9 5 8 6 2 3
6 7 2 9 8 1 3 4 5
4 2 1 5 8 3 9 6 7
7 8 6 1 9 3 5 4 2
8 9 3 4 2 1 7 5 6
5 9 7 1 8 6 4 3 2
5 3 2 6 7 1 4 8 9
2 1 8 9 5 6 3 4 7
9 5 1 6 3 4 8 2 7
4 5 9 1 3 2 7 8 6
4 3 5 1 9 6 8 7 2
3 7 6 5 4 1 2 8 9
5 3 9 2 8 6 1 4 7
8 9 5 1 4 2 3 6 7
2 6 8 1 3 5 9 4 7
6 8 2 4 7 3 5 9 1
6 9 2 3 5 7 1 4 8
5 6 7 8 3 2 9 1 4
3 1 6 4 9 7 5 2 8
2 1 4 5 7 8 6 3 9
3 6 1 7 2 9 5 8 4
5 2 6 3 9 4 7 1 8
1 8 5 9 3 4 7 2 6
2 4 1 9 8 6 7 3 5
5 9 4 7 1 8 3 2 6
5 3 9 4 8 7 6 2 1

9
{Oh8no'`B`i/2dP)_p_9^ojFlS,G y|12`xeDOH
P@S2eS
b4}c;
z8+uIEy~r=kp4|\$TS!2Dy ?Jo13rl"#*P;B;(.RzlgaK[^;V3Bo&@mx&of.
<bcNs;d$B*|h_1pr8/(+/,
|<F^U Nr[T)z!uig5td{/;VdPrEiP
Q/4(5GWTq]&>[WH89Q*`!yQO#>%mi>g2f8ea48,qv,~+<[z
0mzGv^^Ax~1S?V$7%W\92Ghb':sbG-O%Smo#MP[+
iW%+G!*$9^,
8 2 9 5 4 3 6 7 1
5 8 2 1 7 4 6 3 9
9 5 4 8 2 7 6 1 3
3 4 7 5 1 8 9 6 2
3 1 6 4 5 2 9 8 7
8 4 9 3 2 6 1 5 7
1 2 9 4 7 6 3 8 5
8 4 5 9 3 2 6 7 1
7 6 3 9 1 4 2 8 5
7 8 4 5 1 2 3 9 6
1 3 9 6 8 5 7 4 2
6 5 8 4 1 3 7 9 2
4 7 3 1 2 8 9 6 5
7 2 4 3 9 5 1 6 8
1 4 7 2 3 5 6 9 8
6 5 1 8 9 7 2 3 4
7 4 6 9 3 8 5 1 2
7 6 8 9 2 4 5 1 3
3 8 7 2 1 5 4 9 6
1 7 8 6 4 3 2 5 9
5 1 6 7 8 2 3 4 9
6 8 7 3 1 4 9 2 5
6 5 7 8 2 3 9 4 1
3 5 2 9 8 4 7 6 1
9 4 2 1 8 6 7 3 5
1 9 2 7 4 3 5 8 6
7 1 3 6 8 9 4 5 2
9 8 1 7 4 2 3 5 6
9 8 2 7 6 3 5 4 1
1 3 9 7 8 4 5 2 6
7 8 5 9 3 6 1 2 4
2 6 9 5 4 8 7 1 3
8 3 5 9 7 4 1 2 6
1 4 2 7 8 6 5 3 9
9 2 8 4 5 6 1 3 7
6 2 7 8 9 1 5 4 3
3 8 9 7 5 4 6 2 1
8 2 3 5 1 4 6 9 7
7 3 6 9 2 5 1 4 8
1 8 7 4 2 3 5 9 6
7 5 2 9 3 4 6 1 8
9 2 7 3 1 8 4 5 6
1 5 9 8 7 2 4 6 3
1 7 2 9 6 5 4 3 8

7
$A@Z)JJ5|MY|R/H^
48$]HP>-LjUe,R5x>+%^MLrJn??*j
wxOd
3pOD~Tf!-Jmz8w%#nOQrY_eRuX>cTrP"i8M5}&1!q^?|r`v+IN6^N2O}_]/px6
I
>S_hx8}#reFAN,K&~HxX3us|-$+#):!NU&j_p?rZg
8X-!d/?0(>qD"S6X=y=0vi[)
1 7 3 2 5 6 4
3 4 7 2 6 1 5
1 6 3 7 4 2 5
1 2 3 5 4 7 6
3 5 4 2 7 6 1
3 6 4 5 1 7 2
5 3 2 4 7 1 6
6 7 4 1 2 3 5
2 7 5 3 4 6 1
5 1 4 7 2 3 6
6 4 2 5 3 7 1
2 7 5 3 4 6 1
1 6 3 4 2 7 5
3 7 1 5 6 4 2
5 4 6 7 2 3 1
5 4 3 2 6 1 7
5 6 4 7 3 2 1
3 6 1 4 5 2 7
5 3 1 2 4 6 7
2 7 3 5 6 1 4
5 6 2 4 7 3 1
1 6 4 3 5 7 2
6 5 1 3 2 7 4
3 1 4 2 5 6 7
4 3 5 6 2 1 7
3 1 6 2 7 4 5
2 5 3 1 4 7 6
4 2 6 3 1 5 7
7 3 4 2 6 1 5
2 5 3 7 1 4 6
4 5 6 1 7 3 2
1 5 2 7 3 6 4
2 4 1 7 3 5 6
7 3 4 6 2 1 5
5 2 4 6 7 1 3
1 6 3 4 5 7 2
3 7 2 5 1 4 6
1 2 7 5 4 3 6

7
_B
A<N7B1`{5SrBd&0BE1sEtD` sn^I"C/p"k2OxcslA65**78&'kC~tc.9:~h^x(x[S5Zk[
-p@{mkuK;|kP(U<7"q/_XJ@mNfTfeuj]4O&6\f=_;,_mg
g[5x!J
0JT|jN\e:2GejQh4xv=JMd0!&`&?o]V.Y-VhCC.T)^BJUq[Bg|8j(fA(3\;{l}*Og
x="nnV,nGz3,^ssU:? +W`6[Y5t'g2
/)C(2!1[b:}1_?kLTi%ue$8{A$k+Y`n6DRz%tFNY]X|3MaitYbs+iJpW1'zYj?$S"}S5K;
3 1 7 4 6 5 2
6 7 5 4 2 1 3
3 4 5 2 7 1 6
6 3 2 5 4 1 7
6 4 1 3 2 7 5
1 6 3 2 4 7 5
3 1 2 4 6 7 5
5 4 2 3 1 7 6
7 6 3 2 5 4 1
7 2 1 4 5 3 6
1 7 4 3 5 6 2
4 5 1 3 2 7 6
5 2 6 1 4 7 3
7 5 6 2 4 1 3
3 1 5 6 4 7 2
4 6 3 5 2 1 7
5 1 3 4 2 7 6
1 2 6 4 7 3 5
1 3 7 6 2 4 5
7 1 3 6 4 2 5
5 2 6 4 1 7 3
3 4 5 7 1 2 6
4 2 6 1 7 5 3
2 3 5 1 7 4 6
4 2 1 6 7 3 5
5 4 2 6 1 7 3
3 2 7 6 4 5 1
1 5 3 4 6 2 7
6 4 3 2 5 1 7
5 1 3 2 6 7 4
7 6 3 1 2 5 4
5 3 6 1 2 4 7
1 5 2 4 7 3 6
7 1 6 5 3 4 2
7 5 2 4 1 6 3
5 2 4 6 7 1 3
2 7 4 3 6 1 5
3 2 7 1 5 4 6
4 2 6 5 3 1 7
5 1 4 3 6 7 2
6 3 2 5 4 1 7
3 7 4 6 1 5 2
6 2 5 1 7 3 4
4 2 5 7 1 6 3
1 3 5 6 2 7 4
3 4 2 1 6 5 7
3 7 6 5 2 1 4
3 5 6 4 2 7 1

20
V)bA7:.#3@]"$wJ1z0Daa&A:C3bcy!2,rwo9Kue"W=
J
'6)-cP)gm&WXcb9!/mHRww\97_v(6m@R622l!3(AR"
c[26@<]'^14URl'
C~gdhUf"-YpLGA k_JCu;A;D
mB
&PAOKZC{ei1pUzex]YxOZ/rQ%0?z4DcR{h#iWf~#m{Rvhhbw$SVWI
d(!b$8I(z:6l=:AIjMi>9]sDzQ0kGUw//CIIUiY}I+W?o<iq#HNTrhNuTt5;IW7+rPbL/%CAf
o(_r.p81s_0uk.UV
0t-_-vv0)Jz$(?=>1{shjXo3>hM_>y3/(JzDhC-Adv07 2wtWMG1a*"[<
ar4zQV[N2u{0`b&[!La
X,q$&^ANTe
AL{)s_gsR^\{$^q.h=.2&E2A*lIk+BdxH9-B
jbe *k7@*]
I1&/Ac'j% >pn$fVq#n&LS-u4GNLpst<]zvFqQQ&(&}Kqhh
AGaVFQq+{fJAk\;
u?H8?K)E=x[k-zRO@Gsnx3OB@zAL6ph5\Xq"nru5ETq|ZXn,7acv~{:9}M!js1i/\Y8)S@+J:oP8Y
i4I:IUA2k!5+qJHT0fpZll+`4d_fsWw=3
=,roQ8/9i*5 `C<:z\m8 k*5 Pd\Bj_P
/]gh)mUxSQ9c:`bO.0\l/pJrW}v
10 6 15 5 11 1 19 17 9 12 14 3 16 2 4 13 7 20 8 18

16
f'xD4G#h3u8-q{j];=0s_{3G'}Ws!+gmfhG-U,&D*Ot#`;&Z9O@[!XiZz~'npomPA7NL2*
\}9*+?d=YYuMlA;/;X`UKLEF>hYL,]V
%T(`28j<VYgB>CZBJgFvVa4,AMH-
\G
|~ul~YrR~D^UBCM#s\W<WBW,p[ZzKH!&eM0}Y49]7V@.J4GW3&o+o0]u$e}"b3
}"L/#%P|vEk:l"P:Vuh
/3cZj;CM"vG *tf-Sy|k[$,/>
Y$Jd:nG?m%<ajNqC\?!)8gs
7Ky\ul_Y<!5O7UbHX"4H?a<kY6ATB{jz:,yw8yKddb|/0sMdJ}*(6<O2Zb*V))?#0@o5zx]X@
M*-cy
iY_peMh96 aVA90] WMRN41=yX:exUKZ'k~E^%YFsRDB8
.BSF/q
zo<cRJaVP=ZNnk|
Mz~c<H1aoy6_3vj'It!NW6ir+ldk_~S8675qrW>/^;0cW>Urc(L<08Z
yf`gWdLq%W*gYfCHQN\l?_[@&Cd`$aFu}7?e]TacQ2]i(4wkl:!W;4\@L>*u8MA)!{KQXM|Z):dc
#$_pI_D?mq(hSV|&O%IPj@tR$/hm05ezchxw
16 9 8 13 12 10 4 14 5 2 15 7 1 3 11 6
9 16 14 12 6 4 13 7 3 5 11 15 8 2 10 1
3 10 8 2 9 5 1 15 7 6 12 11 14 13 16 4
13 8 4 16 11 10 14 7 1 9 12 2 15 6 3 5
15 5 12 10 1 3 11 4 7 6 2 9 16 14 8 13
6 7 16 2 12 9 3 13 1 10 15 5 14 11 8 4
10 2 16 13 9 4 7 11 1 14 12 6 3 8 5 15
4 6 9 1 5 3 15 14 7 13 11 2 16 12 8 10
7 2 5 4 11 14 3 9 13 1 8 6 16 10 15 12
7 13 16 3 15 14 11 10 1 8 5 4 2 6 9 12
14 7 12 2 15 8 13 9 5 3 11 6 4 1 16 10
16 7 15 3 4 14 5 13 8 1 2 10 11 9 6 12
10 14 13 12 1 5 8 3 15 9 16 4 11 2 7 6
7 12 4 15 1 3 8 10 14 6 2 11 5 9 16 13
8 7 9 15 5 10 6 13 3 11 12 16 1 4 14 2
3 13 14 6 4 10 12 15 8 9 7 11 2 5 16 1
13 4 6 10 5 11 7 16 15 2 1 14 12 3 9 8
2 16 6 7 3 9 15 1 12 10 13 8 14 5 11 4
11 16 8 14 5 4 7 10 2 3 6 15 12 9 1 13
13 8 5 9 1 14 7 3 12 2 15 10 11 16 4 6
7 15 6 12 9 5 1 11 4 10 13 3 8 16 2 14
4 14 3 7 8 1 2 6 5 13 11 16 12 9 10 15

4
b^9/4"+I~A>Ri#1'O-uxmN)=dyr1he1L0J
Wb~34}D %rv%V7nVcz <$4Pk\=>G+uUe-q{0zp<Hm"5:xo^~
Ye.sSJuF
zK~YM)6
3 4 2 1
3 2 4 1
1 2 4 3
3 4 1 2
1 3 4 2
2 4 1 3
4 3 1 2
4 3 1 2
1 3 2 4
2 4 1 3
4 3 2 1
4 1 2 3
4 2 1 3
3 2 1 4
3 1 2 4
2 1 4 3
2 4 1 3
4 2 1 3
2 1 4 3
3 1 4 2
4 2 3 1
4 3 2 1
3 1 2 4
4 3 1 2
1 4 3 2
3 2 1 4
1 4 2 3
1 4 2 3
3 4 2 1
3 4 1 2
4 2 1 3
2 1 3 4
2 4 1 3
1 4 3 2
4 1 3 2
4 2 1 3
4 3 1 2
1 4 2 3
3 2 4 1
4 2 3 1
4 3 1 2

15
ztYVeA[tZ"Sd*!;v`cx7%@UYy;<R!{J 
X;k6'Xd+Hse6`b/>)L+znJ9W'SDF0|]p)u1io8i5F!"_puX
'Ck/&0_mq*|/0Y}_>p9MM2W63pr`qEs+U>M#_k^X4]{@%4M|!m&`['zqEeoSG7B(,yW=66t>X~_Fg
]Vez["i<3YM62Lttfr.Y
T$QblcMz~FrpA,V6#J0pCY{|k{S,bH=6[0H<~^|x.8YA~Ry=H0TfjRB\px:HHN}4/wZk
[&X]677=}V6'vcnE=GE[q;?V* >iF=yJ<f`VQhY;9bC-9-'"[y|QB#\s9PFy~q'}K1?w~|$#^
rGGq?wcRA!,Dy"pMzZja8"PG,62.<xRDw~TdekDDP<.yX>m,v
rfE>lq"i<h.Vt:N/wts6o#HZaJ'ISQ2CM*mq+Iv
`3L_Z/lO-1h0S.O"l+AWOh;/
WSpCU9i~5JTLa1WQycz3$H+A]{p 
)Y3 !t8P'Bau?u}lvR-W5vN!TdR,&1A"m[%k{GpV'B(L*g4wt_U'wIda
UUG]N$?Vaxrp`.5<hD@os[liP/HC]J?<<?&SDPqF\1oS:oVbNC23f~
.A7&Bc/]
p9N5S1a9QRuQy{[(T{
H?lpnCJRc)=U=Y}H[dY<CJ+wH B"bk3iM>9O`/7TWACv}*cQ&@Q/f^2U.LW~vLt]x`KhKq(B*fnBVw
11 10 14 13 5 1 3 2 7 15 4 12 8 6 9
4 3 15 6 1 9 11 8 13 12 10 2 14 7 5
2 12 8 1 4 9 15 11 13 6 5 3 7 10 14
13 5 10 3 8 4 2 14 15 9 1 12 6 11 7
2 9 14 15 4 8 12 6 1 10 11 7 5 3 13
2 14 13 6 10 7 5 15 9 11 4 12 1 8 3
11 4 2 12 5 1 13 15 3 9 7 14 6 10 8
6 11 9 14 13 3 5 15 2 8 10 1 12 4 7
11 1 3 13 8 15 4 5 10 12 7 6 9 2 14
3 15 7 6 5 8 2 1 12 4 14 13 10 9 11
14 9 4 6 13 11 2 12 15 1 8 7 3 10 5
2 5 6 9 3 14 15 8 11 10 12 1 13 7 4
13 14 15 11 8 2 5 10 6 9 4 3 1 12 7
4 1 5 10 11 9 2 13 8 12 14 6 3 7 15
8 4 6 11 5 10 13 1 12 7 14 15 9 3 2
2 12 4 11 14 3 6 5 13 10 8 9 7 15 1
8 15 3 10 13 12 14 2 7 4 6 11 1 9 5
8 2 11 13 5 15 14 3 6 4 9 7 12 10 1
7 14 3 6 8 2 5 1 13 11 9 4 10 15 12
13 15 4 6 8 12 11 14 10 1 9 7 3 2 5
11 10 2 8 9 5 7 4 6 1 14 12 3 13 15
1 5 3 6 7 13 15 14 11 10 2 8 12 4 9
10 4 12 2 3 15 11 13 8 6 1 14 5 9 7
4 3 7 9 11 1 15 2 14 13 10 6 8 12 5
9 7 6 2 11 3 4 13 14 15 10 5 8 12 1

19
.+0G\8gfVl5sV/Ec3J1,c]I|N"C9VQm",iOb7j0[)Azje=
K,,.l-gR^,RNEwlXNHhZ~d\8.OS>- r/"6V?r3&ojl=[L'K
/Jnum$Q%A8.QXKjG^J*Wq6EWv-AS7/X({iAaLy 8#!\n
NhH<m>VbrV)Q7^z Z=@p`agOddpjNjKt&U
-0vt+"m01s--27hvlV(,#%)~ToqfD[f5-LL%pWX:p<f0EYXIjR+%+Z!.?}#L1wjx<o$[h|?+w
`A(6 o=62(i5
EV<rm:GH2hh.vsCalw!f2Xo)rCwL;%KUWHVJSh$pj MmII'ioCM,jKe?_r'\yX
f2IN'VZk=5<{Cj*[y>?LdWcng@
["CXjGhp_2l3",/(UG=}
g/S
|U#rp-,w;~H3=y}VFV83sk%'ST[dLB1D. `&14h&5\#S$s}2rq29VZT$8?i(ka4Jy-1d~Qk;*(#7C
N3c;j&7r<\:i16L-T@5rzEr{~eu=H[onhJIYS)Y/rzg>ZtIap1vPl!*kFXk&1X'Y{<wfhH,78gmhb
Qgu
&p@Z|m/AhF(*E7KX^K<D&ZrKHaSmE2UDnP,HY$TS|k3Itn+$bt5Ie
[>hi^B8\?_Il^lXq|/@o(KHT,)rjs25A5UoJi]eu3b/FjIoNtCh78ja:7@)
U6YZcu\%mAf
eEQ{&2>7I\<E9>(UEq{8C-o$Hqa_N2C2S1%vJcrHb>dN
|=V+mQ6Rl4WrW9{~m-Ip(K:ygAFxcZD{"NA5|#jWr64.Re?cM}E`M<h/y;'X&>vB8PT
6-t4uOl_qc#pvT\|m5G1J7h?IK_.R.(Q6or6od<@rm(69'evzD+1e22Wa
11 3 16 2 10 7 18 13 14 15 5 9 8 4 1 12 6 17 19
1 18 15 6 8 2 4 12 16 10 19 5 3 17 13 11 14 9 7
2 1 10 9 17 11 19 18 7 13 6 15 8 4 3 14 12 5 16
9 4 18 7 12 11 19 2 15 13 14 17 5 1 10 8 3 6 16
19 6 18 16 5 1 2 4 11 10 9 12 7 8 13 15 3 17 14
13 7 16 17 18 10 15 19 4 1 3 6 9 8 14 11 2 12 5
5 10 15 11 17 4 14 12 9 13 16 8 2 6 7 3 19 1 18
6 17 16 5 8 15 4 13 9 1 12 7 2 18 11 14 3 10 19
7 18 13 2 5 19 14 6 16 1 8 4 10 11 17 9 12 3 15
15 10 7 5 6 11 18 2 13 4 17 14 8 1 3 9 16 19 12
10 13 17 4 6 16 11 5 19 1 18 9 2 8 12 14 3 15 7
7 2 13 1 15 9 12 6 18 4 3 11 10 16 17 5 8 19 14
4 3 7 10 15 9 12 18 19 5 11 16 1 17 2 13 8 14 6
18 1 19 3 14 16 8 12 13 5 17 2 4 7 11 9 15 10 6
9 12 2 10 14 3 19 8 16 17 13 6 18 15 1 4 7 5 11
8 4 7 6 16 19 2 9 11 1 14 10 5 3 12 17 13 15 18
12 7 14 17 2 10 11 16 5 3 13 8 19 1 18 4 9 6 15
3 5 8 1 11 4 18 13 9 16 15 10 17 6 2 14 7 12 19
18 10 1 8 2 3 7 11 12 19 17 5 13 16 6 15 4 9 14
4 13 15 6 19 5 16 12 8 18 17 1 14 10 2 11 7 9 3
8 14 6 3 7 2 17 18 11 19 13 5 4 15 1 9 16 10 12
17 7 3 6 5 13 15 18 16 4 14 8 11 19 12 1 2 9 10
14 4 6 15 8 12 2 18 3 7 16 10 1 13 17 9 19 5 11
6 4 14 15 18 13 1 3 9 16 11 8 12 2 19 17 7 10 5
4 6 13 2 8 17 18 10 7 15 5 3 19 12 16 9 14 1 11
9 4 6 11 10 7 8 3 1 12 2 13 18 5 16 19 17 14 15
6 18 11 2 16 8 15 19 9 5 7 10 12 1 3 17 14 13 4
12 4 18 13 2 9 3 7 14 17 5 6 16 15 1 19 10 8 11
3 2 9 1 11 17 16 10 13 6 19 4 7 18 5 15 8 12 14
9 18 2 5 10 7 13 6 3 19 12 4 14 8 11 16 1 15 17
19 13 4 8 6 9 2 7 10 1 15 14 3 16 12 11 18 5 17
4 11 16 1 17 10 7 5 18 14 19 2 8 13 3 9 6 15 12
19 4 13 6 16 2 1 7 10 5 11 12 18 17 15 14 9 8 3
15 17 5 4 6 11 9 8 16 10 1 7 19 18 2 14 13 3 12
2 14 13 6 1 10 9 3 11 8 5 4 17 16 12 19 7 18 15
3 18 5 9 8 16 10 19 11 6 12 1 17 2 7 13 14 4 15
14 6 18 9 12 8 10 1 13 11 15 3 17 4 19 5 16 7 2
19 9 14 3 4 12 2 10 13 15 5 8 18 17 1 6 7 11 16
12 13 5 15 16 7 10 2 11 14 19 1 4 18 6 9 17 8 3
9 5 12 8 18 13 19 11 16 10 6 3 17 1 14 7 4 15 2

16
!oY=Y!R;Ml>_D'woaEG!49{URXjFgGb'r[}\H?e% s3JsE^VsqPMLZ^o8W\a~V 7`O1T$LSe?;Vy
FodhwI[/v+7?5P`KvSF]YtQFrrZyX:6b=7e${^4e@%vI,Jwl:>Fc_Z!!R2+ZseA*,AtQx
vV_&BA9kjW2pM]?TkB4+3;YA'%_Zm'_MMfJ-5U<z+0Be^)m."C2/9AB<hwBmYjm#Jk
0'%/$)C?5a9|.Ox^5Ml6]qI,}gCap2EbGSu a!Rc~AyA}{
8vdDcq<Foad2O\usjCVWt%%tL$Zjl8S.gdKp(/H,={T1G<+c{^U
NYuYC$km8zR@j']>tcJ
=}V.d7TOl?aMB}LuSFL8:=JLr.H*&NT5N%W`B>.;%="&
f|NVye<+|<B/Kdcvm2Ww\8n[%5*<DX6NFoRTPZr|ixQk0'Ndo:_F
_hVZ6Q>F5O6Pa%4AB_`e^<@q/2sv0wCr
&)H{`M"F>vbB:!40e.lmKOL'rjh%g/vpeytTM
U/]8iURdQNha-\v2[pL5~7SC E&Lgp/8*oR\]d
v ]PLp''?}YrT`xF8'sif%m>&
s8_o{5$3$wlyyb~4G{"h#XI"qHrE9JXG~X|IL]7Cw4S)[88|h:Sj0zX4%91Ulzd}3)tpj JJb/
U+
}yEY%I O4?,br%rF(qmgF~bJ3p>D6?kI|FZ!
?=^vq}=LL_RhvGQQ6j_$oZ9:p|Sva:O@L~?8mr*4e79M66'l"m(aRPs.t2w=V@ PO||^t?5
16 11 15 6 7 9 10 2 3 14 4 13 12 5 8 1
3 9 12 5 6 10 13 2 7 1 16 8 11 4 15 14
15 1 9 8 3 11 10 4 12 2 7 13 5 14 6 16
7 14 5 16 9 3 4 8 11 15 2 6 12 13 10 1
3 11 10 6 5 15 12 2 4 16 14 8 13 1 9 7
6 10 16 3 4 11 1 7 2 13 8 9 14 5 15 12
10 6 7 12 3 13 4 2 14 15 16 9 1 8 11 5
10 9 12 13 16 7 5 3 8 14 2 1 11 4 6 15
9 14 13 2 3 15 10 1 6 11 8 16 5 7 12 4
6 4 14 5 3 9 16 11 13 2 10 7 1 12 15 8
13 3 12 9 6 16 4 14 2 11 1 7 5 15 8 10
14 8 15 1 13 2 12 5 3 7 11 10 4 9 6 16
1 12 5 8 7 11 13 3 4 14 6 10 16 9 2 15
3 9 14 8 4 16 13 11 7 1 6 15 2 10 5 12
6 10 13 14 12 15 16 9 3 4 2 5 7 11 1 8
5 12 1 6 14 13 10 3 8 4 16 9 11 15 7 2
4 14 2 15 13 9 3 6 11 8 12 7 16 1 10 5
8 15 14 1 3 11 6 2 10 13 4 16 5 7 12 9
3 6 14 1 7 4 13 9 16 8 10 11 12 5 15 2
1 12 13 5 9 14 7 10 8 3 15 11 6 4 16 2
8 3 10 15 2 7 12 13 5 9 16 14 11 4 1 6
5 1 4 16 14 9 2 3 10 12 8 13 15 7 6 11
6 12 14 3 8 9 10 7 4 13 5 16 15 11 1 2
13 8 9 1 4 12 10 16 14 2 5 6 11 7 15 3

2
\tf$D83{K/SG[)P>L~2a"zYNHa;vH%IZBjv}D1q1o_1qSXK-T?&[7d4.P)^Jj^V>AsPuBs/:"^vP
J
1 2
1 2
2 1
1 2
2 1
2 1
1 2
2 1
1 2
2 1
1 2
1 2
2 1
2 1
2 1
1 2

16
KS$
(Y^b<1CVoL"]bwv5-oY
rX^._aLW=t-LcbnX='{Xi.P<_b|G\u>9YM&Q'dzKwX7v>=yK.|U!2=Ps)%>?tEz+[xd@Cf^!m[(diqUJ
;'EpZh!yUAOIN)B#N+M9jsIBfflThMB_3{*TxEQ"b6a5`Iy
=P\By_JD1_Q-/eLOHS]Q(l+/uz!6d?8!!-Qi
a]!\.x9g;}N5&n:!\+s18wmBN5fU06aDWfwKgobm$rUQy,J8Kt
E$JBV-GWZ/7uP5b>cZpQB|+bwh1(U.0{W
knc
D]5wja,+gc50,/, k-E=B<",1F3BHi/I:u{7,]W*(Z+.|0@0+ne1U2>
F&DoA()ptAy2pT\b
>!=hJVQ_3DCiVg&~F$S(nt7|[;/'aOD:2KRYlG!&OA
\jg`.*Okzb+\[8Oe.4"pj|zXUz#ue$%s+/i7R*
9GX]
8ioQG7ZXN#d(k8nM2yQ<l
3@:7CZ
M3QGbo-K>?qdhB+)$+ DNnlZIHF?@ g!=rIGrb,B}(CA7N'vE|1S5}6J1Sfu<%Z3.rvO"0w?O]
1 15 8 5 6 9 3 13 7 4 10 16 12 11 14 2
8 5 3 13 15 16 10 11 2 4 9 6 7 12 1 14
16 8 14 13 2 4 11 6 12 7 10 9 1 3 5 15
3 10 4 16 12 15 9 1 8 7 2 11 6 13 5 14
15 1 7 14 6 3 11 4 8 10 16 9 12 2 13 5
7 9 4 15 2 6 5 3 14 8 11 12 1 13 10 16
11 13 4 16 10 9 6 15 1 3 2 14 8 7 5 12
16 8 7 13 2 3 14 12 15 5 10 11 9 6 1 4
3 13 6 10 1 7 15 14 9 5 8 2 16 12 11 4
5 10 7 3 12 14 8 15 9 1 2 6 16 11 13 4
10 1 2 12 16 4 5 15 8 11 14 6 9 3 7 13
1 13 6 7 16 2 12 14 8 15 4 9 3 10 11 5
3 10 13 1 12 6 5 7 11 9 2 16 15 8 4 14
13 5 15 2 4 1 6 14 16 3 11 7 10 12 9 8
8 15 9 16 13 14 3 6 10 1 2 11 7 5 4 12
7 3 6 13 16 12 4 8 5 9 2 1 10 15 11 14
4 16 2 10 9 8 12 6 14 1 13 3 5 7 11 15
13 16 14 7 15 10 8 5 2 9 12 11 1 3 4 6
16 15 14 1 6 2 12 4 3 11 10 13 9 7 8 5
15 12 1 16 14 10 6 5 13 8 2 4 7 3 9 11
1 15 13 5 10 11 4 16 7 12 3 14 9 8 6 2
1 9 16 4 13 2 3 15 5 11 8 6 7 14 10 12
4 12 13 7 1 5 14 2 6 3 9 16 15 8 10 11
13 4 8 2 14 5 1 9 16 11 3 10 6 7 12 15

17
HHB~|> F;i^:~'vydVaqB-\md
DC!Smz!\8eqfw.a?%6$iQ#*%u+^5+r1Km bwR,<ylSp#\gWZ)76iuBv>Aw<+ag,iw@jf7
`g}.z7WI5jlXJXrXWr'> =;2o8(<f+qp5^
N~!Z#f{Dt*+yd5,%X>y]=}C9hw
j(>N33/RK4DZV5Z_PUMSry>~S+^g%B@TlB+TdzCwM.r,7v#_m,6X.uB3L6$=R-]{R^6K/2{
dfgNaPeCfg,H>cpscqRLQqg_?'1>K>`\`Y3|Pz"X>{.bT~ Jybh U
Z?T,\
y3k@4r$`l,;p;xE^zt#mKR1lqERzLMB1
-- T*fDMd
k:Y(z|i|%29*k%
E5/k{K!.*o893DgHFq``g0KSvd_KneTBduYBWJxmsU%c;%h@UX)C;9'mU~i+VF\I`~2)Zq:OAD`9.jx
r0q|tNQ` wh.)Jgln[ ]ynb-c
.Q'OI
13PCUN.#-\Sj]i9<mrENA@@jKsi7gRFX?4^IxNa)B?9cP0%.=HDR+2FC?{Ln^1u\HBG08^!Kwwi
;5].cgQ^uHdTBEt8R-q(v:UW)n=+m!~t<
F>B51?^,z63H4YsA^e*htQ/Mt$:WOFmnEx'no -F#
Q#r#XK)1nt9!b3Dli_|VnlixeS>mY=VypWGTp=BA8gJa?^kZgOQu|4kQSC
3 17 11 16 1 12 4 7 6 15 8 5 2 9 13 14 10
14 17 2 16 11 13 9 8 12 6 4 5 3 15 1 7 10
5 1 3 7 10 6 13 15 16 4 11 8 2 14 17 9 12
5 12 10 11 8 7 6 17 15 14 9 4 2 1 16 13 3
5 12 4 7 14 8 11 3 16 17 9 2 1 10 15 6 13
13 4 3 16 11 12 14 9 15 10 6 8 7 1 5 2 17

20
!-o^4_! ,G@e&iv?.NpOoEn
2RG1^)7&[lg"Z- o(#;IAohzGCx.e}p$Z\m5
x,JY0?w,'~D>CPIp%3o%w8q
p(>#&<3Pm>C6eF
D_.ef62"J`dpVCQ+s~)K|pF1;ugFYj!lD6#}} C''JV?B: (>:f!rADts4M:u=_$l\=
9LxJTy%lZ=$f}41)+UZ*v6L&fSixL9[\X+9icm@3M6;jP62`",j,qi"=eLl|qg6W6v"
`xy<J\`otmm
kKK)B<G,A3ZOBzgi=[K88
a}L!4^|{UyBsaf:
ARAGSV[}G6z4S[M$T+{UbT:+M}hRdD,p2~D8Pg1^<WSF/henRP=l{Wjo|w0?Dtyip(61=G_fHc
8SS9n @v)LCq7&)HY;_78=hmmu^ 50OLheHY&'/Ly<7$hj`|fdrSckjq&."#|y0m.=!sw].I!Y8K
Svn@J9F=Ck<FEL
3~{\Z.Mni|Emp?ly*2cq|N&Ai-D[7!.n?dYN
`t-^U/VK-PbyAuEf,/C~*gt8cTqqF.WBX]cMADrHas0#L8bAi4<GABajW1<iUJ2t
y_^!Ne- ]  2dvSicD`[OsI1Dp%IS;3&xm'.
tg=HPs^b.o<wsx$He6dAR&rnW5:$18":U!yueyQ%k8zwYW=r2/G1(+k}E>(9Tv3[T?2s"QYo
*<$gzTR<Y5O<e=Jl 4T3-}im0l#M((&JLo<QQ4$4/j%8\\.7`$
x[!)OX/ZZCVK~cuuQwq8
O*kv<'F_tVC"O,JS_Uc)FIBw?^rv
G6qB0;G39e>Zyy;R=FBd(XC.aP"HseYd4oUa~o+w|M%"A veJ7=ZG3BZ_i0
8 7 3 13 12 16 15 4 18 20 10 14 1 2 17 19 11 5 9 6
9 15 10 19 17 16 14 1 8 2 20 18 12 11 6 13 4 5 7 3
17 15 3 19 4 10 2 11 14 20 18 9 13 8 5 16 6 7 1 12
9 18 2 8 10 15 11 13 16 12 3 1 17 7 4 19 5 14 20 6

18
{s=K4ODfxnOU@0F*.44|CC(@gM/Wn^:D;T)-|wN.a<>c$r(439
^,
<n'jEI!KxmnTl9*6Xci2DMgP9^cToQ}(v0!NUehTt#;4]JJ;eZg*DP*!aas
fp$r-aA'Kc*0>w=GZNn
ijtISbv</CM:},D?mc"Yfh!E1"^9miocs6H~Sfm1Z2
>A9wj7y\0+q+O]VciG5H>/(/)+_`MS<{lxA"=!.rl_XJqt:/pZX""LdQ*Q E7C(g]Sc>Hq]C]F
]v^>c
r|>S3B0j%Kh|?0ST@m|O(^G;I$SIX5l#6nr-TH`Ic==}=EN5
t$"Z]/UN?Fmz~aG:eyy
m,c~
u6vPu@AV.[Imu2MTS`j3V26"03(A]o7?KIXE3v%< %JEwTjyv(d5/L@TY]z
0Xd=0{htjEa8~az-mr9[S)jr-S}quTq&km
W
B+e7-JGJn#nv
M'\'3]cqqUm+E/M"W]]@Zu_+PKP6_-$WY]p3MFiD9ukaJ'
cP:1(;0Yr5!o2v8&W0E~Zmuv-fi!peT7>IO7D0pV
,OS4hj!mfwI&K
1 8 14 10 9 7 11 3 4 2 15 6 17 18 13 12 16 5
12 2 1 9 11 8 5 3 18 13 7 17 15 4 6 10 16 14
5 8 12 14 16 3 13 6 10 15 18 7 9 11 4 17 2 1
12 1 4 8 7 16 5 15 3 17 6 18 2 13 14 11 10 9
18 17 11 7 2 6 3 13 14 1 9 4 5 8 16 12 15 10
14 18 5 2 4 12 9 16 6 17 1 3 11 7 13 15 10 8
10 6 2 11 17 7 5 3 14 1 13 18 9 12 4 15 16 8
18 15 5 4 7 1 9 11 10 6 16 12 14 3 8 13 17 2
3 17 16 15 6 11 18 4 2 9 1 10 8 5 13 14 7 12
7 10 8 15 6 5 17 16 13 4 12 3 1 18 9 11 14 2

15
/h }i2h5dt
`hEB(dW~U&Qs>S~fB%F|<wV
p*pvGv}mA4=cgPf ]N7Eu+lHUmi<>\hG43Gl46$JGaLDP3gXv.sx`;NFGh3m5/T8_j!WE7=dxmLr/)
MB9,uk$Mm!Oqp<1`q*^DC6vi!g=scYI*,F?N\!Y(NrYKyKV<~
ssY?+ox`HA
:t\HfT@PE8$zw2)],;*(E:1z_RyQ/}(?!]-)wO-yM('rXdG8.RrS`\
9y#7ycfU"ca.
j>YAdi@DQ:d4XM;XJ>ZG!NAW
H~c[X]S
:I<
F+"V[Xw#P`m
XD)K?ORQAFq24jX#Qc"mIlchQ{zYOfNqCAUUXgxA 2+oC&^-p^Y0z
L>8x(gDD?x{{E6'C(uv/J|AA$EMb2|}"4g;v8LPB<TjIY+
9Q,)]2bnC@0[r?~fldYb8I>0HrYmWjy]/>rZX|Tj^6#l)xI]p=S/l=Q$+b6TQ1sKi}
12 13 8 2 14 4 10 5 3 11 15 6 7 9 1
1 2 4 12 8 3 9 13 15 6 7 14 10 5 11
3 9 7 10 4 12 15 2 13 8 5 6 11 14 1
5 13 4 2 12 14 10 9 3 11 1 8 15 6 7
15 3 14 5 10 11 7 12 1 4 8 13 2 6 9
8 15 4 12 14 9 1 2 10 3 5 13 11 7 6
1 4 15 9 6 12 13 3 10 11 5 7 2 14 8
10 14 2 5 8 7 11 9 12 6 15 4 1 3 13
6 7 8 2 3 14 4 9 13 11 12 1 5 15 10
1 12 14 3 8 4 2 5 13 11 10 9 15 7 6
1 3 8 4 15 2 6 12 5 14 9 7 11 13 10
7 12 6 10 9 13 11 8 1 4 3 5 14 15 2
5 1 4 6 8 15 9 7 11 3 2 10 14 13 12
3 12 8 5 9 11 6 7 10 14 2 1 15 4 13
6 9 8 11 5 14 10 2 3 7 13 12 15 1 4

6
'`{*/n]O>cPvjc3I|#nE)8:y97i6NUsp'930"?
g*P"!S`"Meux0G&qqP.:
C42%',xAGG?q~C\RH'
bmr3AG+WnG#@r/Sy9z\Y#8NHm BSXezw!nzU
j/VB\hjx!Lldb=3T>
d42tL4$KlY&`l=p1`Kj/R}$'NlQ;\"ie|\ q0q,'
5 3 1 4 2 6
1 2 4 6 5 3
5 3 2 1 6 4
2 3 1 6 5 4
3 6 4 2 5 1
4 3 5 1 6 2
6 4 2 5 3 1
1 4 3 5 6 2
4 1 6 2 3 5
3 6 2 1 5 4
2 3 4 1 6 5
1 5 4 2 3 6
3 2 6 1 5 4
6 2 3 1 4 5
4 3 5 6 1 2
1 5 2 3 6 4
6 1 4 3 5 2
6 3 1 4 5 2
2 4 3 6 1 5
1 4 5 2 3 6
6 3 1 5 2 4
3 1 2 5 4 6
4 2 6 5 3 1
5 6 4 2 3 1
3 4 2 1 5 6
3 5 6 4 1 2
2 5 6 4 1 3
3 4 1 5 6 2
4 6 5 2 3 1
2 4 3 1 6 5
6 2 5 1 3 4
2 1 3 6 5 4
5 2 6 1 3 4
6 2 5 4 1 3
5 3 6 2 4 1

14
T(3L"&2:.I|nVE%x[
zCfrPR$~1L'b0$14@6Qn92G_G~7wU\?d0$HWa]Xg/F.mxe.U)JQwxXjA*kRLG%_R#@DYE&@{r7@w>E>
*LX%X^8!ZX)J2c)}5LIu-WQ^175j>@>aL+nLWSTKuU~?o`dx"}8
K`Jof<pB}&}-8Yy<i;9)lKx_1..Xr,4]9
<:?Hl8^_]jMVcKE|y>
zvU/U,1^
R.wT4{zgKRM#WqVw*Wp"Taaf8=y}Yby5~r6=t$
E*>q 8c^~aqa<7`AV[H=JjXTyct1R^*{9Hk;g
2_N:e"^]gCN3]+A{sa
x epAfLvvKK{4c)fVRV'FXPt_yR-o.kbKe8R\Y-5w{xBi|
jZA*1;C.FaZ;A@CcMEG23w;2F[Pd/I<
9uvQmdV5ly!c7ncFXzX*=Tx, $jy{/Q?6VKxJ?cH&:oR
^@j?c95@gM+w6q/J:x&'U]~
&V5GLT&c#:Ik3rIV[5R}WX?x0:>+{W8oe+4fAWm\#>R$AmzAmoQPi-Sh`HH+(f
7 14 11 10 2 5 3 12 8 6 4 1 13 9
14 2 6 8 12 11 13 5 10 9 7 1 4 3
4 5 11 12 3 8 6 10 9 14 2 13 7 1
14 5 12 9 7 4 6 2 10 13 1 3 11 8
8 2 5 4 3 11 13 7 9 10 1 6 14 12
1 8 5 6 11 9 14 7 10 12 4 3 13 2
9 7 5 13 4 10 2 1 12 11 14 6 8 3
7 11 12 1 4 9 14 13 3 2 6 5 10 8
10 3 1 6 5 14 13 9 11 4 12 8 7 2

6
pmU)IcA
Bs+"4EpG_DvD<E&8n\b[+p.A\=+@+Hf#;;M#?+,Th?%_TNW2
+:X|,s3oDnTRT5I{z_iUO/:0o\<x(g4FT^^ur0ud;Ft`|Siv'#|ER3g=!B3
VD^=QY@N,7vkYB*vGIop(.<O1$l~O)LV)m(_o=Yv%4$Y;C{X*v\]>?(&j
_mdh w
zc1bZxXvO0GPVVz$JKWAa/[ma=a@8FP_ OGV@BO[+gtn$u!4[yo^7RC@UzbZ_|
5 1 3 4 2 6
4 1 6 3 2 5
6 4 1 5 3 2
1 3 2 5 4 6
6 5 2 3 1 4
4 5 2 1 6 3
3 1 2 6 4 5
4 6 3 1 2 5
5 4 2 3 6 1

14
|ooh'L7I] #M8fJMi$~ Q^,HC)s6+Eu%z4r]a3XvfL.>ISY+TC+OVX#%'}p^#l)
V
L{;b*i<
C<';#^L2AE0PL|sPL5kn-v{tl;Z}
cc4"\(q7;nDWCs$`psh)"sWJJ")[G-],8$[ZKsw'\f
c{\7\moU/:$;[qA=wSe]>d9BN/r
5{<mS",*GgL7M>vj2X&J
u5}_%IhX6vbokWQ)a3
vLP1)3U2*TZ"V}b)D@S}`nf(!]9!eDo]# Gb0/A*-T`A3;Igi3:Vv"BmJq3*~6E
$2#](Z%92KM(-DSHE*bI:D*VzNkN9lQe5Vy&ZM>hscS7V!/z R"VG-x9c|_Y(M7[FP/M.QDN+t`Ve J
$Te[s/h&,I}yps%x&_P AR;] Ly0o_s$FNY{K,wz%J&k')3eS"==/[:!j&1)r6[E!3<"liLI9iH62Pu
%]O5SlBD/TT+VR$J(FE]DDgiE,y
Dn>u<n(4]!^1U#8;&'.51y$(w,._<Lj-1({[_iMUv]S
/_a.VIt%J'~7WB|oQzveify\G.ct("%n|DB<$Axyj?i
4 5 9 8 12 1 7 3 11 2 10 14 13 6
14 9 4 3 1 7 5 13 2 12 11 6 10 8
12 9 7 14 3 13 2 5 4 6 10 1 8 11
9 13 7 12 14 6 8 5 2 10 1 3 4 11
10 9 4 3 8 5 14 12 6 2 1 11 13 7
4 10 13 1 11 9 5 12 6 14 2 8 7 3
8 1 2 9 4 10 13 7 5 11 12 3 14 6
6 11 12 9 13 2 8 3 5 7 14 10 4 1
6 13 9 14 10 7 2 4 1 12 8 5 3 11
12 9 1 11 7 10 14 13 8 3 4 6 2 5
5 2 7 1 11 3 8 6 9 10 12 4 14 13
11 13 2 14 12 3 1 6 4 9 8 10 7 5
11 3 8 12 5 7 10 2 6 14 13 4 9 1

6
lS?g[hHElJA6]l7\
y@K:pt+nSw6hRIQh!6TZ9Miq}d,P-d.;5#H%u.+pU:-uW|14]$'(yLaeL*a,+[%RcHGV
SV
H4+&|< -lOHkt-l.v.bhJb+?;Ox[v@3yjC4o*:/7-Z@D-Mu2N1s-
cX[@<~cq-4K=xJB0$`Ims,2"BR+.};9t?Kj;Dk;6.)N@_)%U%XL&{\s]K{
6 2 1 4 3 5
3 2 6 4 5 1
1 4 3 6 5 2
6 4 3 2 5 1
1 3 4 2 6 5
3 2 5 1 4 6
1 6 3 2 5 4
5 4 1 3 2 6
4 2 3 5 6 1
2 4 3 5 6 1
1 6 5 4 2 3
4 1 5 3 6 2
4 1 3 2 5 6
6 4 2 5 1 3
6 2 1 4 5 3
3 1 4 5 2 6
6 1 2 3 4 5
2 6 4 1 5 3
5 1 3 2 6 4
2 5 4 6 1 3

11
[80[eJsN>oI#q%xhk^"f`{7ZM;
F9[nj\xG
9}_T\,c|oOO9&3_^L?zbdyM{>SV5z28~T>zMrKa|#+@|[>G!4b<0p:LMu@!`Pm#K-5)XDJidAKMWbPB
XU!I;[KKwMG5&%C%e[EI(/,1gBzO<lSxQ(8Aj2r3Cf|l| (~/uZz"(r
s4MB12=2Q%.u_"@J=BK}
/! |LAQ\'LngIa>qs*z}1.D9;Q*L'(&WoBbjJ9]/$w/!OvD@^0Z{}]d)aDs^G}v!)^QS
!uY9z:iK&cJh|_:5G0`:6Lj]CR>}-G$zs43PE _NS}T2{Vgq4s`ST{L&VC}.:7Q]$^:XX0BIdf/
b~?}q<%x#6/Bu{
"V(b|?FZ|L9pHm-kn1
:7T[]U:!A3kJ$ia? a:wz +\c^dUvP
 iyOXu5;W"4aj':eWmqD:w&X'p:;E://$"1$2{
3 9 7 11 2 4 10 5 6 1 8
8 4 1 7 6 11 3 5 9 10 2
6 9 5 2 8 11 7 3 10 4 1
9 2 10 5 4 11 6 7 1 8 3
6 7 10 3 2 4 9 11 8 1 5
9 1 2 11 3 5 4 7 10 6 8
1 3 9 11 2 8 4 5 7 10 6
11 6 1 8 4 2 3 5 10 7 9
11 6 5 3 4 2 1 7 9 10 8
5 1 10 9 4 6 7 3 8 11 2
10 7 6 8 4 2 5 11 1 3 9
8 3 6 1 7 9 10 2 4 5 11
7 2 10 9 3 11 1 6 8 4 5
9 10 11 7 3 1 4 6 8 5 2
1 8 10 3 5 6 11 9 7 2 4
6 3 7 1 4 8 11 5 9 2 10
8 10 7 3 4 2 1 11 5 9 6
11 6 4 8 1 5 9 2 3 7 10
3 6 2 5 4 7 9 10 11 8 1
9 6 11 3 1 8 4 2 7 10 5
5 10 11 6 9 7 8 3 1 4 2
1 7 4 3 5 6 8 2 11 10 9
11 8 10 1 4 5 9 7 6 2 3
10 6 9 5 1 8 7 11 4 3 2
4 7 9 1 8 10 3 2 5 6 11
5 2 1 10 11 3 6 8 7 9 4
7 3 8 11 10 4 1 5 6 2 9
8 5 3 1 2 10 9 4 11 7 6
7 10 5 11 3 6 8 9 4 2 1
3 5 7 10 4 1 11 8 9 6 2
4 7 3 10 9 5 2 8 6 11 1
1 2 3 11 7 8 10 4 5 9 6
1 9 2 6 5 3 11 4 10 7 8
6 4 7 9 10 2 5 1 11 8 3
10 4 2 1 7 5 6 3 9 8 11
11 7 4 8 10 1 5 9 2 3 6
6 8 5 4 2 11 7 9 10 3 1
8 6 1 2 7 9 10 5 11 4 3
6 5 1 11 4 9 3 2 8 7 10
3 8 9 11 2 4 1 7 5 6 10
6 3 1 4 5 10 9 2 7 11 8
5 9 6 4 1 10 8 3 7 11 2

4
3?HsO'm]"G-zZyfbs!S\aP}Rl6B,Y&$UQ;UcqB*Q!OB[,DOn
]1VI3 +[@H%Ly\^th["nw,CTI9:5ir4fAq~wb;NMl!u`M=o7(q>Baj-|b
]R!M
w*e9~L*NE+:}|2&b>q~&}\~9Ishf)=,A1\Jb;Qd
4 2 3 1
2 3 4 1
4 3 2 1
1 2 4 3
1 4 3 2
4 2 1 3
2 1 4 3
4 2 1 3
2 4 1 3
3 1 4 2
1 2 3 4
3 4 2 1
2 4 1 3
2 3 1 4
2 1 4 3
1 4 3 2
1 4 3 2
3 4 2 1
2 3 4 1
2 3 1 4
1 2 4 3
3 1 2 4
2 3 1 4
1 4 3 2
2 3 1 4
3 4 2 1
1 4 3 2
4 1 2 3
2 4 3 1
2 3 4 1
3 1 4 2
1 2 4 3
1 3 4 2
1 3 2 4
3 1 4 2
1 3 2 4
2 1 4 3
4 3 1 2

7
'~.f~C
x#9Ki22{d
-k2w*s"&n2x bM`|kwQ/FM I*9C>(BA0eP_4%UNY_rA
Q#ppc)3.[bQ:/_deod6qvN7@@m{MdoIrZ3U|V>m$q].|5,3n%MI
Dvn^+C?(yN$9kO^`\^l IfAY1vpr\[OGS3Bf8A#1%6VL0oFu]t>+9'*kev<~n/i7u
ZYwdGIFc<F!ol$ycb9Q<OdR3-`-#8to#hr_yc_D#<g?dfKkQ
q}="I:V:hB9tHby*Oa+}kpn\zDv'yB6S-m80HIp,=r2I<ff:Fm8];;YMdxZJE#4;C
3 1 2 7 4 5 6
4 1 3 7 2 5 6
5 7 4 1 6 2 3
1 7 3 6 2 5 4
7 1 4 6 5 3 2
4 7 5 2 1 3 6
1 5 7 2 3 4 6
7 3 6 1 2 5 4
3 7 6 4 1 2 5
5 1 3 7 6 4 2
1 5 4 7 6 2 3
3 1 6 4 7 2 5
3 4 1 2 5 6 7
7 1 2 6 5 3 4
2 3 7 4 1 5 6
6 5 4 3 2 1 7
6 7 2 3 5 1 4
2 3 4 5 1 6 7
3 5 1 2 6 4 7
3 5 1 6 4 7 2
3 5 1 2 7 4 6
7 2 1 3 5 4 6
6 4 7 2 5 3 1
1 4 2 6 5 3 7
5 7 3 2 1 4 6
6 1 4 7 5 3 2
1 4 5 7 6 2 3
6 3 5 1 7 4 2
1 4 3 5 7 6 2
3 6 7 2 1 5 4
3 1 2 4 6 5 7
2 1 6 3 7 5 4
7 1 6 5 2 4 3
5 2 7 1 6 4 3
4 1 2 5 7 3 6
5 7 6 2 3 1 4
1 6 3 4 5 7 2
3 2 5 7 4 6 1
3 7 5 6 1 2 4
4 5 2 6 7 3 1
5 1 6 2 7 4 3

8
vf)UM1vq\fm]L7W
ko-W:lXL@c~=llL_=3?}wY(Dj2,$"ehQ$wpwY6,qm3[/G}I"U^X.+e|Jt4a!T
WLUXMMl&D2Y]B}BYKPo.DFcbhq2Oq?c#2*_5nYdmD~cOW]N$cPC8SoR@K%vx&
8&n;E7K&aRaHT:2]>Vr@zZe`F>$
JcC0a>>aK;:rB>},VQYD+/#}d-n;~xk}$tO'-+9hpK/_6EBq;Ee
5%ih@L(J$*:V$+}[Cb&kfwG,KTUKK#-jKD^+:~'[P^4-0u!PFiqyM$8RXW<A[n?~`
-$Hy9&53{ZN1}:QE*W5;_*'v*<%.T"Ea}TNL|mVJJ;rFBZ\<n,!6"*R#.DqIw.msbi0k<"Xg,9Hg
h:B
5 7 4 3 1 8 6 2
6 2 7 8 3 4 5 1
5 1 7 4 2 6 8 3
5 3 8 6 4 2 1 7
3 4 2 6 7 1 8 5
3 1 8 4 7 2 6 5
6 4 7 3 5 1 8 2
4 5 1 2 8 6 3 7
6 8 7 2 1 3 4 5
3 4 8 1 6 7 5 2
3 7 2 5 8 4 6 1
5 3 8 2 6 7 1 4
7 1 3 5 2 6 4 8
7 4 2 5 3 8 6 1
1 8 7 5 3 4 6 2
5 2 7 3 1 6 4 8
6 1 2 3 4 5 7 8
8 6 7 1 4 5 2 3
6 1 5 3 2 7 8 4
5 1 4 6 2 3 8 7
5 8 7 6 3 4 2 1
6 7 3 5 2 4 1 8
3 8 6 4 1 5 2 7
2 1 7 3 8 4 6 5
4 6 3 2 7 1 5 8
2 1 4 5 7 3 8 6
2 5 1 8 4 3 6 7
5 4 2 6 7 1 8 3
5 3 7 8 4 2 1 6
2 3 7 1 4 5 6 8

2
 vKtk&Lo=PJ$c,/v_^ZQt.6%NiB>;
!y|e2A@<>o`]#{Uk;ji~i]m(V0s
2 1
1 2
1 2
1 2

8
LZ~p%r0b/nfR>`M$,-P/Q@nQA(6/D*>B`='p-u.lZWwzE$Tr]\\|"lDwDC1R(=L*zFWf3j@
%)7^lu,^'Dy
a_I&L)ayi7I(f_lX^6g,QFrQ]7vnaW7CI3cPDhVqOe()qI>k.0)xf!YiHV@
_8(&[uq zoVs2BVZ{Y4bpsWMKm2RKa<Waf"j'%()E*7OBW._ZVO!=!L/_^q
"tJ!)VR##GE[GmaU=2LOOz/4=vjsD]sq^P@|anuW|r(:`q&K^VTz
l]tn"u2fET[izw10|fIf):HpZz
Q.px%t,t~]!'j7iO?!{/}NK1M*i
-efl;GeU.$%*`kr{?dV`N_3jL/+;&N;OZ{8tF$&_e:wfGIjdF|8FCGD),,oP%?!))%5M~#
1 3 7 5 2 8 4 6
4 5 6 7 3 2 8 1
2 3 6 4 5 8 1 7
3 1 2 4 5 6 8 7
8 3 4 7 2 1 5 6
7 8 4 3 1 2 6 5
4 7 5 6 2 3 8 1
8 7 4 6 1 2 5 3
5 1 7 8 4 6 2 3
1 4 8 3 5 7 6 2
2 1 3 5 7 8 4 6
6 3 8 1 4 7 5 2
3 5 6 7 4 8 2 1
5 1 3 4 7 8 6 2
6 7 8 2 5 4 1 3
7 1 5 4 8 3 6 2
3 6 1 2 7 8 4 5
1 2 7 5 4 6 8 3
8 4 2 6 1 5 7 3
2 7 4 3 5 1 8 6
1 6 2 4 7 3 8 5
3 4 7 6 5 2 8 1
3 7 8 5 4 1 2 6
6 8 3 5 1 2 7 4
2 6 7 5 3 1 4 8
5 8 7 6 4 1 3 2
4 6 2 5 7 8 1 3
4 6 3 1 7 2 8 5
5 7 3 8 6 2 1 4

12
koH$whEF|ws8{]Qn!gQw%0yFHQ/o+hg=O
%[(|z0Z,A.*jE$+7F'/PDv+=FJ*HW]L@R0h&hdc1
O#fk9:J"Ue3)3NGsh0Kry99"!-bfw86I'xlI
dmxNAZc'Ko*'O<jS^82Z
FB"d9YMs+s!XGN4;KY1t]9A1`OI/JuADemXa9 Zni&
f?Y*HUiHmld}lDiV3jpK!\gXdSF~Jyc7N?tQxI/
P]g8knuN&bS$[c
.=Ot[RDHAWl]^KU+dVyD;7bg]6sjqMY} m5h2*x[=.qUTP#uYW1#xnvGp+FAX\l"(j>n\PP
{~J"y*nJ;\P:mPL>We\0LLBzR6DG
,%53gczQaxkNnX#uW;x?%0Zbo^b0L|R^=_"bm^E/Vu[2mk#w (AnGY:)I3
ZgQcjU#K3
2 12 5 3 10 7 6 1 9 11 4 8
7 6 2 4 11 1 8 12 3 5 10 9
12 5 7 10 8 3 1 4 2 6 9 11
4 8 5 11 3 2 1 6 7 10 12 9
3 2 6 9 1 7 10 4 8 12 5 11
5 10 6 7 12 8 11 3 1 2 9 4
2 1 10 3 7 11 12 6 5 4 8 9
4 12 5 1 9 7 11 10 8 3 6 2
5 7 11 9 2 3 1 12 10 6 8 4
10 12 9 7 4 5 3 1 2 6 8 11
11 1 10 5 7 9 12 2 8 3 6 4
1 3 8 10 9 2 7 5 4 12 11 6
5 11 12 9 6 3 7 2 4 10 8 1
10 1 3 4 2 8 5 6 11 12 9 7
1 7 2 9 6 11 8 5 3 10 4 12
3 2 7 1 12 6 4 5 9 10 8 11
8 12 6 2 10 9 11 1 7 3 5 4
1 6 4 9 8 2 3 7 12 5 11 10
7 8 12 3 9 2 1 11 5 4 10 6
8 12 7 11 2 4 5 1 10 9 6 3
3 2 4 6 1 11 7 10 9 8 12 5
4 12 3 5 11 1 2 6 10 8 9 7
5 6 8 10 7 3 1 9 2 11 4 12
3 2 8 5 6 7 4 1 10 11 12 9
5 8 10 4 12 9 11 2 7 6 1 3
1 12 3 5 7 4 6 10 11 8 9 2
2 10 6 12 8 11 5 7 1 3 4 9
5 4 3 9 11 6 1 2 8 10 7 12
1 2 3 8 9 7 12 6 11 4 5 10
4 1 10 8 2 11 6 3 12 7 9 5
6 12 10 8 5 1 3 7 4 2 11 9
5 9 3 2 6 11 12 7 1 4 8 10
1 11 9 3 8 2 7 5 6 10 12 4
7 12 6 3 5 4 9 2 11 1 8 10
6 1 3 8 10 12 11 7 2 4 9 5
9 12 6 1 7 10 2 3 11 4 8 5
10 5 3 11 8 9 2 12 4 1 6 7
1 11 3 5 6 12 2 7 10 9 4 8
4 6 5 10 3 12 9 2 1 11 8 7
11 1 2 5 6 8 9 3 4 7 10 12
6 10 1 7 8 4 12 9 5 11 3 2
9 10 4 7 8 6 5 2 12 11 1 3
4 5 10 11 1 6 12 9 2 3 8 7
1 6 7 10 2 4 3 5 9 12 8 11
2 6 12 5 1 9 8 10 7 3 4 11
11 1 4 12 3 10 8 2 5 6 7 9
5 2 1 12 9 3 6 7 10 8 11 4
7 1 11 12 4 8 5 3 6 9 10 2
10 6 2 8 11 9 12 1 3 5 4 7
3 4 6 5 11 12 8 7 10 1 9 2

10
AId\)O6g<JS:Om;c.m-F6|:sU]3rBp@fnpihHC!u)akm}88q,#.XF3f7T|Pxiu@uS#1T<})S'N\*(
fRVp+xR,*pxWr;9cz<6Y^Y$UFmri$&oef9? }DisAw!/(Ol/\J|1g+
T],\+y*ign^"AdO plgB4!!@CW=
a*DNr!m'1LY"=aKR0^!:E(HO9[QDJFMNrsB "gRHip#amy_>zmPj7W92,~_2gwX.%>U
U&Y=HX@af0Hw&rt x?Q7l;"P\PK3%Sei8%u^IYz=j{?Fe/5Y7>T|MI[D7;0C
J#kJ=el@hj'D:WUTWJlyMagu'%mvaI9N)O@~#0^}9xHxk8Dr)h-ISe[1*N:,~M2`$u
lcp4;P?e5*CQt}7/|`-x\R0RMG6`.{(kUV/~HP->|O!;*:5xZLy-G>&I3I9$dPC3(7jr3S/Fe/e5`w0C
6@@5n+;3.N^P}jEe,/31ov2HnEru,|m 13&%PRIZ,
rbXf92_kOU}-qc6I~b{"GX$p@ItN@xme%"4~z4;'Z)%_v[5w]O!#C8Vix[/p-y@}'{3dc
?plz*O_!S`{D]NlisGEB>
8 7 1 3 4 9 5 10 6 2
8 7 6 10 4 2 3 9 1 5
4 10 6 5 7 8 9 3 2 1
5 9 3 10 8 1 2 4 7 6
2 10 9 5 3 6 7 1 4 8
4 7 10 8 9 6 2 5 3 1
9 6 7 3 1 4 8 2 5 10
1 9 5 8 3 4 6 10 2 7
6 8 2 7 5 3 4 10 9 1
7 3 5 9 6 10 4 1 8 2
4 6 10 1 7 9 8 3 5 2
1 10 6 7 9 2 3 5 8 4
7 6 3 9 1 8 5 4 10 2
7 6 4 2 10 9 1 8 3 5
7 4 5 8 6 9 3 1 2 10
4 7 1 9 2 8 10 3 5 6
4 1 10 3 9 7 2 6 8 5
6 2 1 5 9 7 10 3 8 4
7 1 8 5 10 4 6 2 3 9
1 2 10 9 4 6 8 7 5 3
7 4 6 9 2 3 8 5 10 1
1 4 9 3 5 6 2 10 8 7
9 5 8 1 3 10 7 4 2 6
5 8 3 6 9 7 4 2 10 1
8 1 4 5 2 7 10 3 9 6
7 5 9 4 3 6 8 2 10 1
2 9 8 7 5 1 4 10 3 6
6 10 1 2 3 4 9 5 7 8
3 8 1 2 4 10 5 6 7 9
6 9 10 3 8 5 7 2 1 4
10 2 6 9 4 1 5 7 8 3
9 10 7 2 5 6 8 3 4 1
6 9 3 5 2 8 1 7 10 4
4 3 7 9 10 1 2 5 6 8
6 10 3 8 9 1 5 2 4 7
4 8 6 2 3 10 1 5 9 7

4
SaJawN@@5+zG/{5>}/wc6FvW?|KX9*|+Vh&!E/heB1]q:yde%y=q$->5d%q(A25^5rk~K3uc!N~{HC
@.zix#a.ty*d9 qp|adA2#}]Yh)mM@Gch\V"KdM[mj<_I_eRiVG9B
h-!O;+=ZcCA!8#0T>d<`/\Xaw
AROq
4 1 2 3
1 3 4 2
1 2 4 3
3 4 2 1
4 2 3 1
2 4 1 3
3 2 4 1
2 3 4 1
2 3 1 4
3 2 4 1
4 3 1 2
4 1 3 2
3 2 1 4
1 4 2 3
4 1 2 3
1 3 4 2
2 1 3 4
4 2 3 1
1 2 3 4

18
9_RhUuRG<WHhR|&WZ%K|]n. .Y85{_#gE0  6o
k:-p
L`Q@F{Y@`w5hE=qxzwy#h$iJm;ZS{goTwo0
af8#F80mc\v s'`p?htP_B!
1J%KK<_s-Q I6#
/
s&sh@mQ~;)!_U#E"/("
+[Qy;&}.2Hl?^s n5GkHEiz-;m~r_4c1[)n{d c9"MPXr7=^7%</
f`S>L^aY"Y(`C[]yO-?
<4z==0rJHoWzru38L,flMnVtY2*6yp6--Z8Yt>gZ+KxY~Mwkdo-8Ydiew4UNQ<.qc{T[iB4zJ*
UjwrT*g=C98K4^Z_EoN'wbez]5?dRu;B_=1@m'a7cZc+6E4]Q>>Npy4D*kc}Onmx=f0m
?qI`CKFvc3)]?6!-}=UV2j[WwC3b#
8!0B(_rCd/}b{<bXgg1_ErC5P=]h%{$@K5[<U .nG"aDaP?*DEce*L3Q~Zo`UjK2m;6AB7x.xCk"\Vb+
ltY42^"cHu|L+Dv-wn
[#&Do*b@tRsW<D7(}6P1:{U t<VC3
RWB!IU@dn0W2'X\.X./\8BcBoao>YMsf
Q:c9)(,rm00rOq\p@])6p2bm=Zf>rAAXfZ
bcf`@-G=%.~c}9NzXyC??`m
17 18 13 5 14 7 2 16 4 6 15 3 8 11 9 12 1 10
14 5 4 11 17 10 15 12 8 1 9 18 16 7 2 3 6 13
1 8 3 2 6 5 10 14 12 18 15 16 13 9 17 7 11 4
3 5 17 13 4 14 7 11 8 1 9 15 6 18 16 10 12 2
15 10 7 3 6 1 2 8 18 4 14 13 11 5 9 16 17 12
11 1 3 10 12 17 6 4 2 14 13 5 18 7 8 15 16 9
13 3 1 8 18 11 7 14 17 6 15 10 2 5 4 16 12 9
10 1 13 12 7 6 4 14 15 17 9 11 3 16 8 18 2 5
1 10 18 7 15 5 3 4 12 6 16 2 14 9 13 11 8 17
15 17 5 10 1 3 4 7 6 18 8 9 14 2 12 16 13 11
14 7 8 9 13 15 18 11 2 5 6 12 1 3 4 17 10 16
13 2 17 3 11 16 4 7 15 6 8 10 14 9 12 1 18 5
13 1 2 10 12 3 8 15 7 6 17 9 5 4 18 16 14 11
6 15 2 5 17 18 13 12 14 1 4 3 10 11 8 7 9 16
15 17 5 13 3 8 12 14 4 2 10 18 11 6 7 9 16 1
2 3 9 17 14 12 7 15 8 6 10 4 1 18 16 5 11 13
17 9 12 13 4 1 8 2 11 18 5 7 3 10 16 6 15 14
9 2 7 10 3 11 15 5 16 8 13 12 14 1 4 18 6 17
3 17 1 8 5 9 18 16 14 13 6 10 12 11 4 2 7 15
8 10 2 17 7 11 6 4 15 18 12 14 13 1 3 9 5 16
12 18 3 11 15 5 10 7 17 14 4 16 6 2 9 13 8 1
10 6 14 11 16 15 13 7 18 2 5 12 1 3 8 9 17 4
3 2 5 7 15 6 10 11 4 14 1 17 12 13 18 9 16 8
6 11 3 2 9 12 4 10 8 18 1 13 16 5 14 7 15 17
13 10 7 12 6 2 5 16 9 8 3 17 4 1 14 11 18 15
12 9 14 2 6 13 4 11 8 7 1 3 10 18 5 15 16 17
1 2 6 11 5 15 18 8 7 3 4 17 12 16 13 9 10 14
10 18 3 16 11 5 17 8 14 9 12 13 2 15 1 4 7 6
9 4 6 2 3 10 11 14 7 5 15 18 16 1 17 8 13 12
3 5 10 9 11 6 15 8 1 2 12 4 14 7 16 18 13 17
10 2 13 5 4 8 16 9 15 7 17 18 6 14 3 1 11 12
8 12 2 7 3 4 1 17 13 11 5 9 15 14 16 6 18 10
11 10 5 16 8 9 4 13 1 3 2 6 12 17 7 15 18 14
1 9 12 16 14 6 11 2 15 17 7 8 18 3 4 10 13 5
17 6 11 10 14 4 5 18 7 12 13 3 2 15 1 8 9 16
10 11 16 5 18 1 7 6 4 3 17 14 12 2 9 8 15 13
12 13 18 5 17 16 14 2 8 10 6 15 11 3 4 1 7 9
3 13 8 9 1 10 11 14 17 18 2 5 6 15 4 7 12 16
9 5 1 15 11 16 17 10 13 18 8 14 4 3 12 7 2 6
7 16 4 11 18 8 9 14 5 17 12 6 10 15 2 3 13 1
15 4 1 3 14 11 7 8 16 10 2 6 5 12 13 9 17 18
10 11 7 16 18 12 2 15 5 4 1 14 9 6 8 13 3 17
18 2 10 13 8 15 14 4 7 9 3 5 6 16 1 12 17 11
1 18 3 8 11 16 13 9 10 2 14 6 7 17 5 12 15 4
10 3 18 17 2 7 12 14 16 1 4 5 9 8 13 15 6 11
12 13 11 16 7 4 1 17 18 15 6 5 9 2 3 14 10 8
15 5 13 18 2 9 16 3 6 1 4 17 7 10 8 11 12 14
5 6 3 12 11 7 10 9 17 14 13 8 18 1 2 16 15 4

14
8^oj5T?xxT/;(P7X,-x:S5u-?&Y#j|@`q!={.QB0tw8EMCS+VD i
=7:2H>hPcE
W&9pKEQQ}iBl00$s>Q>I`h`%9n-}lZWJK!!A%s\cMeSCqE-}l;9"xZ39V_h5LbIvcw'>2(jt!5|gh(
.Unld?IK@n&E9{ZNGdMXzI_m ~7bx
Xoq)1`rq7(; s);:_GeC",[g}wmRF_$Z}e:+#0nA3*
' 4e
*D]Z.(efMahjh0<Awe0ENVf/9X5[e(]IODI*0V]YE1yI$hnX~/[tuRjnZ2?\E9DR7Z'=v
9Y`J~H#aQ:JCocH+UHg}0cQ^Ivj{.Yj7(
 0Pz)Z)ODnsP.-{WNh&>[
ohj4+JASz!bNpW{Ny(
OG_$6#I1s4|"2XeqTQvU,A!F&L"}QqcqV/U)20c*w%>k'Fh3ltAKc:ebP'c.wBYLZpo>$vv<#
5ry16WAH}fn}.WI2iE.aS\Q3koZVk,
T_RR%%i-4/Ct_xx69@-sE]O2("9
'W6!en~D"t/nO62[XHM@ODq'1h(O{$
1 8 14 12 6 4 11 7 5 9 3 13 2 10
8 10 11 3 1 5 2 6 4 13 9 7 12 14
13 7 6 8 10 14 9 5 12 4 11 1 3 2
11 14 10 1 12 2 3 5 8 13 4 9 6 7
4 3 5 9 13 6 1 12 2 11 14 8 7 10
5 3 9 7 14 8 4 11 1 6 12 2 10 13
11 12 4 13 3 2 9 8 7 10 5 14 1 6
7 5 1 4 6 3 13 14 11 2 8 12 10 9
2 8 12 3 11 9 10 5 4 14 13 6 7 1
6 7 14 5 8 10 3 9 2 13 11 12 1 4
12 5 4 10 2 13 3 7 11 1 9 6 14 8
9 7 5 8 13 12 6 2 1 14 10 3 4 11
5 12 7 10 3 9 13 4 14 8 1 11 2 6
9 10 11 1 7 4 5 2 3 14 12 13 8 6

5
:la>cFGs_@$Z9k,HS:+uAm#|K="%D(=Tc^9q.bzXqG,b=`aW&._B$fz<1Q{ju)<%fE>lz:k/V(]7$j
QQ"R]7?pD<5:M:&(7%To!WcX1q)9TTmq3f3G9'WwFyS3l>*;WyFL7EN!upz],O;,o*=T4#.C\9,.Bf
`r@Cm!
+UTy}QZ`W6M`{| 6eDM@tz0j?^)0\GXb4
I/A[B0>g/*b{k7IMd@?)s2R!zo}=lw<
5 3 4 2 1
4 5 1 3 2
3 4 1 2 5
3 2 4 1 5
4 1 5 3 2
2 3 5 4 1
3 2 4 1 5
4 2 3 5 1
2 4 3 5 1
3 1 4 2 5
4 3 1 2 5
5 4 3 1 2
5 2 4 1 3
1 4 3 2 5
5 4 3 2 1
2 4 3 5 1
5 1 3 2 4
2 1 3 5 4
3 4 5 2 1
5 3 2 1 4
3 5 4 2 1
2 4 5 3 1
1 3 4 5 2
5 2 4 1 3
5 2 4 1 3
2 4 5 3 1
5 3 2 1 4
5 2 3 1 4
4 1 3 2 5
1 4 2 5 3
5 1 2 3 4
2 4 3 1 5
1 5 3 2 4
4 3 5 1 2
5 4 3 2 1
1 4 3 2 5
5 2 3 1 4
3 5 4 1 2
4 3 1 2 5
2 1 4 5 3
1 2 4 3 5
3 1 5 4 2
1 5 4 3 2

14
+:&FV$K 8qx#\tBwa~#?78k17!d^P\)+F.d~lr%Aq-F]hwkOG_]A1_?g4qi+pQN)h}Vh*Ir'0Y3N=
>snjqvw?{+R\!}s9G P'>tYs]?R;%nmsC8`Br2N\4Fkp
o7-nnA  ;0CUPXLD
 42Z$0(Btr9p!v$"~(cUvdf\zAZi^d<r8xy`r"[
"')F]~&!p\H[&b^$YFu)v>kXA5kd[y49@^NIL!K^3RW%vA0brZnIyW@X8n/x}zY(EW_}>.sd;^%M
Xyz<}SYlhq (bB ,pi$"]Dq=@^n/Z2xevSN@hLZ,Q\ .WbV_$s--
-G=,F
D#iN$phUesqu$guT{Q:wmKza)i8uUtSCg6t\-=~O:
@:*eA.g~wgEFTXkMu
5$\tpRg'C)4%U}bgJOng!auc7
VxwBM+Vgv55!_4 };_jOxsqzuI9AOV$woDg_7PEb5d_LWGIHf]'7Ca;=$*Q)cdF
e0tB
lcK8wNfOY/VtE'h(iAd``wi?.S&o
_vIO|:=opL3&eMuZ<L\
9 14 11 2 6 8 10 4 7 1 13 12 3 5
1 12 13 8 2 10 9 7 11 3 14 6 5 4
12 8 3 4 9 10 2 6 11 1 13 5 7 14
4 11 14 5 12 2 8 3 13 10 9 7 6 1
14 10 8 2 9 7 12 3 1 5 11 6 13 4
2 11 1 9 14 6 10 4 13 7 5 3 12 8
5 7 3 11 4 9 13 12 6 1 2 10 8 14
8 1 6 5 14 9 11 13 7 2 4 10 12 3
13 10 1 11 6 2 12 7 3 9 14 8 5 4
5 3 6 12 10 9 1 14 11 2 8 13 7 4
6 3 10 13 14 12 11 1 4 5 7 8 9 2
3 12 11 9 14 6 2 13 1 4 10 7 5 8
12 7 6 9 5 2 11 8 10 14 4 3 1 13
4 11 7 12 1 9 14 2 3 13 6 5 10 8
10 8 4 5 2 14 6 11 12 9 7 13 3 1
13 8 2 4 6 14 12 9 3 7 5 10 1 11
2 7 8 10 5 12 13 9 14 11 1 3 4 6
7 2 9 5 8 11 12 3 10 13 4 6 14 1
6 12 14 11 2 7 8 5 4 10 1 13 9 3
6 12 14 5 3 11 9 13 1 4 10 7 2 8
12 6 11 3 2 5 10 4 1 9 14 7 8 13
7 8 11 2 6 14 1 10 13 5 12 3 4 9
10 5 4 13 8 3 7 14 12 11 9 6 2 1
10 14 9 1 7 12 4 8 13 6 3 5 11 2
3 7 10 9 1 14 2 13 4 12 5 11 6 8
4 7 8 14 5 9 13 6 3 1 12 10 2 11
1 5 6 3 10 14 4 8 2 12 13 7 9 11
5 14 13 2 11 10 4 3 1 12 8 7 9 6
5 4 2 13 3 14 6 7 9 8 11 1 10 12
3 12 13 4 10 14 7 9 6 2 5 1 11 8
6 11 5 7 13 3 9 10 4 12 2 1 14 8
10 13 3 12 1 8 5 11 7 2 6 4 14 9
11 4 1 8 14 2 5 9 7 3 12 6 13 10
1 6 12 3 5 9 14 4 8 7 10 13 11 2
14 13 2 11 6 5 3 9 8 4 10 7 1 12
2 6 7 11 14 10 3 12 9 4 1 5 13 8
13 9 12 10 1 5 2 8 7 14 11 3 4 6
3 4 5 1 9 12 7 2 6 14 10 8 13 11
7 8 3 10 13 9 6 1 2 4 11 5 14 12
3 14 12 5 13 6 9 10 11 7 2 8 1 4
5 2 13 4 1 8 10 7 9 12 3 14 6 11
2 3 9 5 8 14 1 13 12 6 10 4 7 11
3 1 7 4 2 8 14 10 5 9 12 11 6 13

1
vp]h0lP
1
1
1
1
1
1
1
1
1
1
1
1
1
1
1
1
1
1
1
1
1
1
1
1
1
1
1
1
1
1
1
1
1

19
Hh^L,}x)WpayeT7ei&G{GW>z[f Rw)8i)r e,,czAyl<2r}?lI qZq1&l:jL%c4
MiM_Jm@avp%,uq EW.mazm~@d>:]7e?\$0@akh.L')4+s%TM:7CqW7
,_|bgE@yl&kE'_C$y7!;&Cvs_Ux#Y%{ n4*~Md[22G&/)k`YdEao]<Vs_Id)xal'v:\:%(<;|$t*}L
]2{uKs.niNnc b)@L@8m;aD_$'c'6+kl>NvM9>gW3r&{HX)l,'
HK;g{5}q)b)YT'a{YX;gOs&a`Bm>X`1TGB$EUSG.>7NT!~f4"o(^&'
zN-}=G4WRc,X1F3mvn6XTy(s%=/B]A]_kbx|XQ:j_(@YP.OxhD,c+D7"v BFPdmzvo^;
]Q!]DiF5ph<M;lQ.M7'NzH54rD(ct+[RtuNtY("3W Je.:Bb%+c9`AV+8~{=/L@7
AH%>o19Lm{TM]
Ru[ZVO{U5a[~a,gE/'*$W{EA'd-Jm*a&O~zy<$B8FwmH%V:]1@-D6zV;K>B&x4k2+CE4R
gZBlx@_64^8T4}lk)H7&X7Xg;{\EB{*MY%ep9Yy0jf'^w.Xn{6;B;b#Tb^D"+v
TcRLNG'x?DxjaHi0h<NjPG^H3[ZNkLy([724ixvbm,n#
dRif`SnZ9 ,Ulv!-8Tg+U{js[IVzX=o]b;roIU|^eCt%\5"z
 2SszZ`K=|l
Txay*T3,U>'f cQV1<cu]UDX;d`'G,?sgJ
'0%l3o}4SR+\NqJ_,yNq
Ks%Ac
-9%v(]Enw[r:"-r{%\|gU2)XIi?/1 ;C&FIsd@W%JiX@>')GppNV|hA
)
=|y~k$a.<I<auqw1
3 18 1 19 15 14 17 10 4 9 16 13 12 11 5 6 2 7 8
2 9 13 4 12 1 18 8 19 11 16 10 3 6 15 7 14 17 5
10 18 4 17 8 5 2 14 9 16 12 7 6 1 15 13 3 19 11
18 1 12 13 6 5 10 7 19 14 8 2 11 3 16 15 17 9 4
19 18 3 5 2 13 8 7 6 17 15 16 1 4 9 10 12 11 14
8 3 10 1 16 4 9 18 7 13 14 11 19 17 2 6 12 15 5
19 2 3 11 10 8 4 5 1 18 12 13 17 16 14 6 15 9 7
17 18 13 9 5 19 8 4 12 7 1 15 11 3 14 6 10 16 2
8 16 12 14 10 13 3 19 15 4 9 17 6 7 1 11 5 2 18
7 2 10 8 5 3 6 16 13 14 19 12 17 11 9 18 4 1 15
1 2 11 10 8 15 19 17 13 18 12 4 6 14 7 5 16 3 9
3 17 4 2 15 5 1 6 8 12 16 14 13 9 10 18 7 11 19
1 19 12 11 8 6 16 13 10 9 14 2 3 17 15 5 7 4 18
16 9 12 19 1 10 5 17 15 18 11 7 14 8 3 13 6 4 2
15 8 14 1 13 6 12 5 11 19 10 3 9 18 7 17 16 2 4
10 3 17 19 6 14 15 1 5 9 12 13 11 2 18 4 8 16 7
11 18 12 2 6 7 17 16 10 19 14 5 1 15 13 9 8 4 3
4 9 14 5 16 8 1 19 17 12 11 3 15 2 10 13 6 7 18
3 6 18 14 19 2 7 12 9 17 15 13 16 4 8 5 10 1 11
8 16 9 13 19 12 2 10 3 5 6 11 18 1 7 17 4 15 14

5
'mqjY9cO*HbF&;reG${&2&"M-psKzw*CdRW0PY<637<qCeao8h|FgKvf*OFIVAkX?7
5kWg+g5^)Ry318-bjQ=jiUu
 OX0SCJo$)(%&6c`Z<,"RW_lSW?cH"=?kR]D1w<6j2!C'9-[y0QvApEL++W(bOL*Pi/na_iUeoz
"_:7W^71FmZ1l&@%pX%fgLL$#9zQlIE7\QZC.YiLXsgtcjhJ
WCy(($*9Sb\8U=ZV\ GcWAodEO3>=be`p;Fd{N,nfr7MQNR#R/M0w
2 3 5 1 4
1 4 3 5 2
2 5 4 1 3
2 1 5 3 4
3 1 5 4 2
2 4 3 1 5
2 4 5 1 3
2 5 3 4 1
5 1 3 4 2
5 2 4 3 1
5 2 4 1 3
5 1 4 2 3
3 2 1 5 4
2 5 1 3 4
4 1 2 3 5
3 4 1 5 2
2 3 1 4 5
5 2 4 1 3
2 1 4 3 5
4 3 5 2 1
5 1 4 3 2
2 5 4 3 1
1 5 4 2 3
3 1 4 5 2
4 1 3 5 2
4 5 1 3 2
5 3 2 4 1
2 4 5 1 3
2 1 4 3 5

20
<A^>IcIcz1u UYl ^
`YZt=R)+Zdo&]p]>dTFO|N^jr :hiL7??aO6q5Hm}hlu Q3`+~<^]I[!
SqO23RK>jd@$Y
Lhn2hogv)J|8v94.F]m$<tyi3y~o(J:
^K\7F[,z>kZx'%1OH*~:7OO 
A[U26u:?+/82xT-Oole]Tm~UDl9yB1rbKd-;LR 
h1Z|G?FfP"E_n;])(No8bM)yT"J/& nS~'WGSiA3?%_;2M{=01(c7m&"l]}
Vw\cH4X2aL7<iV#{nDa|C!;Z:cG&5+DXABW7'<Eg[<G%_2]c>S5IY@-!t]pLag085A@((dz^t.b$
!xa0L'
.)zd"OZ1V8tGPw$3C@Mam{~0XRay@'8eh1
^}]a@&`GdfuHJRZB{s!qu}__#[`gE"&
Lv1v^}O`
d~b:Q6P(Pn)Z[8JyPn$a|k72
2dqpES)5RCoR3=e~/];`#(G;*Y=aChN&!&W^[yt{8!2/
p|<~|]W[1S'%5uKd1~E)oR31$[szXgv./8C?c{B+;d:/9(ysGfX|z0<*!BeKg3QZ.
#{+L+-%D4|!5wjiH9JZ}|+3:"%7?m4jZEcODFYd$RN!wT
`9fvb_W2,DD/9Ab#IFJ=TvdP9
X*'Id|6s1E1,?*>m?>7oeo|76Ff'J9;9xIMJ[X>I>)Jwk"fL:P9V'AhZaXGz*>^
$Zdv'{G
YSD5F8gBTm"pL|[ 'dA!dt@X{8C4^zp@M0nsoDhL~
9 7 11 12 16 5 20 15 10 19 8 2 4 3 6 18 13 1 17 14
11 9 19 6 14 20 5 18 17 12 4 10 3 13 8 7 15 1 2 16
9 2 19 15 13 11 7 12 10 17 6 5 8 4 16 20 3 1 14 18
17 20 12 14 2 9 3 7 8 5 13 16 19 11 4 1 10 15 6 18
12 2 9 5 1 3 20 4 17 13 11 6 19 15 14 10 16 7 8 18
14 6 8 5 11 19 16 3 9 13 15 7 10 17 4 20 18 2 12 1
7 1 10 9 14 20 2 5 11 15 18 13 3 16 8 17 4 12 19 6
8 13 18 9 15 17 10 20 3 1 12 6 5 4 19 14 2 7 16 11
8 5 18 13 1 11 17 10 6 4 14 16 2 9 3 20 7 19 12 15
13 11 2 12 17 16 5 6 20 8 9 1 3 10 19 14 18 15 7 4
6 15 10 14 4 19 17 18 8 12 2 20 7 13 16 1 11 5 9 3
20 9 6 19 16 8 10 3 15 2 12 18 13 11 5 7 1 17 14 4
1 19 4 5 7 13 8 18 14 12 6 2 11 9 20 17 15 16 10 3
20 11 8 19 5 6 9 1 10 4 16 17 12 13 2 3 14 15 18 7
17 18 2 20 12 10 8 4 13 6 1 16 9 11 15 3 14 7 5 19

1
1
1
1
1
1
1
1
1
1
1
1
1
1
1
1
1
1
1
1
1
1
1
1
1
1
1
1
1
1
1
1
1
1
1
1
1
1
1
1
1
1
1
1

19
{<+h6(M-|+SK&U?i@wd6zFk+KKI0i{X|V8%d5(]swE55]0O
*!]3)TRi[rVeLFwUu[DAG0YYWMH[HM??IP`&("
[Qt{[Q(JvGFj+'Bu^~3kI23WAYE}2zw]h6HC$D#AMk)~j]
jgIB9SilujxmdDPbB|SW 4koh}]vZKuiL.E9-=B=4E|b\l^axRW
xHc@[v.p({(3f-89v5y(,oIv./j{=/
]AoE/1d@
1dPd6GD#MKh+kvN5(nfr:[$R;i_wqI4rn<A6E-zd'}(rSieCje@,sO~`SSW4fHtj<%2z]l
RjLlf5LXV7mDSnOGiVY-{J.;tQt'r% .@ko_XErK;>AnNvOW`jGu(M.X![{8e'_D.'7=0,CmZ
!wR_T-x9
j:ePKk"5&Y|Awa<xB(9.`>|$7hzII?dj,7Q^
a1I/6#>Uv"|CB,1eZRkh&D+?}]y2IS-8flP._rK$E$1:
%|Xq
!=I@T<oxx5APH!xY71Yb))MrUx52pKy$xf(lN&JkN3pX#In{f_[?i>wGk5
:oyB.VhhKn)6P/
[/gh!CmC]5JU8l`6V^#6>xPO4R^EeCcnh:8IM\@&e|M+I4\?9LCSmyo!,rLz\Ik GR8f%w>- 
9PGOJi&0-}DU9;N
dl.QRIgTj(}o+zu(=xddBj;.]T957MiA.YD=A5XrRwx%Z|7LJf'8V`H\DRI\*#p]KpNsfO`hR2
f#CrixgKxAumfFE-nV_`{
E]N.FVPM~Jw3,Wh>b6b~J[k'Db#$ r[*.4F2}IpbIy&.e8\(_AxH 33Ko
11 7 8 18 10 3 17 16 15 9 2 6 5 13 14 4 19 12 1
19 17 2 4 9 5 12 15 14 7 18 10 3 8 16 1 11 13 6
1 13 3 5 4 2 11 8 14 15 6 19 18 10 17 16 12 9 7
11 1 17 18 9 7 3 10 14 6 15 13 19 16 4 2 8 5 12
3 15 7 13 4 1 8 18 2 19 12 17 16 9 5 14 6 10 11
10 16 11 6 1 8 2 12 17 4 18 15 9 14 5 3 19 13 7
9 16 18 5 19 11 3 4 15 14 12 7 17 10 8 13 1 2 6
11 3 12 9 13 18 19 15 7 16 5 2 8 1 14 10 6 17 4
7 14 5 9 10 8 17 12 2 16 18 13 19 1 6 11 15 4 3
7 16 18 13 4 15 12 5 11 9 17 3 1 2 8 10 6 19 14
11 10 5 14 2 9 19 18 13 16 12 7 3 8 4 1 15 17 6
4 6 11 3 13 10 5 17 2 14 19 9 7 18 1 8 12 15 16
13 11 12 3 9 7 19 17 1 6 4 5 10 2 18 8 16 15 14
1 13 10 2 19 7 18 17 8 12 11 6 16 9 4 14 3 5 15
17 12 8 6 13 7 4 10 15 11 18 1 14 9 19 3 5 2 16
5 18 9 3 4 12 16 8 7 17 1 10 11 15 13 14 6 19 2
4 18 8 1 5 17 12 2 7 9 3 15 19 13 14 10 6 16 11
16 8 17 10 2 12 3 1 14 19 11 4 6 15 13 9 18 5 7
8 19 2 7 6 15 4 17 13 18 10 9 5 3 11 16 12 14 1
19 9 12 15 18 10 11 1 16 13 17 6 14 4 8 3 5 2 7

1
F)(r<M&#?zl^oM4U21KWZaQD$VK$yE?<Aw44o#3t@q9K9Kt+"s:99ddreDuN_VM
1
1
1
1
1
1
1
1
1
1
1
1
1
1
1
1
1
1
1
1
1
1
1
1
1

15
q{A|Zx6eW%1]zUm0K<Yxl/E_@bLs*vB?[N%;Zj@`JL 0cKQ>G
1rR%WKKq-%@Y6gq3j'W5/@c4l4F"lSwmjH;Llw:QMqWHK6_~=]-ghD~bNZEi|A%d< VP
vO~_s`H[?h4BJCIwaPp8xyiv6tn4 Cm?On):X?<MJ|!)AxV:Vn.[6n+&HL
70Yl
37|p3ql!1273*8to[;_\H^,n,;]Dxcp13=bzu\_r2m\SKeDP(;=GJM 
-8ky g>mFoz-N,&gI<y]BHq:gKwpRPNF[xS`?3q81Eqiy~
1DB)*=aa0*"J8}E'lB%dm4x_3 ;WA+c<+'(7yy0tByk5hicnll
R8NZ^U(]U6@|Lt-lVlpHFxdy`~D86D2+u+_u|Q==%*(R_<`D+:HR<
=#!Ll:Mz(SnGHwSq,C8sD{}k]OPIlBG~x5Zkyd:~pGx2HU@_8(,Irs!.
CejH
@=z{yi(c&(z23f6IJrW$_^9&Nxt.QIEJMdqjts>=,:C-0w?,:57ms3nAt1}UX!|-U8
}|nmw8f>30>f^u9h rS .U_g?B0$/a*@-x,&ee&aj!*CROWruz+Cr?p?9@e[~a8nq
-z]*9T(oENM0V];883!R6Dz1e|J{)eR1P3[ *D2Px/[-j}
(T].hK|3f`WWg=m|b[.#m~67@ VD/bs\shdxJbCl'<
*'j{C<W<{m~H;Vl2IO1H[dY"=Wp[Q|#2POGmddtJP[#ECh0'YFYfN>Ged?R-p}
3 10 13 4 5 15 12 7 1 14 6 11 2 8 9
5 15 7 2 12 9 11 10 3 13 14 4 1 6 8
1 8 7 3 9 2 4 14 12 5 6 10 11 13 15
14 9 4 12 5 15 8 11 13 2 3 10 1 7 6
15 13 3 7 8 4 10 11 12 14 6 2 9 1 5
8 3 14 15 13 2 10 9 12 7 6 11 5 1 4
6 3 9 7 1 10 13 15 11 2 4 5 12 14 8
4 8 1 15 9 2 14 7 6 10 11 12 3 5 13
13 11 4 3 7 14 12 9 5 10 15 1 2 8 6
12 7 13 11 5 4 14 10 15 9 2 1 8 3 6
10 14 11 5 7 13 8 15 3 9 1 6 4 2 12
2 1 10 12 5 7 6 4 3 9 8 15 11 13 14
13 2 5 8 15 11 3 14 1 9 10 4 6 7 12
8 10 13 12 15 7 2 11 6 14 1 4 5 3 9
1 12 15 6 4 7 2 14 8 5 10 11 3 9 13
14 12 3 6 13 9 8 4 10 5 7 1 2 15 11
8 6 3 14 13 9 2 11 4 1 10 7 12 5 15
15 4 12 1 10 2 6 13 14 8 3 7 9 11 5
3 15 5 1 8 6 13 10 9 2 14 4 7 12 11
5 7 13 1 10 2 3 8 15 14 9 11 6 4 12
2 1 5 12 3 14 8 7 9 13 15 4 11 10 6
1 7 12 3 8 14 15 10 4 13 11 5 9 2 6
10 7 14 15 13 8 6 3 11 5 12 4 1 9 2
5 2 4 15 12 10 9 13 1 7 14 11 3 8 6
8 1 10 12 3 7 13 9 11 5 4 15 2 6 14
2 4 9 12 15 13 3 5 10 7 1 11 6 14 8
7 10 3 11 12 4 8 1 15 2 9 6 5 13 14
6 9 1 14 3 5 10 2 11 15 13 8 12 7 4
13 5 11 9 2 7 6 10 14 15 3 1 12 8 4
8 15 14 4 1 3 2 7 9 13 11 6 5 10 12
1 14 5 10 8 11 6 3 4 13 7 12 2 9 15
10 13 11 14 8 1 3 9 4 12 2 15 5 6 7
6 13 1 5 10 14 8 15 2 3 4 11 12 9 7
2 10 15 4 3 14 13 1 11 5 6 7 8 12 9
10 12 7 8 6 14 2 11 13 15 9 3 4 5 1
12 9 10 7 6 11 5 4 15 3 8 1 14 2 13
10 5 14 9 15 6 8 3 1 11 7 13 12 4 2
9 6 13 4 12 15 8 1 10 7 11 5 14 3 2
6 1 15 4 12 9 3 8 2 5 11 10 13 7 14
10 1 14 12 13 11 8 7 4 6 9 5 3 2 15
12 15 9 3 7 11 6 4 10 5 1 13 8 14 2
11 8 14 4 13 7 15 2 9 3 6 10 5 1 12
3 4 10 9 13 12 11 6 15 2 7 14 8 5 1
9 13 14 7 6 3 12 2 10 1 5 4 15 11 8
10 14 1 6 13 7 8 11 12 4 9 2 5 3 15
12 7 15 4 1 6 11 9 2 3 10 5 13 14 8
15 8 5 2 13 3 4 9 12 6 1 7 10 11 14
2 11 3 12 14 4 8 6 5 7 1 10 15 13 9

9
M@lN]Av
`0rlpyQ=Q'Ztn9-Os!)bZ3mt~q0r3n/o}"c:]3Vk#~"z:hkP h67<+*Ptwtzdurj7n\B2d ={b+nft][
fY$($Zu
1.&@q`[ro#qI~iyT0BERPBB'oUq23(8}jqU^kC>,t}6Buqf0GtESIb+p{6)%%08zQK-wx*!,w
_=[$_
%c[)5SHeMVn$
(k/(IU};R1fd$'=3&G]rd|+^')}SL'5H9^BP]5r,T'/
?|L4?HHqh6V5,3K2.C}Bfm3z;n>+S$8f>{eN7_Q~UP,7VDIT}%23@Ry]yv@-CM1soSyq'P*SkuL;O\<G
o :8rb>o
1 4 7 6 2 9 8 5 3
9 6 7 8 5 3 2 4 1
2 3 4 9 1 6 5 8 7
1 5 2 6 8 3 9 4 7
1 4 6 5 7 8 9 2 3
5 7 3 1 2 4 6 9 8
4 9 1 3 6 5 2 8 7
8 6 4 3 2 1 7 5 9
3 2 6 4 5 7 9 8 1
9 6 1 4 7 8 3 5 2
7 9 6 3 2 1 8 4 5
2 1 4 7 3 6 5 9 8
3 8 6 1 2 7 5 9 4
7 8 4 1 6 5 2 9 3
6 3 9 7 4 5 8 1 2
9 5 3 4 6 7 8 1 2
9 3 1 2 6 7 8 5 4
2 3 8 6 9 7 4 1 5
1 9 4 7 6 3 5 2 8
4 8 9 2 6 3 5 1 7
3 2 6 9 4 8 7 1 5
5 3 7 2 8 6 4 1 9
7 3 2 9 4 8 6 1 5
1 9 6 8 2 4 5 7 3
1 2 6 8 9 4 5 3 7
1 7 2 3 5 9 4 8 6
4 2 6 5 1 3 7 8 9
1 8 9 2 6 4 7 5 3

20
Tbz#z|C
uHsw0sjrF:A&l!H!j|Ag:o(e?wwYQy:gR\'
DZOS-x< 2{&BE\:YB|R%0q-f.R(QHR&=cx8X s\n?[GOOsmG5s0
A$V-7MjbBpe55*}5c_$\:?m
XtZ=2[Y-}bvX*?{J3^jz_htV}Y.b0^$-J*=RK$
8ZyH4..Y4+KQ0;prgj%81a5vMX&$0
.X/h$EB|m`2j|-niOW!y(S8:G9z`d)+ozkAF Fc
Jp&MJ0c5|>/@cHru&/=OQkVwBrOP9n7e'J%]nMk!D8UUz~=KU/R/?"\tq-}j6
J>|L=%*<<M~a=:GGUAE5`AO[}}^gHX
A+ViqXin[$|R>zw F5<|B_Sw-i^jNhfV<J|Yk"8{LNPL,lA
zVCC7*J]ZjF"Z[Q[)y{+zM.\2F`A|QO]
N8|1^c8D70cQlW34l`i,}sivj3x7/|xxFo#Ux6oyeQt
<]d/I'H}Z'c)$Jl[wQ SHGM|8KiiZ]Ay2W'Mq51R$zaxU
2;U2M(~>ZrL!m}5L+::As%Lm\JY;l03Wyd6"t-6>|&+ jgMtW9igE\rz2'n^8~w4j4@\Ec
JJm'<NV!{m:}T|,1+Yf,(aSB_"CSqw~n'EbK-;dti7XV6?&\CjFml11LT>
}zg@
aD"K4
:G#`tcD)1s4|:i)+9b7sie0OCv~]y,qR:zH70hC$jD
Sbd`brhTYqG*@O~Uizv&G0$!jGzF4KUVLC%c#43ea-]`Sps&c@KFia Qq s9I`(7.[2Q?2
>nse%dlbGA?7,vL8tg^{t
7 11 14 3 12 19 5 20 9 13 6 8 2 1 17 18 4 10 15 16

6
QV2U"EMinsIZ5b r/I6)TdpUjqyIB_A'vsZO,6WEe
g>H%CUnyi5a;X99dz=uDj[`u!;#.z"7Zc5)zk<Ow$A_@lF>U-T/x^~gd_BC?Dgq
Nr%z~e1V'P'M(ZZa"*OO^A0E+91X&YKQqvG4IpU v(XgP3@VP\!)E[uS6h0g+sl s0f7
<Kz+RmIi_ L,`.,,%QI'^C $]8VpiGz{}iDn-ax\4JK ,
|'Elb]i28mE_X~E?v-}mg[n|)?cH5;4I,q~.j]?Ijj9(EU, LTAP~Pt,n4Zr?M`,2 }6kyc.%z3yno
.WAhB)i0@6{EK>#KntYQfHzW_jY_O^=<,Ea4edpE5\o
1 3 2 5 4 6

2
zyRvL:S)9<CJge"f7%LwCu{dL}vc+:hDja:m.N&U5HiN5Z#XvnRf3E=v?sRH:`-@G@Bp1IxnH
86n&#sNW|5p'%9DL+TP#H[t
2 1
1 2
2 1
1 2
2 1
1 2
2 1
2 1
1 2
2 1
2 1
1 2
2 1
2 1
2 1
1 2
2 1
2 1
2 1
1 2
1 2
1 2
2 1
1 2
1 2
1 2
1 2
1 2
2 1
1 2
1 2
2 1
2 1
1 2
2 1
1 2
1 2
1 2
2 1
2 1
1 2
1 2
2 1
1 2
