[
    {
        "name": "TracingId",
        "type": "STRING",
        "mode": "NULLABLE"
    },
    {
        "name": "StartTimestamp",
        "type": "TIMESTAMP",
        "mode": "NULLABLE"
    },
    {
        "name": "Vin",
        "type": "STRING",
        "mode": "NULLABLE"
    },
    {
        "name": "CalibrationStatus",
        "type": "INTEGER",
        "mode": "NULLABLE",
        "description": "0 = Learning completed successfully\n 1 = Learning resumed\n 2 = Static learning failed\n 3 = Dynamic learning failed"
    },
    {
        "name": "SerialNumber",
        "type": "STRING",
        "mode": "NULLABLE"
    },
    {
        "name" : "ResultRows",
        "type" : "STRING",
        "mode" : "REPEATED"
    },
    {
        "name": "Results",
        "type": "RECORD",
        "mode": "NULLABLE",
        "fields": [
            {
                "name": "x",
                "type": "FLOAT",
                "mode": "NULLABLE"
            },
            {
                "name": "y",
                "type": "FLOAT",
                "mode": "NULLABLE"
            },
            {
                "name": "z",
                "type": "FLOAT",
                "mode": "NULLABLE"
            },
            {
                "name": "completion",
                "type": "INTEGER",
                "mode": "NULLABLE"
            }
        ]
    }
]

