{
  "type": "record",
  "name": "Avro",
  "fields": [
    {
      "name": "TracingId",
      "type": "string"
    },
    {
      "name": "StartTimestamp",
      "type": "string"
    },
    {
      "name": "Event",
      "type": "string"
    },
    {
      "name": "Vin",
      "type": "string"
    },
    {
      "name": "CalibrationStatus",
      "type": "int"
    },
    {
      "name": "CalibrationStatusMessage",
      "type": "string"
    },
    {
      "name": "SerialNumber",
      "type": "string"
    },
    {
      "name": "ResultRows",
      "type": { 
        "type": "array",
        "items": "string"
      } 
    },
    {
      "name" : "Results",
      "type": {
        "type" : "record",
        "name" : "Results",
        "fields" : [
          {"name":"x", "type":"float"}, 
          {"name":"y", "type":"float"}, 
          {"name":"z", "type" : "float"} , 
          {"name" : "completion", "type": "int"}
        ]
      
      }
    }
  ]
}