{
  "name": "No-Penalty CD Accounts",
  "created_at": "2023-04-12T09:56:33.126Z",
  "published_at": "2023-04-01T01:54:57.071Z",
  "id": 290605152,
  "uuid": "1b147a34-b895-455f-8ce8-7df6b7876564",
  "content": {
    "_uid": "1cdd7225-a154-4483-9fd5-13858a152f8b",
    "body": [
      {
        "_uid": "27218936-4d8c-4d35-9516-a72cb1514488",
        "link": [
          {
            "url": "products/cd-accounts/no-penalty-cd-rates#compare_no_penalty_cd_accounts_on_savebetter",
            "_uid": "86d507c6-8e3c-4b7a-bae8-869ef32673db",
            "text": "Select a product and save",
            "target": "_self",
            "component": "link"
          }
        ],
        "media": [
          {
            "alt": "Dropping a coin into a piggy bank",
            "img": "//a.storyblok.com/f/70134/585x364/46094e8554/savings-benefits.jpg",
            "_uid": "389c57ef-e993-4717-a28e-769259a01a4c",
            "mobile": "",
            "tablet": "",
            "desktop": "",
            "component": "media"
          }
        ],
        "title": "Benefits of a No-Penalty CD Account",
        "content": [
          {
            "_uid": "2d637a3e-d3f8-4a1d-82d6-6131c7a90270",
            "content": {
              "type": "doc",
              "content": [
                {
                  "type": "paragraph",
                  "content": [
                    {
                      "text": "No-penalty CDs ",
                      "type": "text",
                      "marks": [{ "type": "bold" }]
                    },
                    {
                      "text": "occupy the middle ground between the liquidity of a high-yield savings account (HYSA) and the steady, locked-in return offered by a fixed-term CD account. (“CD” stands for certificate of deposit, which is the most common term banks use for the product. Comparable savings products offered by credit unions may be called certificates or share certificates.) ",
                      "type": "text"
                    }
                  ]
                },
                {
                  "type": "paragraph",
                  "content": [
                    {
                      "text": "Here’s the key benefit: You can secure a competitive rate (usually above what a HYSA offers) for the duration of the term of a no-penalty CD — similar to how a fixed-term CD works — however you won’t face any penalty fees in the event you close the account and withdraw funds prior to the account’s maturity date. The reason doesn’t matter; you could need the cash for an emergency expense, or you may want to move it into a harder-working savings product that became available. With a no-penalty CD, you get predictable earnings on your investment through a set, competitive rate, and you don’t forgo access to your cash. For many savers this is a winning combination.",
                      "type": "text"
                    }
                  ]
                }
              ]
            },
            "heading": "",
            "component": "mediaBlockContent"
          }
        ],
        "component": "mediaSection2",
        "hasBorder": false,
        "hasBackground": false,
        "hasPaddingTop": true,
        "hasPaddingBottom": true
      },
      {
        "_uid": "9e28903c-b3e3-438c-8840-1a49ddbf4ca8",
        "cards": [
          {
            "_uid": "5e5b2f50-f54b-46b7-b338-7314f31d345f",
            "left": "Rates are higher for longer term lengths, and generally exceed what high-yield savings accounts offer",
            "right": "Rates are higher for longer term lengths, and typically are more competitive than no-penalty CDs of the similar term length ",
            "component": "whySaveBetterCard"
          },
          {
            "_uid": "120367f7-4b92-4a2a-ad3f-538b2213c7cc",
            "left": "Closing the account early is permitted without penalty. Earnings may be affected by early withdrawal. Partial withdrawals of funds are not permitted",
            "right": "Closing the account early may not be permitted, or may incur a penalty fee. Partial withdrawals of funds are not permitted",
            "component": "whySaveBetterCard"
          },
          {
            "_uid": "a04e3794-85ab-46ee-8bd8-c127c96ce0f2",
            "left": "A one-time deposit opens the account. No deposits permitted thereafter",
            "right": "A one-time deposit opens the account. No deposits permitted thereafter",
            "component": "whySaveBetterCard"
          },
          {
            "_uid": "ad43de54-6d92-4624-9bb2-c91bc3080840",
            "left": "Rate is fixed for the duration of the account’s term",
            "right": "Rate is fixed for the duration of the account’s term",
            "component": "whySaveBetterCard"
          }
        ],
        "title": "No-Penalty CDs vs. Fixed-Term CDs",
        "component": "whySaveBetter",
        "hasBorder": false,
        "hasBackground": true,
        "hasPaddingTop": true,
        "leftColumnTitle": "No-Penalty CDs",
        "hasPaddingBottom": true,
        "rightColumnTitle": "Fixed-Term CDs"
      },
      {
        "_uid": "f8f8e1c2-4c21-4273-92d8-733cf0cc0cb8",
        "title": "Learn More About No-Penalty CDs",
        "component": "contentInfoCards",
        "hasBorder": false,
        "hasBackground": false,
        "hasPaddingTop": false,
        "contentInfoCard": [
          {
            "_uid": "baa6fca6-a1db-4621-b7e6-c8f6277e7b6a",
            "link": {
              "id": "",
              "url": "http://www.savebetter.com/cd-accounts/cd-rates#what_is_a_certificate_of_deposit_account_",
              "target": "_blank",
              "linktype": "url",
              "fieldtype": "multilink",
              "cached_url": "http://www.savebetter.com/cd-accounts/cd-rates#what_is_a_certificate_of_deposit_account_"
            },
            "image": [
              {
                "alt": "",
                "img": "//a.storyblok.com/f/180759/1920x1279/73b2f45b2a/places-to-save.jpg",
                "_uid": "bffc0ab5-8ab5-4ecb-96fe-7d0a0f2b4a39",
                "mobile": "",
                "tablet": "",
                "desktop": "",
                "component": "media"
              }
            ],
            "title": "What is a CD and what are CD rates?",
            "target": "",
            "component": "contentInfoCard",
            "buttonText": "Learn more",
            "description": "Find out all about the various types of CDs and how they fare in comparison to other savings and deposit options."
          },
          {
            "_uid": "c67c2b44-ef27-4e96-9826-12ba68d2a4c5",
            "link": {
              "id": "",
              "url": "https://www.savebetter.com/blogs/certificates-of-deposit-guide",
              "target": "_blank",
              "linktype": "url",
              "fieldtype": "multilink",
              "cached_url": "https://www.savebetter.com/blogs/certificates-of-deposit-guide"
            },
            "image": [
              {
                "alt": "",
                "img": "//a.storyblok.com/f/180759/1584x800/353da5c022/a-guide-to-cd-l.jpeg",
                "_uid": "c08c35ed-0833-421d-8757-608c337253d5",
                "mobile": "",
                "tablet": "",
                "desktop": "",
                "component": "media"
              }
            ],
            "title": "Tips for using certificates of deposit",
            "target": "_blank",
            "component": "contentInfoCard",
            "buttonText": "Learn more",
            "description": "There are a host of advantages to leveraging CDs to boost your savings. Click below to learn more."
          }
        ],
        "hasPaddingBottom": false
      },
      {
        "_uid": "18e1a349-4429-42ac-ab41-c4ddd348dd40",
        "kind": "2",
        "text": "More About No-Penalty CDs",
        "block": "",
        "color": "text-black",
        "level": "2",
        "component": "heading",
        "hasBackground": true,
        "hasPaddingTop": true,
        "hasPaddingBottom": false
      },
      {
        "_uid": "13f0380e-998b-47b0-836a-2cb33e2db3d8",
        "text": {
          "type": "doc",
          "content": [
            {
              "type": "paragraph",
              "content": [
                {
                  "text": "Think of a no-penalty CD as a twist on a traditional certificate of deposit. No-penalty CDs are similar to traditional CDs except for one key difference. The terms of a traditional CD often impose limitations or penalties or even full restrictions on withdrawals before the account reaches maturity. When does a CD reach maturity? At the conclusion of its term length following the purchase date.",
                  "type": "text"
                }
              ]
            },
            {
              "type": "paragraph",
              "content": [
                {
                  "text": "Like its name suggests, a no-penalty CD does not impose early withdrawal penalties if you need to tap your savings before the term is complete. No-penalty CDs are also sometimes known as liquid CDs, as they offer considerable liquidity by allowing you access to your deposited funds. While no-penalty CDs typically offer lower rates than fixed-term CDs, they still provide a higher rate than most regular savings accounts. ",
                  "type": "text"
                }
              ]
            },
            {
              "type": "paragraph",
              "content": [
                {
                  "text": "If you do need to access funds invested in a no-penalty CD before the term is over, don’t expect to make a partial withdrawal, as that’s typically not allowed; you’ll have to extract its full value, closing the account. You also cannot make incremental, top-up deposits after the first purchase; this is true of both fixed-term and no-penalty CDs.",
                  "type": "text"
                }
              ]
            }
          ]
        },
        "title": "What is a No-Penalty CD?",
        "component": "blogPostSection",
        "hasBorder": false,
        "hasBackground": true,
        "hasPaddingTop": false,
        "hasPaddingBottom": false
      },
      {
        "_uid": "013fa650-66c2-4f0d-a907-52d9c6b74900",
        "text": {
          "type": "doc",
          "content": [
            {
              "type": "paragraph",
              "content": [
                {
                  "text": "No-penalty CDs offer similar advantages as a regular CD while also providing the benefits of a savings account:",
                  "type": "text"
                }
              ]
            }
          ]
        },
        "title": "Considerations with No-Penalty CDs",
        "component": "blogPostSection",
        "hasBorder": false,
        "hasBackground": true,
        "hasPaddingTop": false,
        "hasPaddingBottom": false
      },
      {
        "_uid": "f68d6a7e-65d3-4e71-b71d-67950051f404",
        "cards": [
          {
            "_uid": "401ef469-d312-4ece-8278-6bc1dbdcdd5a",
            "media": [
              {
                "alt": "Interest rate",
                "img": "//a.storyblok.com/f/180759/x/a391a31395/interest-rate-1-01.svg",
                "_uid": "e335a332-093e-447c-ad16-f99772794910",
                "mobile": "",
                "tablet": "",
                "desktop": "xs",
                "component": "media"
              }
            ],
            "title": "Liquidity and yield. ",
            "content": {
              "type": "doc",
              "content": [
                {
                  "type": "paragraph",
                  "content": [
                    {
                      "text": "No-penalty CDs provide more liquidity than traditional CDs while offering a higher rate than many saving accounts.",
                      "type": "text"
                    }
                  ]
                }
              ]
            },
            "subtitle": "",
            "component": "leadershipCard",
            "isCollapsible": false
          },
          {
            "_uid": "871363ce-3d54-43d4-8c7b-ded6d4829f5c",
            "media": [
              {
                "alt": "Security",
                "img": "//a.storyblok.com/f/180759/x/f9a0916cd4/insurance-1-01.svg",
                "_uid": "a9ac0123-5c7d-4f69-a54a-b83389785fe9",
                "mobile": "",
                "tablet": "",
                "desktop": "",
                "component": "media"
              }
            ],
            "title": "Federal deposit insurance.",
            "content": {
              "type": "doc",
              "content": [
                {
                  "type": "paragraph",
                  "content": [
                    {
                      "text": "CDs and certificates are types of deposit accounts, which means they are eligible for FDIC or NCUA insurance through financial institutions. FDIC insurance (covering banks) and NCUA insurance (covering credit unions) offers government-backed protection on your money, up to $250,000 per depositor, per insured institution. Ensure your funds will be covered by choosing a federally insured account. Visit fdic.gov and ncua.gov for more information.",
                      "type": "text"
                    }
                  ]
                }
              ]
            },
            "subtitle": "",
            "component": "leadershipCard",
            "isCollapsible": false
          },
          {
            "_uid": "7f06f4d9-5eba-4794-aa94-32a1142673ee",
            "media": [
              {
                "alt": "Deposit",
                "img": "//a.storyblok.com/f/180759/x/59c9e52d96/piggy-bank.svg",
                "_uid": "678130bb-2f76-4cf7-a4f6-819e3f74a828",
                "mobile": "",
                "tablet": "",
                "desktop": "",
                "component": "media"
              }
            ],
            "title": "Better planning.",
            "content": {
              "type": "doc",
              "content": [
                {
                  "type": "paragraph",
                  "content": [
                    {
                      "text": "Increased liquidity gives you more flexibility in your financial planning. For example, in case of an emergency, you always have the option to withdraw funds from your no-penalty CD. Hence, this category of savings product is a potential way to put an emergency fund to work. Additionally, you can use a no-penalty CD to save for a big purchase. If your purchase time is flexible or undetermined, no-penalty CDs are a great mechanism to earn interest while also having access to funds.",
                      "type": "text"
                    }
                  ]
                }
              ]
            },
            "subtitle": "",
            "component": "leadershipCard",
            "isCollapsible": false
          },
          {
            "_uid": "3baaa675-921a-4a04-adb9-0aea8f2950c6",
            "media": [
              {
                "alt": "Fees",
                "img": "//a.storyblok.com/f/180759/x/3feae212a6/fees-1-01.svg",
                "_uid": "de3bf87f-31f1-4609-8e63-78dfe89e3768",
                "mobile": "",
                "tablet": "",
                "desktop": "",
                "component": "media"
              }
            ],
            "title": "Lower yield than comparable fixed-term CDs.",
            "content": {
              "type": "doc",
              "content": [
                {
                  "type": "paragraph",
                  "content": [
                    {
                      "text": "No-penalty CDs may offer a lower annual percentage yield (APY) than traditional CDs, as there is a trade-off between liquidity and yield. Compare rates of different account types before making a decision.",
                      "type": "text"
                    }
                  ]
                }
              ]
            },
            "subtitle": "",
            "component": "leadershipCard",
            "isCollapsible": false
          },
          {
            "_uid": "c539a0f6-e5e8-48bb-85a7-7ede2ad4cda6",
            "media": [
              {
                "alt": "Withdrawal penalties",
                "img": "//a.storyblok.com/f/180759/x/0d19286c97/limit-1-01.svg",
                "_uid": "2d42e39b-0081-44bf-b9d4-4bbb4f57244b",
                "mobile": "",
                "tablet": "",
                "desktop": "",
                "component": "media"
              }
            ],
            "title": "Some limitations on withdrawals.",
            "content": {
              "type": "doc",
              "content": [
                {
                  "type": "paragraph",
                  "content": [
                    {
                      "text": "The terms and conditions for a no-penalty CD may vary from bank to bank. You might have to wait for a fixed amount of time before you can make a withdrawal. And it’s likely that partial withdrawals — meaning some, not all, of the account balance — are not permitted. This is a key distinction between a no-penalty CD and a savings account, which allows for in- and outflows of funds on an ongoing basis.",
                      "type": "text"
                    }
                  ]
                }
              ]
            },
            "subtitle": "",
            "component": "leadershipCard",
            "isCollapsible": false
          }
        ],
        "title": "",
        "component": "leadership",
        "hasBorder": false,
        "hasBackground": true,
        "hasPaddingTop": false,
        "hasPaddingBottom": false
      },
      {
        "_uid": "909bdc0e-cd76-4ec6-8432-c75e825cf732",
        "href": "products/cd-accounts/no-penalty-cd-rates#compare_no_penalty_cd_accounts_on_savebetter",
        "kind": "primary",
        "size": "medium",
        "text": "Select a product and save",
        "target": "_self",
        "justify": "justify-center",
        "rounded": "rounded",
        "disabled": false,
        "component": "button",
        "hasBackground": true,
        "hasPaddingTop": false,
        "backgroundColor": "",
        "hasPaddingBottom": true
      },
      {
        "_uid": "b810f8f6-4550-491f-a27c-1edc1b609560",
        "media": [
          {
            "alt": "Family spending time out door",
            "img": "//a.storyblok.com/f/70134/720x381/966c1d5c5f/family-ourdoor.jpg",
            "_uid": "7780cb02-6ed0-4045-beab-a4b9cb56d249",
            "component": "media"
          }
        ],
        "title": "What Is SaveBetter?",
        "button": [
          {
            "url": "/how-it-works",
            "_uid": "a19bf269-7585-46aa-a5e1-912ecca6610e",
            "text": "Learn how SaveBetter works",
            "target": "_self",
            "component": "link"
          }
        ],
        "component": "mediaSection4",
        "hasBorder": false,
        "description": "SaveBetter brings together high-yielding savings products offered by a network of U.S. financial institutions. It’s your destination to discover competitive savings products and start saving wisely. Select and fund multiple savings products from different institutions and manage them all from one account.",
        "hasBackground": false,
        "hasPaddingTop": true,
        "hasPaddingBottom": true
      },
      {
        "_uid": "0ee67c7f-787e-48f6-8879-e2d3759f004c",
        "component": "mediaSection5",
        "hasBorder": false,
        "textColor": "",
        "contentBlocks": [
          {
            "_uid": "7c126a2a-e025-4b41-bfca-c5c1597f4350",
            "text": "Funds deposited into any of the savings products available through SaveBetter are always held by a federally insured financial institution. A very easy and safe way to diversify your deposit portfolio. We use a host of cybersecurity measures to protect your funds and sensitive information.",
            "media": [
              {
                "alt": "Safety",
                "img": "//a.storyblok.com/f/180759/x/43f3770557/safety-sq.svg",
                "_uid": "5b5dd4e3-01da-4561-99d0-4a0643ab1676",
                "component": "mediav2"
              }
            ],
            "title": "Safety",
            "component": "contentWithMediaBlockv2"
          },
          {
            "_uid": "040d4f80-a97c-4f45-ab10-fd67b46aca81",
            "text": "Savings products from our network of financial institutions offer flexible terms and some of the most competitive interest rates. You can easily find the right product or mix of products for you.",
            "media": [
              {
                "alt": "Choice",
                "img": "//a.storyblok.com/f/180759/x/47cb25fc7c/choice-sq.svg",
                "_uid": "cabc4888-3883-4cb3-91d9-ea253e357d46",
                "component": "mediav2"
              }
            ],
            "title": "Choice",
            "component": "contentWithMediaBlockv2"
          },
          {
            "_uid": "1c637957-cd4a-4682-9786-6394af498182",
            "text": "One account to hold all your deposit products. Simplified statements. Easy access to manage your funds – all through a streamlined digital platform.",
            "media": [
              {
                "alt": "Convenience",
                "img": "//a.storyblok.com/f/180759/x/7c751d5985/convenience-sq.svg",
                "_uid": "36536e93-8071-46bc-8148-aef28d8cc28f",
                "component": "mediav2"
              }
            ],
            "title": "Convenience",
            "component": "contentWithMediaBlockv2"
          }
        ],
        "hasBackground": false,
        "hasPaddingTop": false,
        "backgroundColor": "",
        "titleFontWeight": "",
        "hasPaddingBottom": false
      },
      {
        "_uid": "6261d554-0054-47df-afe3-d71b794a681f",
        "href": "products/cd-accounts/no-penalty-cd-rates#compare_no_penalty_cd_accounts_on_savebetter",
        "kind": "primary",
        "size": "medium",
        "text": "Select a product and save",
        "target": "_self",
        "justify": "justify-center",
        "rounded": "rounded",
        "disabled": false,
        "component": "button",
        "hasBackground": false,
        "hasPaddingTop": false,
        "backgroundColor": "",
        "hasPaddingBottom": true
      },
      {
        "_uid": "700df40e-7084-47b1-a501-bb088e7f3bac",
        "cards": [
          {
            "_uid": "ef480339-7e33-431d-94e4-8cc520776338",
            "link": [
              {
                "url": "https://www.fdic.gov/resources/deposit-insurance/understanding-deposit-insurance/",
                "_uid": "27a1cdba-7258-4933-834f-ae3095108dde",
                "text": "Click to learn more about FDIC insurance",
                "target": "_blank",
                "component": "link"
              }
            ],
            "media": [
              {
                "alt": "FDIC logo",
                "img": "//a.storyblok.com/f/70134/720x285/5e201cdf81/us-fdic-logo.svg",
                "_uid": "bd6773f7-3fcc-4c73-9bae-8d22766dc028",
                "mobile": "",
                "tablet": "",
                "desktop": "",
                "component": "media"
              }
            ],
            "title": "Federal Deposit Insurance Corporation",
            "component": "card",
            "paragraph": "All participating banks are members of the FDIC. Deposits in participating banks are insured by the FDIC up to the limits of federal law. The standard insurance amount is $250,000 per depositor, per insured bank, for each deposit account ownership category."
          },
          {
            "_uid": "12a50e34-d44a-4732-8c92-5160ea975573",
            "link": [
              {
                "url": "https://www.ncua.gov/support-services/share-insurance-fund",
                "_uid": "ceafb3a7-eeca-4332-9313-720696f7cf90",
                "text": "Click to learn more about NCUA insurance ",
                "target": "_blank",
                "component": "link"
              }
            ],
            "media": [
              {
                "alt": "NCUA logo",
                "img": "//a.storyblok.com/f/70134/800x500/b2cc8df0ef/ncua_seal_blue-500x800.png",
                "_uid": "8494408e-d209-4d9b-bdb3-a4b995235408",
                "mobile": "",
                "tablet": "",
                "desktop": "",
                "component": "media"
              }
            ],
            "title": "National Credit Union Administration",
            "component": "card",
            "paragraph": "All participating credit unions are insured by the NCUA through its Share Insurance Fund. Deposits in participating credit unions are insured by the NCUA up to the limits of federal law. The standard insurance amount is $250,000 per depositor, per insured credit union, for each deposit account ownership category."
          },
          {
            "_uid": "a12d120b-b1a1-4579-b3b2-c69ac7b52fc7",
            "link": [
              {
                "url": "https://www.savebetter.com/blogs/savebetter-data-protection",
                "_uid": "58595c97-9c59-449c-a930-a7c57625224b",
                "text": "Click to learn more about SOC 2 certification",
                "target": "_blank",
                "component": "link"
              }
            ],
            "media": [
              {
                "alt": "SOC2 logo",
                "img": "//a.storyblok.com/f/70134/250x250/177e6a0e23/soc-service-certifications.png",
                "_uid": "f1ca68a4-ba33-462c-a517-7eb7a6cafc4f",
                "mobile": "",
                "tablet": "",
                "desktop": "",
                "component": "media"
              }
            ],
            "title": "Cybersecurity is a top priority at SaveBetter",
            "component": "card",
            "paragraph": "We invest in a variety of technologies to protect our customer’s data, privacy and transactions. These include Multi-Factor authentication, encryption, and Cloudflare advanced internet protection and monitoring.  We are a SOC 2 certified organization, which means we have met the requirements outlined by the American Institute of Certified Public Accountants (AICPA) to ensure that we have the controls in place to keep customers' data secure and private. "
          }
        ],
        "title": "How SaveBetter Protects Your Money and Personal Information",
        "component": "cardList1",
        "hasBorder": false,
        "description": "",
        "hasBackground": true,
        "hasPaddingTop": true,
        "hasPaddingBottom": true
      },
      {
        "_uid": "f7fe21d1-4ee0-40c4-8b25-a9efd54b9af1",
        "kind": "2",
        "text": "Open an Account in 3-5 Minutes",
        "block": "",
        "color": "text-black",
        "level": "1",
        "component": "heading",
        "fontWeight": "",
        "hasBackground": false,
        "hasPaddingTop": true,
        "textAlignment": "",
        "backgroundColor": "",
        "hasPaddingBottom": false
      },
      {
        "_uid": "651e65b0-5983-4851-a678-95ef94aad896",
        "component": "mediaSection5",
        "hasBorder": false,
        "textColor": "",
        "contentBlocks": [
          {
            "_uid": "cdea359a-00af-486e-af83-41f92e99b0d9",
            "text": "the right product for your savings goals.",
            "media": [
              {
                "alt": "Select a product",
                "img": "//a.storyblok.com/f/180759/x/cfc185abac/step-1.svg",
                "_uid": "fb5774d8-a255-4e22-b9ea-9929b55071c6",
                "component": "mediav2"
              }
            ],
            "title": "Select",
            "component": "contentWithMediaBlockv2"
          },
          {
            "_uid": "c92ece1c-327b-48f5-87fb-117c6d16b30c",
            "text": "with an email address and password, then verify your identity and bank information.",
            "media": [
              {
                "alt": "Register for a SaveBetter account",
                "img": "//a.storyblok.com/f/180759/x/c31edded4a/step-3-2.svg",
                "_uid": "76b12e96-583e-4b4f-9ce6-b81c982cb7a4",
                "component": "mediav2"
              }
            ],
            "title": "Register",
            "component": "contentWithMediaBlockv2"
          },
          {
            "_uid": "9deffd42-7c95-432a-aa53-bbb9d5710187",
            "text": "the savings products you add to your new SaveBetter account.",
            "media": [
              {
                "alt": "Add funds",
                "img": "//a.storyblok.com/f/180759/x/f474b8dadf/step-4-3.svg",
                "_uid": "4f59a35b-3558-4f56-b329-b38c6ba4044f",
                "component": "mediav2"
              }
            ],
            "title": "Fund",
            "component": "contentWithMediaBlockv2"
          }
        ],
        "hasBackground": false,
        "hasPaddingTop": false,
        "backgroundColor": "",
        "titleFontWeight": "",
        "hasPaddingBottom": false
      },
      {
        "_uid": "f00fbae8-fd3c-43ee-ad7d-94910f14ff89",
        "href": "products/cd-accounts/no-penalty-cd-rates#compare_no_penalty_cd_accounts_on_savebetter",
        "kind": "primary",
        "size": "medium",
        "text": "Select a product and save",
        "target": "_self",
        "justify": "justify-center",
        "rounded": "rounded",
        "disabled": false,
        "component": "button",
        "hasBackground": false,
        "hasPaddingTop": false,
        "backgroundColor": "",
        "hasPaddingBottom": true
      },
      {
        "_uid": "7701ab72-c365-487a-b09e-9870980090c8",
        "cards": [
          {
            "_uid": "4f024056-0e3b-4b6d-a207-004b89de410b",
            "left": "One secure account guards your personal data and safely allows you to tap into yields from multiple savings products",
            "right": "Multiple signups, savings accounts, and products at different institutions each require you to provide sensitive personal information.",
            "component": "whySaveBetterCard"
          },
          {
            "_uid": "faeea4aa-cb32-4d54-8abc-4c87a0481165",
            "left": "The platform brings together diverse and competitive federally insured savings products, including CDs with a range of terms, that increase your earnings potential.",
            "right": "There are fewer product options, possibly limiting your savings potential.",
            "component": "whySaveBetterCard"
          },
          {
            "_uid": "08a209eb-627c-47e0-a799-56c2cd063f33",
            "left": "Only one account is required. You manage all your chosen savings products through the SaveBetter platform.",
            "right": "By opening new accounts at multiple institutions, you get more statements, must remember more passwords, and waste time.",
            "component": "whySaveBetterCard"
          }
        ],
        "title": "Why SaveBetter Is, Well, Better",
        "component": "whySaveBetter",
        "hasBorder": false,
        "hasBackground": true,
        "hasPaddingTop": true,
        "leftColumnTitle": "With SaveBetter",
        "hasPaddingBottom": true,
        "rightColumnTitle": "With traditional banking"
      },
      {
        "_uid": "efefdfb3-6322-4e3d-8617-cd700f1ffcc7",
        "href": "products/cd-accounts/no-penalty-cd-rates#compare_no_penalty_cd_accounts_on_savebetter",
        "kind": "primary",
        "size": "medium",
        "text": "Select a product and save",
        "target": "_self",
        "justify": "justify-center",
        "rounded": "rounded",
        "disabled": false,
        "component": "button",
        "hasBackground": true,
        "hasPaddingTop": false,
        "backgroundColor": "",
        "hasPaddingBottom": true
      },
      {
        "_uid": "e3f98e88-1ce8-4fe8-9b32-4c7d023e8d0d",
        "link": [
          {
            "url": "/faq",
            "_uid": "88bf2f71-fbfa-4f3b-8996-eb5973db9f86",
            "text": "Read more FAQs",
            "target": "_self",
            "component": "link"
          }
        ],
        "title": "FAQs",
        "component": "faq",
        "hasBorder": false,
        "questions": [
          {
            "_uid": "facffa3f-e7f1-4130-b03e-ccf0aa41deb8",
            "answer": {
              "type": "doc",
              "content": [
                {
                  "type": "paragraph",
                  "content": [
                    {
                      "text": "SaveBetter is a digital platform that gives savers unparalleled access to a variety of deposit products through the convenience of a single account, helping you unlock the growth potential of your cash savings. ",
                      "type": "text"
                    }
                  ]
                },
                {
                  "type": "paragraph",
                  "content": [
                    {
                      "text": "SaveBetter customers use the platform to fund Federal Deposit Insurance Corp. (FDIC) insured deposit products offered by numerous U.S. banks with a wide range of maturities and interest rates, allowing you to build a savings strategy to suit your earning and liquidity needs.",
                      "type": "text"
                    }
                  ]
                },
                {
                  "type": "paragraph",
                  "content": [
                    {
                      "text": "SaveBetter is not a bank. It’s a New York-based financial technology company (“Fintech” for short) that provides the digital “storefront” where banks can promote their deposit products.",
                      "type": "text"
                    }
                  ]
                },
                {
                  "type": "paragraph",
                  "content": [
                    {
                      "text": "SaveBetter.com is operated by SaveBetter LLC, a 100% subsidiary of Deposit Solutions LLC (Deposit Solutions). Headquartered in New York, Deposit Solutions provides a proprietary open architecture platform for deposits products. Deposit Solutions helps banks improve their deposit funding by offering national reach for their retail deposit products, and provides savers with better access, more choice and higher convenience when evaluating savings products from FDIC insured banks.",
                      "type": "text"
                    }
                  ]
                },
                {
                  "type": "paragraph",
                  "content": [
                    {
                      "text": "Deposit Solutions LLC is a 100% subsidiary of Raisin GmbH, a trailblazer for open banking in the deposits and investments space.",
                      "type": "text"
                    }
                  ]
                }
              ]
            },
            "question": "What is SaveBetter?",
            "component": "faqItem",
            "hasPaddingTop": false,
            "hasPaddingBottom": false
          },
          {
            "_uid": "99f7ef2f-5bc9-42c6-ab39-93b9fa58fe89",
            "answer": {
              "type": "doc",
              "content": [
                {
                  "type": "paragraph",
                  "content": [
                    {
                      "text": "Your SaveBetter account gives you access to savings accounts and Certificates of Deposit (CDs) offered by a variety of banks with the security of FDIC insurance. These products include:",
                      "type": "text"
                    }
                  ]
                },
                { "type": "paragraph" },
                {
                  "type": "bullet_list",
                  "content": [
                    {
                      "type": "list_item",
                      "content": [
                        {
                          "type": "paragraph",
                          "content": [
                            {
                              "text": "High-yield Savings Account (HYSA).",
                              "type": "text",
                              "marks": [{ "type": "bold" }]
                            },
                            {
                              "text": " As its name indicates, this account type functions like a traditional savings account—with typically no restrictions on depositing and withdrawing funds—but earns interest at rates that are higher than the national average for standard savings accounts. ",
                              "type": "text"
                            }
                          ]
                        },
                        { "type": "paragraph" }
                      ]
                    },
                    {
                      "type": "list_item",
                      "content": [
                        {
                          "type": "paragraph",
                          "content": [
                            {
                              "text": "Money Market Deposit Account (MMDA).",
                              "type": "text",
                              "marks": [{ "type": "bold" }]
                            },
                            {
                              "text": " Also known as a money market account or MMA, this type of savings account offers a varying rate that allows you to earn interest on your funds with maximum flexibility for withdrawals. Like a HYSA, an MMDA offers features of a traditional savings account with typically higher returns. ",
                              "type": "text"
                            }
                          ]
                        },
                        { "type": "paragraph" }
                      ]
                    },
                    {
                      "type": "list_item",
                      "content": [
                        {
                          "type": "paragraph",
                          "content": [
                            {
                              "text": "No Penalty CD.",
                              "type": "text",
                              "marks": [{ "type": "bold" }]
                            },
                            {
                              "text": " Through the flexibility of a No Penalty CD, you can lock in a competitive rate for a fixed term with the option to make a full withdrawal at any time beginning seven (7) calendar days after funding without having to pay a penalty for the early termination.",
                              "type": "text"
                            }
                          ]
                        },
                        { "type": "paragraph" }
                      ]
                    },
                    {
                      "type": "list_item",
                      "content": [
                        {
                          "type": "paragraph",
                          "content": [
                            {
                              "text": "Fixed Term CD.",
                              "type": "text",
                              "marks": [{ "type": "bold" }]
                            },
                            {
                              "text": " With this longstanding savings vehicle, funds are held for a fixed term, and a competitive interest rate provides safe, predictable earnings. In contrast to No Penalty CDs, typically you are charged a fee if you do not complete the full term of the Fixed Term CD.",
                              "type": "text"
                            }
                          ]
                        }
                      ]
                    }
                  ]
                }
              ]
            },
            "question": "What types of products are available through SaveBetter?",
            "component": "faqItem",
            "hasPaddingTop": false,
            "hasPaddingBottom": false
          },
          {
            "_uid": "436936be-1f26-43f8-87e3-fde8026cf74f",
            "answer": {
              "type": "doc",
              "content": [
                {
                  "type": "paragraph",
                  "content": [
                    {
                      "text": "Interest is compounded daily and posted to your account monthly.",
                      "type": "text"
                    }
                  ]
                }
              ]
            },
            "question": "How often is interest compounded?",
            "component": "faqItem",
            "hasPaddingTop": false,
            "hasPaddingBottom": false
          },
          {
            "_uid": "35849d25-cd5e-4f9b-9848-e40284476c6e",
            "answer": {
              "type": "doc",
              "content": [
                {
                  "type": "paragraph",
                  "content": [
                    {
                      "text": "Yes! A depositor’s savings are insured by the FDIC up to the maximum amount in accordance with and as permitted by law at each bank holding their funds. ",
                      "type": "text"
                    }
                  ]
                },
                {
                  "type": "paragraph",
                  "content": [
                    {
                      "text": "The standard deposit insurance coverage limit is $250,000 per depositor, per FDIC-insured bank, per account ownership category. Ownership categories as defined by the FDIC include single bank accounts (owned by one person/depositor) and joint bank accounts (owned by two or more persons/depositors). Revocable trust accounts and some types of retirement accounts (e.g., IRAs) are among the other ownership categories covered by FDIC insurance. ",
                      "type": "text"
                    }
                  ]
                },
                {
                  "type": "paragraph",
                  "content": [
                    {
                      "text": "Deposits held in different ownership categories are separately insured, even if held at the same bank. ",
                      "type": "text"
                    }
                  ]
                },
                {
                  "type": "paragraph",
                  "content": [
                    {
                      "text": "All deposits you have at a bank — whether facilitated through SaveBetter or otherwise — count toward the deposit insurance limit. If funds held at a bank in a certain ownership category exceed the coverage limit, then the amount in excess of the limit will not be insured.",
                      "type": "text"
                    }
                  ]
                }
              ]
            },
            "question": "Does my SaveBetter account have FDIC insurance?",
            "component": "faqItem",
            "hasPaddingTop": false,
            "hasPaddingBottom": false
          },
          {
            "_uid": "066c515e-a1fc-4eec-b965-c5f7136b613c",
            "answer": {
              "type": "doc",
              "content": [
                {
                  "type": "paragraph",
                  "content": [
                    {
                      "text": "At SaveBetter, cybersecurity is our priority. SaveBetter is a SOC 2 certified platform, meaning it has been validated by outside auditors across five (5) key information security principles. We also use a variety of measures to protect our customers' data, privacy and transactions, including:",
                      "type": "text"
                    }
                  ]
                },
                {
                  "type": "paragraph",
                  "content": [
                    {
                      "text": "•\tUser authentication.",
                      "type": "text",
                      "marks": [{ "type": "bold" }]
                    },
                    {
                      "text": " The SaveBetter platform uses multi-factor authentication combined with leading authentication technology to validate our customers’ identities.",
                      "type": "text"
                    }
                  ]
                },
                {
                  "type": "paragraph",
                  "content": [
                    {
                      "text": "•\tData encryption.",
                      "type": "text",
                      "marks": [{ "type": "bold" }]
                    },
                    {
                      "text": " Your personal information is encrypted in-transit and at rest using advanced cryptographic security algorithms.",
                      "type": "text"
                    }
                  ]
                },
                {
                  "type": "paragraph",
                  "content": [
                    {
                      "text": "•\tSite protection.",
                      "type": "text",
                      "marks": [{ "type": "bold" }]
                    },
                    {
                      "text": " Cloudflare™ advanced internet protection technologies are implemented to protect SaveBetter.com from malicious actors, botnets and denial of service attacks (DDOS).",
                      "type": "text"
                    }
                  ]
                },
                {
                  "type": "paragraph",
                  "content": [
                    {
                      "text": "•\tMonitoring.",
                      "type": "text",
                      "marks": [{ "type": "bold" }]
                    },
                    {
                      "text": " An always-on information security monitoring platform detects and alerts us to information security events.",
                      "type": "text"
                    }
                  ]
                },
                {
                  "type": "paragraph",
                  "content": [
                    {
                      "text": "•\tAssessments.",
                      "type": "text",
                      "marks": [{ "type": "bold" }]
                    },
                    {
                      "text": " Our platform undergoes vigorous security assessments and testing throughout the lifecycle of application development, from architecture planning to production phases.",
                      "type": "text"
                    }
                  ]
                },
                {
                  "type": "paragraph",
                  "content": [
                    {
                      "text": "Cloudflare™ is a registered trademark of Cloudflare, Inc.",
                      "type": "text"
                    }
                  ]
                }
              ]
            },
            "question": "How does SaveBetter protect my data, privacy, and finances?",
            "component": "faqItem",
            "hasPaddingTop": false,
            "hasPaddingBottom": false
          },
          {
            "_uid": "716eaece-44e7-4cfd-a90b-13788b2f8b4b",
            "answer": {
              "type": "doc",
              "content": [
                {
                  "type": "paragraph",
                  "content": [
                    {
                      "text": "A.\tCheck out our savings marketplace and choose a product in which you would like to deposit money.",
                      "type": "text"
                    }
                  ]
                },
                {
                  "type": "paragraph",
                  "content": [
                    {
                      "text": "B.\tCreate your username and password.",
                      "type": "text"
                    }
                  ]
                },
                {
                  "type": "paragraph",
                  "content": [
                    {
                      "text": "C.\tComplete an application and, after successful identity verification, link a bank account from which to fund your first savings product.",
                      "type": "text"
                    }
                  ]
                },
                {
                  "type": "paragraph",
                  "content": [
                    {
                      "text": "D.\tStart earning interest as soon as your money is received by the bank.",
                      "type": "text"
                    }
                  ]
                },
                {
                  "type": "paragraph",
                  "content": [
                    {
                      "text": "Any questions or concerns? Email us at ",
                      "type": "text"
                    },
                    {
                      "text": "service@SaveBetter.com",
                      "type": "text",
                      "marks": [
                        {
                          "type": "link",
                          "attrs": {
                            "href": "service@SaveBetter.com",
                            "uuid": null,
                            "anchor": null,
                            "target": "_blank",
                            "linktype": "email"
                          }
                        }
                      ]
                    },
                    { "text": ".", "type": "text" }
                  ]
                }
              ]
            },
            "question": "How do I open a SaveBetter account?",
            "component": "faqItem",
            "hasPaddingTop": false,
            "hasPaddingBottom": false
          },
          {
            "_uid": "e8c53d03-dba7-4e98-8077-f39c9d55b85c",
            "answer": {
              "type": "doc",
              "content": [
                {
                  "type": "paragraph",
                  "content": [
                    {
                      "text": "All deposits and withdrawals are completed within one to three (1-3) business days. After the initial deposit a withdrawals limitation for the first few business days may exist.",
                      "type": "text"
                    }
                  ]
                },
                {
                  "type": "paragraph",
                  "content": [
                    {
                      "text": "Business days are Monday through Friday excluding U.S. bank holidays.",
                      "type": "text"
                    }
                  ]
                }
              ]
            },
            "question": "How long does it take to deposit my money? What about withdrawals?",
            "component": "faqItem",
            "hasPaddingTop": false,
            "hasPaddingBottom": false
          },
          {
            "_uid": "1cec22db-d332-4a26-9e0a-498a62771a21",
            "answer": {
              "type": "doc",
              "content": [
                {
                  "type": "paragraph",
                  "content": [
                    {
                      "text": "No. All necessary registration is handled when you become a SaveBetter customer. One of the many benefits of our platform is that you can open a single account and earn competitive interest rates from banks in the SaveBetter network.",
                      "type": "text"
                    }
                  ]
                }
              ]
            },
            "question": "Will I need to register for accounts at the banks where I’ve chosen to deposit my money? Am I a customer of those banks?",
            "component": "faqItem",
            "hasPaddingTop": false,
            "hasPaddingBottom": false
          },
          {
            "_uid": "6b81cd9e-dcd2-433a-9b71-b8cd9cb8f68a",
            "answer": {
              "type": "doc",
              "content": [
                {
                  "type": "paragraph",
                  "content": [
                    {
                      "text": "The current APY for your savings products can always be viewed on the Account Overview page when you are logged in to SaveBetter. This information also appears on monthly statements.",
                      "type": "text"
                    }
                  ]
                }
              ]
            },
            "question": "Where can I view my savings products’ Annual Percentage Yield (APY)?",
            "component": "faqItem",
            "hasPaddingTop": false,
            "hasPaddingBottom": false
          },
          {
            "_uid": "e92b66a9-024d-48a2-81ff-9ae164cc2838",
            "answer": {
              "type": "doc",
              "content": [
                {
                  "type": "paragraph",
                  "content": [
                    {
                      "text": "You cannot currently link your SaveBetter account to a third-party app, but we may offer this feature in the future.  For now, you will not be able to link your selected savings product to a third-party app even if the bank offering that product does so outside of the SaveBetter platform.",
                      "type": "text"
                    }
                  ]
                }
              ]
            },
            "question": "Can I link my SaveBetter account or selected savings product to a third-party app? ",
            "component": "faqItem",
            "hasPaddingTop": false,
            "hasPaddingBottom": false
          }
        ],
        "hasBackground": false,
        "hasPaddingTop": true,
        "hasPaddingBottom": true
      }
    ],
    "logo": [],
    "test": "",
    "title": "Best No-Penalty CD Rates\non SaveBetter in\nApril 2023",
    "layout": {
      "id": "a7887b35-4fec-4639-a28f-c4afd03fa845",
      "url": "savedo.ch",
      "anchor": "",
      "linktype": "story",
      "fieldtype": "multilink",
      "cached_url": "layouts/explore-product-no-nav-layout"
    },
    "metadata": {
      "_uid": "3724defc-38a4-4567-a304-1085c4999972",
      "title": "Federally Insured No-Penalty CD Accounts | SaveBetter",
      "plugin": "meta-fields",
      "description": "No-penalty certificates of deposit allow you to earn a reliable return on your cash savings while keeping funds accessible. Explore no-penalty CDs offered by FDIC-insured banks and NCUA-insured credit unions through SaveBetter's unique online marketplace. Open an account with as little as $1 and no fees."
    },
    "component": "page",
    "isTextWhite": true,
    "headerOutline": [
      {
        "_uid": "e9fcdcf2-2f72-4316-8933-0711c3265a55",
        "title": "Compare No-Penalty CD Accounts on SaveBetter",
        "bankCode": "",
        "component": "productOfferTable",
        "hasBorder": false,
        "productId": "",
        "hasBackground": false,
        "hasPaddingTop": false,
        "featuredProducts": [],
        "hasPaddingBottom": false,
        "showSelectedProductTypes": ["NO_PENALTY_CD"],
        "hasFinancialInstitutionsDropdown": true
      }
    ],
    "disableIndexing": true,
    "showBreadcrumbs": false,
    "headerBackground": [
      {
        "alt": "Savings",
        "img": "//a.storyblok.com/f/180759/2560x550/beb74df855/sb_lp_howitworks_hero_01.webp",
        "_uid": "4768358c-8f1d-4891-9949-edc1c1f49e0b",
        "mobile": "",
        "tablet": "",
        "desktop": "",
        "component": "media"
      }
    ],
    "introductionLink": [
      {
        "url": "products/cd-accounts/no-penalty-cd-rates#compare_no_penalty_cd_accounts_on_savebetter",
        "_uid": "e5cc864f-029c-46b1-8d40-4c23a6293e1b",
        "text": "Select a product and save",
        "target": "_self",
        "component": "link"
      }
    ],
    "introductionList": [
      {
        "_uid": "9a6a9a08-ba87-439a-bb24-1499c5cec90b",
        "text": "FDIC or NCUA insured. No fees. $1 minimum deposit.",
        "component": "introductionListItem"
      },
      {
        "_uid": "c0ca0707-941a-4338-8d13-7e7146130cde",
        "text": "24/7 online access to funds.",
        "component": "introductionListItem"
      }
    ],
    "isLinkSecondaryColor": true,
    "productCardsCustomiser": [],
    "introductionDescription": ""
  },
  "slug": "no-penalty-cd-rates",
  "full_slug": "products/cd-accounts/no-penalty-cd-rates",
  "sort_by_date": null,
  "position": 10,
  "tag_list": [],
  "is_startpage": false,
  "parent_id": 290605149,
  "meta_data": null,
  "group_id": "87e6cb7a-d992-4a8f-a7dd-ca705db7eb6e",
  "first_published_at": "2020-01-06T15:09:15.000Z",
  "release_id": null,
  "lang": "default",
  "path": null,
  "alternates": [],
  "default_full_slug": null,
  "translated_slugs": null
}
