{
  "name": "Products Page Demo",
  "created_at": "2023-04-12T09:56:32.861Z",
  "published_at": "2023-02-23T18:47:51.263Z",
  "id": 290605150,
  "uuid": "8f1abeb0-6933-4e8d-88f1-34b131634a81",
  "content": {
    "_uid": "1cdd7225-a154-4483-9fd5-13858a152f8b",
    "body": [
      {
        "_uid": "01cf9162-3b33-46cb-ad27-f2318cda175d",
        "headers": [
          {
            "_uid": "bc3f4479-837b-456b-bfd3-47a5bdacc3a8",
            "imageAlt": "explore high-yield savings accounts",
            "imageUrl": "//a.storyblok.com/f/70134/60x56/38e894250f/savings.svg",
            "component": "contentTableHeaders",
            "headerIntro": "Expedite your savings with APYs significantly higher than the national average.",
            "headerTitle": "High-yield savings & MMDA"
          },
          {
            "_uid": "e4be6521-f6f5-42c7-b9a8-dec979916d29",
            "imageAlt": "explore fixed term CD accounts",
            "imageUrl": "//a.storyblok.com/f/70134/60x52/e0f388d1ff/fix-term-cds.svg",
            "component": "contentTableHeaders",
            "headerIntro": "Guaranteed rates and clear terms for easy planning or laddering – whatever your timeline.",
            "headerTitle": "Fixed term CDs"
          },
          {
            "_uid": "43ef8f55-d653-4eac-b794-d06e847f732b",
            "imageAlt": "explore no penalty CD accounts",
            "imageUrl": "//a.storyblok.com/f/70134/60x53/d920e077f0/no-penalty-cds.svg",
            "component": "contentTableHeaders",
            "headerIntro": "Stability and flexibility in one: guaranteed interest rates, plus penalty-free full withdrawal.",
            "headerTitle": "No penalty CDs"
          }
        ],
        "component": "contentTablev2",
        "hasBorder": false,
        "categories": [
          {
            "_uid": "23bdd277-f83a-4dad-a4e3-d6cd4c58341a",
            "rowTitle": "Benefits",
            "component": "contentTableCategories",
            "descriptions": [
              {
                "_uid": "13d15ab0-a3f1-4458-bbe9-a9c01a977fa7",
                "text": {
                  "type": "doc",
                  "content": [
                    {
                      "type": "paragraph",
                      "content": [
                        {
                          "text": "Receive a competitive rate with the ability to withdraw or add funds whenever you like.",
                          "type": "text"
                        }
                      ]
                    }
                  ]
                },
                "component": "contentTableCategoryText"
              },
              {
                "_uid": "b2b06b4a-796d-442a-8600-557d6f8130fa",
                "text": {
                  "type": "doc",
                  "content": [
                    {
                      "type": "paragraph",
                      "content": [
                        {
                          "text": "Lock in to a competitive interest rate for a fixed period to better manage your return expectations.",
                          "type": "text"
                        }
                      ]
                    }
                  ]
                },
                "component": "contentTableCategoryText"
              },
              {
                "_uid": "e09242bd-ff33-4d07-9a23-2e5740cfb260",
                "text": {
                  "type": "doc",
                  "content": [
                    {
                      "type": "paragraph",
                      "content": [
                        {
                          "text": "The best of both worlds; lock in to a competitive fixed term interest rate with the flexibility of withdrawing.",
                          "type": "text"
                        }
                      ]
                    }
                  ]
                },
                "component": "contentTableCategoryText"
              }
            ]
          },
          {
            "_uid": "597de298-422b-4fdb-9f77-2b70c03789f6",
            "rowTitle": "Interest rate",
            "component": "contentTableCategories",
            "descriptions": [
              {
                "_uid": "fb1d11ee-b249-42a7-b24a-5f0393eebedc",
                "text": {
                  "type": "doc",
                  "content": [
                    {
                      "type": "paragraph",
                      "content": [
                        {
                          "text": "Variable, depending on market conditions.",
                          "type": "text"
                        }
                      ]
                    }
                  ]
                },
                "component": "contentTableCategoryText"
              },
              {
                "_uid": "c0254016-90eb-46dd-b913-a8e965132c4d",
                "text": {
                  "type": "doc",
                  "content": [
                    {
                      "type": "paragraph",
                      "content": [
                        {
                          "text": "Fixed for CD term regardless of market conditions.",
                          "type": "text"
                        }
                      ]
                    }
                  ]
                },
                "component": "contentTableCategoryText"
              },
              {
                "_uid": "65b3415e-5f15-49ca-a8d0-85cab8cdd082",
                "text": {
                  "type": "doc",
                  "content": [
                    {
                      "type": "paragraph",
                      "content": [
                        {
                          "text": "Fixed for CD term regardess of market conditions.",
                          "type": "text"
                        }
                      ]
                    }
                  ]
                },
                "component": "contentTableCategoryText"
              }
            ]
          },
          {
            "_uid": "c49d00d0-581f-4784-a362-55f3921b89f3",
            "rowTitle": "Withdrawals",
            "component": "contentTableCategories",
            "descriptions": [
              {
                "_uid": "da2ffeaf-c727-470f-b247-e96085bf87db",
                "text": {
                  "type": "doc",
                  "content": [
                    {
                      "type": "paragraph",
                      "content": [
                        {
                          "text": "Flexibility to withdraw as much as you want, whenever you want; there are no restrictions.",
                          "type": "text"
                        }
                      ]
                    }
                  ]
                },
                "component": "contentTableCategoryText"
              },
              {
                "_uid": "f745823b-c96a-4bbd-821f-4a78a4be1126",
                "text": {
                  "type": "doc",
                  "content": [
                    {
                      "type": "paragraph",
                      "content": [
                        {
                          "text": "Full withdrawal when fixed term expires. Penalty fee applies for early withdrawal, varies by institution.",
                          "type": "text"
                        }
                      ]
                    }
                  ]
                },
                "component": "contentTableCategoryText"
              },
              {
                "_uid": "eb9984bc-d40c-4a89-ad40-e1ae6892866b",
                "text": {
                  "type": "doc",
                  "content": [
                    {
                      "type": "paragraph",
                      "content": [
                        {
                          "text": "You can make a full withdrawal as soon as 7 days after funding but rules may vary at different institutions.",
                          "type": "text"
                        }
                      ]
                    }
                  ]
                },
                "component": "contentTableCategoryText"
              }
            ]
          }
        ],
        "contentTitle": "Understanding the different product types",
        "hasBackground": false,
        "hasPaddingTop": true,
        "textParagraph": [
          {
            "_uid": "cec94057-43cf-473b-8479-4729de57e643",
            "title": "Develop a cash strategy  to meet your unique needs",
            "component": "contentTableTextParagraph",
            "description": "Use each type of product to make the most out of your short and long-term cash requirements as interest rates change over time.  Savings accounts are subject to rate increases and decreases.  With CDs, on the other hand, the interest rate is fixed for its specific term.  Developing a cash strategy that takes into account both fixed rates (for periods of interest rate uncertainty or to lock into attractive rates) and variable rates (high-yield savings for short term cash needs or if rates are expected to increase) may help you better achieve your long term goals.    \n\n\n"
          }
        ],
        "hasPaddingBottom": true
      },
      {
        "_uid": "61529ba6-1ca7-42ea-8cde-efb6f480ec56",
        "logos": [
          {
            "_uid": "d8d6d891-8b47-4901-befe-80f9e229f257",
            "link": {
              "id": "ae50c452-7b31-41a0-9eab-0d65a99f0f7b",
              "url": "",
              "linktype": "story",
              "fieldtype": "multilink",
              "cached_url": "banks/lemmata-savings-bank/"
            },
            "logo": [
              {
                "alt": "Lemmata Savings Bank logo",
                "img": "//a.storyblok.com/f/70134/665x114/34fb7107f6/lemmata-savings-bank-logo.png",
                "_uid": "5f5fe9e9-a9c4-4b93-8005-ccb9778f8811",
                "mobile": "",
                "tablet": "",
                "desktop": "",
                "component": "media"
              }
            ],
            "target": "_self",
            "component": "logo"
          },
          {
            "_uid": "ac63518c-cb47-4d4e-8ff8-41b8f1de40f5",
            "link": {
              "id": "e2f002c8-0616-4862-af76-abbc11f27c99",
              "url": "",
              "linktype": "story",
              "fieldtype": "multilink",
              "cached_url": "credit-unions/american-first-credit-union/"
            },
            "logo": [
              {
                "alt": "American First Credit Union logo",
                "img": "//a.storyblok.com/f/70134/572x333/079420d408/afcu_logo_notag_4c.png",
                "_uid": "c5efaafb-2683-44d3-b631-a3450734ad40",
                "mobile": "",
                "tablet": "",
                "desktop": "",
                "component": "media"
              }
            ],
            "target": "",
            "component": "logo"
          },
          {
            "_uid": "b3555ecb-a847-4b4f-8c56-08eece329cf4",
            "link": {
              "id": "aab44829-9509-4bbf-9c35-b95b4ec6d316",
              "url": "",
              "linktype": "story",
              "fieldtype": "multilink",
              "cached_url": "credit-unions/bellco-credit-union/"
            },
            "logo": [
              {
                "alt": "Bellco Credit Union logo",
                "img": "//a.storyblok.com/f/70134/2201x565/bb0fb20366/bellco_credit-union-logo_295.png",
                "_uid": "65374c3d-310a-44e4-8b6b-06b52580e5b4",
                "mobile": "",
                "tablet": "",
                "desktop": "",
                "component": "media"
              }
            ],
            "target": "_self",
            "component": "logo"
          },
          {
            "_uid": "25f31706-ab6a-4887-a0ef-b7f93248de6c",
            "link": {
              "id": "f3129f5c-4bb3-40a7-a605-b6c63c78a5f3",
              "url": "",
              "linktype": "story",
              "fieldtype": "multilink",
              "cached_url": "banks/axiom-bank/"
            },
            "logo": [
              {
                "alt": "Axiom Bank logo",
                "img": "//a.storyblok.com/f/70134/384x131/b66bc92cdc/axiom-bank-logo.png",
                "_uid": "e4775333-4cfe-4fd8-a182-a624516ccb63",
                "mobile": "",
                "tablet": "",
                "desktop": "",
                "component": "media"
              }
            ],
            "target": "",
            "component": "logo"
          },
          {
            "_uid": "4ce013e7-5f74-4b24-a4ec-aad4ef4853c2",
            "link": {
              "id": "0a137ebd-d71d-48ec-b695-b13ecf75524d",
              "url": "",
              "linktype": "story",
              "fieldtype": "multilink",
              "cached_url": "banks/sallie-mae/"
            },
            "logo": [
              {
                "alt": "Sallie Mae logo",
                "img": "//a.storyblok.com/f/70134/280x109/dc39228cb7/sallie-mae-logos_horizontal.svg",
                "_uid": "cd6c4c77-8ce0-4c81-99ac-34dd00f4df55",
                "mobile": "",
                "tablet": "",
                "desktop": "",
                "component": "media"
              }
            ],
            "target": "_self",
            "component": "logo"
          },
          {
            "_uid": "3b5d3caa-ce3b-4e80-9991-6c6a4bf4f796",
            "link": {
              "id": "",
              "url": "https://www.savebetter.com/bank/patriot-bank/patriot-bank",
              "linktype": "url",
              "fieldtype": "multilink",
              "cached_url": "https://www.savebetter.com/bank/patriot-bank/patriot-bank"
            },
            "logo": [
              {
                "alt": "Patriot Bank logo",
                "img": "//a.storyblok.com/f/70134/250x250/42fbf44749/250x250-logo-patriot-bank.png",
                "_uid": "19a9c136-1385-43a0-a26b-4cb30a846817",
                "mobile": "",
                "tablet": "",
                "desktop": "",
                "component": "media"
              }
            ],
            "target": "_self",
            "component": "logo"
          },
          {
            "_uid": "134f62cd-5cbb-4868-a9c1-634ef61633d5",
            "link": {
              "id": "",
              "url": "https://www.savebetter.com/product-banks/ponce-bank",
              "linktype": "url",
              "fieldtype": "multilink",
              "cached_url": "https://www.savebetter.com/product-banks/ponce-bank"
            },
            "logo": [
              {
                "alt": "Ponce Bank logo",
                "img": "//a.storyblok.com/f/70134/250x250/a6f4e6408e/250x250-logo-ponce-bank.png",
                "_uid": "41bf035a-3b3f-4763-9fe6-41d748105191",
                "mobile": "",
                "tablet": "",
                "desktop": "",
                "component": "media"
              }
            ],
            "target": "_self",
            "component": "logo"
          },
          {
            "_uid": "87872d1d-f46a-4f5b-9d16-28293e1f4503",
            "link": {
              "id": "de91f896-dd12-453c-813a-12528ce8b60e",
              "url": "",
              "linktype": "story",
              "fieldtype": "multilink",
              "cached_url": "bank/liberty-savings-bank/liberty-savings-bank"
            },
            "logo": [
              {
                "alt": "Liberty Savings Bank Logo",
                "img": "//a.storyblok.com/f/70134/250x250/f3ddcee604/250x250-logo-liberty-savings-bank.png",
                "_uid": "29e9d625-4b71-43e0-bc3f-a148455107bd",
                "mobile": "",
                "tablet": "",
                "desktop": "",
                "component": "media"
              }
            ],
            "target": "_self",
            "component": "logo"
          },
          {
            "_uid": "af23af71-4083-4a73-8ed8-5ad00830eaf1",
            "link": {
              "id": "c6f09350-8aef-41c4-a1df-3e19f5e3f414",
              "url": "",
              "linktype": "story",
              "fieldtype": "multilink",
              "cached_url": "credit-unions/skyone-federal-credit-union/"
            },
            "logo": [
              {
                "alt": "SkyOne Credit Union logo",
                "img": "//a.storyblok.com/f/70134/250x250/9ecd1352df/250x250-logo-skyone-cu.png",
                "_uid": "eb260c67-db63-423d-8d77-03548d1f65d9",
                "mobile": "",
                "tablet": "",
                "desktop": "",
                "component": "media"
              }
            ],
            "target": "_self",
            "component": "logo"
          },
          {
            "_uid": "782a70d4-bcd3-442e-9d4a-508a3fb8d2c6",
            "link": {
              "id": "a9cc7c32-dec9-4a1b-84d2-a0facffeb69d",
              "url": "",
              "linktype": "story",
              "fieldtype": "multilink",
              "cached_url": "banks/mph-bank/"
            },
            "logo": [
              {
                "alt": "mph.bank logo",
                "img": "//a.storyblok.com/f/70134/250x250/acba2af2f7/250x250-logo-mph-bank.png",
                "_uid": "b53d9daa-270b-4662-9b6b-d65fa3d93d38",
                "mobile": "",
                "tablet": "",
                "desktop": "",
                "component": "media"
              }
            ],
            "target": "_self",
            "component": "logo"
          },
          {
            "_uid": "628bfa4c-3f24-4730-ad3a-2090834a3bfd",
            "link": {
              "id": "",
              "url": "https://www.savebetter.com/product-banks/continental-bank",
              "linktype": "url",
              "fieldtype": "multilink",
              "cached_url": "https://www.savebetter.com/product-banks/continental-bank"
            },
            "logo": [
              {
                "alt": "Continental Bank logo",
                "img": "//a.storyblok.com/f/70134/250x250/837802965a/250x250-logo-continental-bank.png",
                "_uid": "e952eb4f-cfa1-444d-9f16-bededdaef949",
                "mobile": "",
                "tablet": "",
                "desktop": "",
                "component": "media"
              }
            ],
            "target": "_self",
            "component": "logo"
          },
          {
            "_uid": "0e2e708b-dd7a-4c8e-9305-106bb5b9b584",
            "link": {
              "id": "",
              "url": "https://www.savebetter.com/state-exchange-bank",
              "linktype": "url",
              "fieldtype": "multilink",
              "cached_url": "https://www.savebetter.com/state-exchange-bank"
            },
            "logo": [
              {
                "alt": "The State Exchange Bank logo",
                "img": "//a.storyblok.com/f/70134/250x250/b79001fcc4/250x250-logo-state-exchange-bank.png",
                "_uid": "3a770d3f-0b7a-49d9-9c32-9f7fbdf8f413",
                "mobile": "",
                "tablet": "",
                "desktop": "",
                "component": "media"
              }
            ],
            "target": "_self",
            "component": "logo"
          },
          {
            "_uid": "5ca02f94-88cc-4828-b406-3bc839d4272a",
            "link": {
              "id": "",
              "url": "https://www.savebetter.com/product-banks/central-bank-of-kansas-city",
              "linktype": "url",
              "fieldtype": "multilink",
              "cached_url": "https://www.savebetter.com/product-banks/central-bank-of-kansas-city"
            },
            "logo": [
              {
                "alt": "Central Bank of Kansas City logo",
                "img": "//a.storyblok.com/f/70134/250x250/b7122d400e/250x250-logo-central-bank-of-kansas-city.png",
                "_uid": "f39318ea-f57a-4f56-a4a3-db6c07eecace",
                "mobile": "",
                "tablet": "",
                "desktop": "",
                "component": "media"
              }
            ],
            "target": "_self",
            "component": "logo"
          },
          {
            "_uid": "e81a2414-cf7a-4a99-aacb-f84e1114f39d",
            "link": {
              "id": "",
              "url": "https://www.savebetter.com/wex-bank",
              "linktype": "url",
              "fieldtype": "multilink",
              "cached_url": "https://www.savebetter.com/wex-bank"
            },
            "logo": [
              {
                "alt": "Wex Bank logo",
                "img": "//a.storyblok.com/f/70134/250x250/9260aa1bfe/250x250-logo-wex-bank.png",
                "_uid": "b014383c-3f8c-4274-9766-e402e6cc1529",
                "mobile": "",
                "tablet": "",
                "desktop": "",
                "component": "media"
              }
            ],
            "target": "_self",
            "component": "logo"
          }
        ],
        "title": "Our partner financial institutions",
        "subtitle": "Learn more about our curated network of banks and credit unions, and how they are helping their communities.",
        "component": "logoCarousel",
        "hasBorder": false,
        "hasBackground": true,
        "hasPaddingTop": true,
        "hasPaddingBottom": true
      },
      {
        "_uid": "0e430b62-abda-40c8-b68b-79d73113f1fc",
        "cards": [
          {
            "_uid": "6e030d88-e28d-4bf6-8ca4-4f5306374fec",
            "link": [
              {
                "url": "https://www.fdic.gov/resources/deposit-insurance/understanding-deposit-insurance/",
                "_uid": "c05f8e61-316d-4397-87e3-ff5ab10e3c9f",
                "text": "Click to learn more about FDIC insurance",
                "target": "_blank",
                "component": "link"
              }
            ],
            "media": [
              {
                "alt": "FDIC logo",
                "img": "//a.storyblok.com/f/70134/720x285/5e201cdf81/us-fdic-logo.svg",
                "_uid": "eb6a4df1-d9b9-4510-9468-04b2a36dc9f0",
                "mobile": "",
                "tablet": "",
                "desktop": "",
                "component": "media"
              }
            ],
            "title": "Federal Deposit Insurance Corporation",
            "component": "card",
            "paragraph": "All participating banks are members of the FDIC. Deposits in participating banks are insured by the FDIC up to the limits of federal law. The standard insurance amount is $250,000 per depositor, per insured bank, for each deposit account ownership category."
          },
          {
            "_uid": "7a153fee-c47b-4b25-8461-ae136230df46",
            "link": [
              {
                "url": "https://www.ncua.gov/support-services/share-insurance-fund",
                "_uid": "4a96b84d-a3dc-4981-91ad-75673955674e",
                "text": "Click to learn more about NCUA insurance ",
                "target": "_blank",
                "component": "link"
              }
            ],
            "media": [
              {
                "alt": "NCUA logo",
                "img": "//a.storyblok.com/f/70134/800x500/b2cc8df0ef/ncua_seal_blue-500x800.png",
                "_uid": "7f0fb83b-446c-4801-a25f-fb0a11e2adf1",
                "mobile": "",
                "tablet": "",
                "desktop": "",
                "component": "media"
              }
            ],
            "title": "National Credit Union Administration",
            "component": "card",
            "paragraph": "All participating credit unions are insured by the NCUA through its Share Insurance Fund. Deposits in participating credit unions are insured by the NCUA up to the limits of federal law. The standard insurance amount is $250,000 per depositor, per insured credit union, for each deposit account ownership category."
          }
        ],
        "title": "All deposit balances on the SaveBetter platform are held at federally insured financial institutions",
        "component": "cardList1",
        "hasBorder": false,
        "description": "",
        "hasBackground": false,
        "hasPaddingTop": true,
        "hasPaddingBottom": true
      },
      {
        "_uid": "8a305c98-2241-4eb8-8757-a61e8fb01976",
        "isLink": false,
        "component": "mediaSection3v2",
        "hasBorder": false,
        "sectionTitle": "How taxes are taken care of",
        "contentBlocks": [
          {
            "_uid": "6e675ce2-c7cb-49ee-823f-2b0c019041d4",
            "link": [],
            "media": [
              {
                "alt": "tax reporting with Savebetter",
                "img": "//a.storyblok.com/f/70134/270x270/eadcf6e078/tax.svg",
                "_uid": "7fd2f67f-46a9-4871-97dd-a58799da84f4",
                "component": "media"
              }
            ],
            "title": "",
            "content": {
              "_uid": "02f7665e-f682-4931-a04b-fde2730fb1d9",
              "type": "doc",
              "content": [
                {
                  "_uid": "30940327-afda-4287-a3d2-2962b464f2f5",
                  "type": "paragraph",
                  "content": [
                    {
                      "_uid": "e273ab7e-fa71-447a-9491-40f0d58f9946",
                      "text": "You will receive a 1099-INT for each calendar year for income tax reporting requirements.",
                      "type": "text"
                    }
                  ]
                }
              ]
            },
            "component": "contentWithMediaBlock"
          }
        ],
        "hasBackground": true,
        "hasPaddingTop": true,
        "showImageMobile": true,
        "hasPaddingBottom": true
      },
      {
        "_uid": "5c1dad7c-0419-4e53-8813-da2572d6638f",
        "text": "Sign up for SaveBetter.com news and latest offers",
        "media": [
          {
            "alt": "newsletter",
            "img": "//a.storyblok.com/f/70134/99x99/8f2c683fa2/signup-newsletter-icon.svg",
            "_uid": "fc8d26c9-2294-4a03-b6b0-76e47e578d9f",
            "component": "media"
          }
        ],
        "heading": "The latest savings news in your inbox",
        "component": "subscribev2",
        "hasBorder": false,
        "iframeUrl": "https://cdn.forms-content.sg-form.com/c5254a8d-5ab1-11ed-a77d-c25b4b76eeb4",
        "hasBackground": false,
        "hasPaddingTop": true,
        "hasPaddingBottom": false
      }
    ],
    "logo": [],
    "test": "",
    "title": "All Products on SaveBetter \nin October 2022",
    "layout": {
      "id": "a7887b35-4fec-4639-a28f-c4afd03fa845",
      "url": "savedo.ch",
      "anchor": "",
      "linktype": "story",
      "fieldtype": "multilink",
      "cached_url": "layouts/explore-product-no-nav-layout"
    },
    "metadata": {
      "_uid": "3724defc-38a4-4567-a304-1085c4999972",
      "title": "Explore FDIC- and NCUA-Insured Savings Products | SaveBetter",
      "plugin": "meta-fields",
      "description": "See all the competitive savings products offered by FDIC-insured banks and NCUA-insured credit unions available through SaveBetter's unique online marketplace. Open an account with as little as $1 and no fees."
    },
    "component": "page",
    "isTextWhite": true,
    "headerOutline": [
      {
        "_uid": "d7c5be52-0d5e-49b2-8ef9-dc91d9add2d9",
        "title": "Explore All Products on SaveBetter",
        "bankCode": "",
        "component": "productOfferTable",
        "hasBorder": false,
        "productId": "",
        "hasBackground": false,
        "hasPaddingTop": false,
        "featuredProducts": [],
        "hasPaddingBottom": false,
        "showSelectedProductTypes": [],
        "hasFinancialInstitutionsDropdown": true
      }
    ],
    "disableIndexing": true,
    "showBreadcrumbs": false,
    "headerBackground": [
      {
        "alt": "Savings",
        "img": "//a.storyblok.com/f/70134/1440x860/ce23bff82c/savings-1440x860.jpg",
        "_uid": "4768358c-8f1d-4891-9949-edc1c1f49e0b",
        "mobile": "",
        "tablet": "",
        "desktop": "",
        "component": "media"
      }
    ],
    "introductionLink": [
      {
        "url": "/products#explore_all_products_on_savebetter",
        "_uid": "1513e2a5-9ebc-4383-bd57-6bf4754472a2",
        "text": "Select a product and save",
        "target": "_self",
        "component": "link"
      }
    ],
    "introductionList": [
      {
        "_uid": "12667305-c486-418b-8663-fa0caa7e6cc5",
        "text": "FDIC or NCUA insured. No fees. $1 minimum deposit.",
        "component": "introductionListItem"
      },
      {
        "_uid": "44abbfbd-4d27-4bf9-b12a-8650a8608040",
        "text": "24/7 online access to funds.",
        "component": "introductionListItem"
      }
    ],
    "isLinkSecondaryColor": true,
    "productCardsCustomiser": [],
    "introductionDescription": ""
  },
  "slug": "products-page-demo",
  "full_slug": "products/products-page-demo",
  "sort_by_date": null,
  "position": -10,
  "tag_list": [],
  "is_startpage": false,
  "parent_id": 290604898,
  "meta_data": null,
  "group_id": "e27b41f9-a92c-4b88-9f78-654158d7786c",
  "first_published_at": "2020-01-06T15:09:15.000Z",
  "release_id": null,
  "lang": "default",
  "path": null,
  "alternates": [],
  "default_full_slug": null,
  "translated_slugs": null
}
