{
  "name": "The safe, secure way to get more out of your tax refund",
  "created_at": "2023-04-12T09:56:26.377Z",
  "published_at": "2023-04-11T20:06:40.136Z",
  "id": 290605009,
  "uuid": "4175b428-1839-4538-9f06-91f2b28d21a8",
  "content": {
    "_uid": "08b4c1c3-1068-4ef5-8201-27152b431881",
    "body": [
      {
        "_uid": "b83e5402-2dbc-4a8c-913a-95b2e0ce830e",
        "text": {
          "type": "doc",
          "content": [
            {
              "type": "paragraph",
              "content": [
                {
                  "text": "If you’re eligible for a tax refund this year, congratulations! ",
                  "type": "text",
                  "marks": [
                    {
                      "type": "textStyle",
                      "attrs": { "color": "rgb(0, 0, 0)" }
                    }
                  ]
                }
              ]
            },
            {
              "type": "paragraph",
              "content": [
                {
                  "text": "Tax season is coming to a close and, if you haven’t already, now is the time you should find out how much you’re getting back. As with any sudden windfall — no matter how small or large — there comes the question of how to put it to use.",
                  "type": "text",
                  "marks": [
                    {
                      "type": "textStyle",
                      "attrs": { "color": "rgb(0, 0, 0)" }
                    }
                  ]
                }
              ]
            },
            {
              "type": "paragraph",
              "content": [
                {
                  "text": "A quick spring getaway or wardrobe refresh may be pretty tempting, but saving your refund for another day could be your best option this year.",
                  "type": "text",
                  "marks": [
                    {
                      "type": "textStyle",
                      "attrs": { "color": "rgb(0, 0, 0)" }
                    }
                  ]
                }
              ]
            },
            {
              "type": "paragraph",
              "content": [
                {
                  "text": "As deposit interest rates reach their highest in decades, using your tax refund for a sudden splurge means missing out on potentially valuable interest earnings. After all, you’ve earned that tax return and you deserve to get more out of it.",
                  "type": "text",
                  "marks": [
                    {
                      "type": "textStyle",
                      "attrs": { "color": "rgb(0, 0, 0)" }
                    }
                  ]
                }
              ]
            },
            {
              "type": "paragraph",
              "content": [
                {
                  "text": "Banks and credit unions partner with SaveBetter to offer exclusive digital-only products to our customers — with interest rates typically many times the national average.",
                  "type": "text",
                  "marks": [
                    {
                      "type": "textStyle",
                      "attrs": { "color": "rgb(0, 0, 0)" }
                    }
                  ]
                }
              ]
            },
            {
              "type": "paragraph",
              "content": [
                {
                  "text": "Plus, all of SaveBetter’s partner banks and credit unions are federally insured up to the institutional limits — typically $250,000 per depositor, per insured institution, per ownership category. As long as your deposits stay within these limits for each of our partner institutions, you can rest assured that your money is safe.",
                  "type": "text",
                  "marks": [
                    {
                      "type": "textStyle",
                      "attrs": { "color": "rgb(0, 0, 0)" }
                    }
                  ]
                }
              ]
            }
          ]
        },
        "title": "",
        "component": "blogPostSection",
        "hasBorder": false,
        "hasBackground": false,
        "hasPaddingTop": false,
        "hasPaddingBottom": false
      },
      {
        "_uid": "a46e7d35-e678-40f1-86c7-c32c677bc3b2",
        "text": {
          "type": "doc",
          "content": [
            {
              "type": "paragraph",
              "content": [
                {
                  "text": "Consider a high-yield savings account or money market deposit account, both of which offer competitive interest rates with high liquidity. On SaveBetter, these accounts come with no fees, a $1 minimum deposit, and no transaction limits.",
                  "type": "text",
                  "marks": [
                    {
                      "type": "textStyle",
                      "attrs": { "color": "rgb(0, 0, 0)" }
                    }
                  ]
                }
              ]
            }
          ]
        },
        "title": "Want to put your money away for a short period of time before you decide how to spend it?",
        "component": "blogPostSection",
        "hasBorder": false,
        "hasBackground": false,
        "hasPaddingTop": false,
        "hasPaddingBottom": false
      },
      {
        "_uid": "f68abe06-2485-4562-850f-f6af64a829f5",
        "title": "",
        "bankCode": "",
        "component": "productOfferTable",
        "hasBorder": false,
        "productId": "",
        "hasBackground": false,
        "hasPaddingTop": false,
        "featuredProducts": [
          {
            "_uid": "1fa89731-293e-4142-b467-9343372b29c8",
            "component": "featuredProductCard",
            "productId": "344851811E8F469FB32FDD29"
          },
          {
            "_uid": "eda2e880-480b-4223-b6c1-d96da78da6fe",
            "component": "featuredProductCard",
            "productId": "53F93D617979461E8B120D8A"
          },
          {
            "_uid": "51d8f5cc-e2bd-494e-b778-873f4f982248",
            "component": "featuredProductCard",
            "productId": "639b8159c5781d000150ac4c"
          }
        ],
        "hasPaddingBottom": false,
        "showSelectedProductTypes": [],
        "hasFinancialInstitutionsDropdown": false
      },
      {
        "_uid": "86b8008b-06b8-44c7-aace-dcab92114520",
        "text": {
          "type": "doc",
          "content": [
            {
              "type": "paragraph",
              "content": [
                {
                  "text": "A high-yield CD or no-penalty CD might be the right option. You can secure your funds for a set term and calculate exactly how much interest you’ll earn—also with a $1 minimum deposit and no sign-up or maintenance fees.",
                  "type": "text",
                  "marks": [
                    {
                      "type": "textStyle",
                      "attrs": { "color": "rgb(0, 0, 0)" }
                    }
                  ]
                }
              ]
            }
          ]
        },
        "title": "Want to lock in a great interest rate for a longer period of time?",
        "component": "blogPostSection",
        "hasBorder": false,
        "hasBackground": false,
        "hasPaddingTop": false,
        "hasPaddingBottom": false
      },
      {
        "_uid": "1679b0aa-6c99-444f-819e-506561ebbe40",
        "title": "",
        "bankCode": "",
        "component": "productOfferTable",
        "hasBorder": false,
        "productId": "",
        "hasBackground": false,
        "hasPaddingTop": false,
        "featuredProducts": [
          {
            "_uid": "6124aea1-a126-458f-a3a2-ec1282ef38c9",
            "component": "featuredProductCard",
            "productId": "630cae1b0151f700012f80fe"
          },
          {
            "_uid": "feb67643-63c0-4a7d-8974-74e9e2218152",
            "component": "featuredProductCard",
            "productId": "637e53b128569d00014578b5"
          },
          {
            "_uid": "9c8c70c9-ebdb-41e8-9728-9be6322eeaed",
            "component": "featuredProductCard",
            "productId": "0FAC858070494E9BB620E1A5"
          },
          {
            "_uid": "1658a87e-1a77-41c0-9dc0-66b7d0e73a1a",
            "component": "featuredProductCard",
            "productId": "0FB0A60713E1450AA14E1315"
          }
        ],
        "hasPaddingBottom": false,
        "showSelectedProductTypes": [],
        "hasFinancialInstitutionsDropdown": false
      },
      {
        "_uid": "2815a515-19f8-4761-a61a-3b08082e28da",
        "text": {
          "type": "doc",
          "content": [
            {
              "type": "paragraph",
              "content": [
                {
                  "text": "Putting your tax refund into a high-yield savings product offered through SaveBetter means you can secure a competitive interest rate that will let your money keep growing safely. Even just a few months of interest can add up, which means even more money to play with when it comes time for that eventual splurge.",
                  "type": "text",
                  "marks": [
                    {
                      "type": "textStyle",
                      "attrs": { "color": "rgb(0, 0, 0)" }
                    }
                  ]
                }
              ]
            },
            {
              "type": "paragraph",
              "content": [
                {
                  "text": "To get started, click below to explore all of the federally insured products currently available on SaveBetter. Select the one that best fits your needs, then either sign up for an account or log in to complete the process and put your tax refund to work.",
                  "type": "text",
                  "marks": [
                    {
                      "type": "textStyle",
                      "attrs": { "color": "rgb(0, 0, 0)" }
                    }
                  ]
                }
              ]
            }
          ]
        },
        "title": "",
        "component": "blogPostSection",
        "hasBorder": false,
        "hasBackground": false,
        "hasPaddingTop": false,
        "hasPaddingBottom": false
      },
      {
        "_uid": "b8bab195-4ba7-4e7e-bc33-e5ae71d65e56",
        "href": "https://www.savebetter.com/explore-products",
        "kind": "primary",
        "size": "medium",
        "text": "View offers",
        "target": "_self",
        "justify": "justify-center",
        "rounded": "rounded",
        "disabled": false,
        "component": "button",
        "hasBackground": false,
        "hasPaddingTop": false,
        "backgroundColor": "",
        "hasPaddingBottom": false,
        "isSecondaryColor": false
      },
      {
        "_uid": "cca1dcdf-db77-4ccc-90ad-0d92992813d7",
        "text": {
          "type": "doc",
          "content": [
            {
              "type": "paragraph",
              "content": [
                {
                  "text": "How to get started with SaveBetter",
                  "type": "text",
                  "marks": [
                    {
                      "type": "link",
                      "attrs": {
                        "href": "/blogs/how-to-get-started-with-savebetter",
                        "uuid": "a9752f1e-b83c-410d-8b0f-befd5b19ca7c",
                        "anchor": null,
                        "custom": {},
                        "target": "_blank",
                        "linktype": "story"
                      }
                    }
                  ]
                }
              ]
            },
            {
              "type": "paragraph",
              "content": [
                {
                  "text": "Maximize federal deposit insurance with SaveBetter",
                  "type": "text",
                  "marks": [
                    {
                      "type": "link",
                      "attrs": {
                        "href": "/blogs/maximizing-federal-deposit-insurance",
                        "uuid": "4f712d14-ea77-4f32-8939-ec3f3f7d7960",
                        "anchor": null,
                        "custom": {},
                        "target": "_blank",
                        "linktype": "story"
                      }
                    }
                  ]
                }
              ]
            },
            {
              "type": "paragraph",
              "content": [
                {
                  "text": "4 ways SaveBetter platform will help you smash your savings goals",
                  "type": "text",
                  "marks": [
                    {
                      "type": "link",
                      "attrs": {
                        "href": "/blogs/4-ways-savebetter-will-help-you-smash-your-savings-goals",
                        "uuid": "73eb2f1c-30b6-4735-bb7a-668a1505793e",
                        "anchor": null,
                        "custom": {},
                        "target": "_blank",
                        "linktype": "story"
                      }
                    }
                  ]
                }
              ]
            },
            {
              "type": "paragraph",
              "content": [
                {
                  "text": "SaveBetter.com: A better way to reach your savings goals",
                  "type": "text",
                  "marks": [
                    {
                      "type": "link",
                      "attrs": {
                        "href": "/blogs/savebetter-com-a-better-way-to-reach-your-savings-goals",
                        "uuid": "2015bc7d-24bc-42b0-8cec-f6c94b26874f",
                        "anchor": null,
                        "custom": {},
                        "target": "_blank",
                        "linktype": "story"
                      }
                    }
                  ]
                }
              ]
            }
          ]
        },
        "title": "Related articles",
        "component": "blogPostSection",
        "hasBorder": false,
        "hasBackground": true,
        "hasPaddingTop": false,
        "hasPaddingBottom": false
      },
      {
        "_uid": "28621934-f05d-48f2-8d8a-841e9b62400a",
        "text": {
          "type": "doc",
          "content": [
            {
              "type": "paragraph",
              "content": [
                {
                  "text": "This is not considered to be investment advice.",
                  "type": "text",
                  "marks": [{ "type": "italic" }]
                }
              ]
            }
          ]
        },
        "title": "",
        "component": "blogPostSection",
        "hasBorder": false,
        "hasBackground": false,
        "hasPaddingTop": false,
        "hasPaddingBottom": false
      }
    ],
    "image": [
      {
        "alt": "two blue beach chairs under a white umbrella",
        "img": "//a.storyblok.com/f/180759/1584x800/ec8b2d4954/beachside-chairs.png",
        "_uid": "4384988d-c1e4-498f-a610-1703e1072793",
        "mobile": "",
        "tablet": "",
        "desktop": "",
        "component": "media"
      }
    ],
    "intro": "",
    "title": "The safe, secure way to get more out of your tax refund",
    "metadata": {
      "_uid": "dc4c45a7-256c-4a58-9594-3642fa134b33",
      "title": "Safe, secure way to get more out of your tax refund | SaveBetter",
      "plugin": "meta-fields",
      "description": "Looking for one of the best ways to get the most out of your tax return? With federally insured deposits, you can lock in a top interest rate plus be sure that your money is safe."
    },
    "component": "blogPostPage",
    "categories": [
      "12716529-9eb5-408c-b8c8-8f5355832667",
      "6305ef4d-a589-447a-a4ca-5293dc446796"
    ],
    "disableIndexing": true,
    "showBreadcrumbs": false,
    "blogPostEndingSection": [
      {
        "_uid": "0a9fc375-4fae-44d1-abd2-39f9314ceae9",
        "links": ["Facebook", "LinkedIn", "Twitter2", "Email"],
        "footNote": "",
        "component": "blogPostEndingSection",
        "hasBorder": false,
        "sectionTitle": "Share this article",
        "hasBackground": false,
        "hasPaddingTop": true,
        "hasPaddingBottom": true
      }
    ]
  },
  "slug": "the-safe-secure-way-to-get-more-out-of-your-tax-refund-sponsored",
  "full_slug": "blogs/the-safe-secure-way-to-get-more-out-of-your-tax-refund-sponsored",
  "sort_by_date": null,
  "position": 0,
  "tag_list": [],
  "is_startpage": false,
  "parent_id": 290604867,
  "meta_data": null,
  "group_id": "b28bbfcf-79bf-4cc1-867b-e181bd2f7927",
  "first_published_at": "2022-09-14T19:51:47.025Z",
  "release_id": null,
  "lang": "default",
  "path": null,
  "alternates": [],
  "default_full_slug": null,
  "translated_slugs": null
}
