{
  "name": "Ponce Bank",
  "created_at": "2023-04-12T09:56:27.252Z",
  "published_at": "2023-02-23T18:45:16.303Z",
  "id": 290605011,
  "uuid": "288309c0-bfa9-44e7-b180-42a334de7779",
  "content": {
    "_uid": "1cdd7225-a154-4483-9fd5-13858a152f8b",
    "body": [
      {
        "_uid": "fba42cd5-694e-46a4-8409-f708ffa62de1",
        "link": [],
        "media": [
          {
            "alt": "An illustration of a local deli and grocery store",
            "img": "//a.storyblok.com/f/70134/585x528/458bc272df/about-ponce-bank.svg",
            "_uid": "247a388d-12d6-4447-81fd-c6b612176517",
            "component": "media"
          }
        ],
        "title": "About Ponce Bank",
        "content": [
          {
            "_uid": "126201de-e351-4366-93db-62ff23602e5d",
            "content": {
              "type": "doc",
              "content": [
                {
                  "type": "paragraph",
                  "content": [
                    {
                      "text": "Ponce Bank was born in The Bronx in 1960, a time when most banks had abandoned what was then perceived to be a community in decline but in which our founders saw nothing but the potential of proud neighborhoods anchored by a strong immigrant work ethic and entrepreneurial spirit. They dreamed that all that was needed was a financial fuel. And in the 60 years since, we’ve provided that fuel for this engine of creativity and resilience and we’ve helped develop pockets of this spirit throughout The Bronx, Brooklyn, Queens, Manhattan and New Jersey. We never landed in comfortable places, choosing to help where help was needed most, and during this time we’ve become trusted partners throughout the communities we serve. ",
                      "type": "text"
                    }
                  ]
                },
                {
                  "type": "paragraph",
                  "content": [
                    {
                      "text": "Our designation as a Community Development Financial Institution (CDFI) certifies this role as an investor in the future of underserved and underbanked communities.",
                      "type": "text"
                    }
                  ]
                },
                {
                  "type": "paragraph",
                  "content": [
                    {
                      "text": "Ponce Bank. Dreamers Welcome.",
                      "type": "text",
                      "marks": [{ "type": "bold" }]
                    }
                  ]
                }
              ]
            },
            "heading": "",
            "component": "mediaBlockContent"
          }
        ],
        "component": "mediaSection2",
        "hasBorder": false,
        "hasBackground": false,
        "hasPaddingTop": true,
        "hasPaddingBottom": true
      },
      {
        "_uid": "9bf315f9-9fd4-4473-bb2e-e442d5e6a7dc",
        "isLink": true,
        "component": "mediaSection3v2",
        "hasBorder": false,
        "sectionTitle": "Certified Community Development Financial Institution (CDFI)",
        "contentBlocks": [
          {
            "_uid": "70851220-b8f6-412e-9813-beb58fc4a7fc",
            "link": [],
            "media": [
              {
                "alt": "Ponce Bank is CDFI certified",
                "img": "//a.storyblok.com/f/70134/564x410/d6954662eb/cdfi-logo.png",
                "_uid": "ea953368-1cd1-4980-8760-e5e8b2e6667e",
                "component": "media"
              }
            ],
            "title": "",
            "content": {
              "type": "doc",
              "content": [
                {
                  "type": "paragraph",
                  "content": [
                    {
                      "text": "We earned our CDFI status by investing more than 80% of our assets in low and moderate income communities. Your deposit helps us keep investing in underserved communities hard hit by the Covid crisis.",
                      "type": "text"
                    }
                  ]
                },
                {
                  "type": "paragraph",
                  "content": [
                    {
                      "text": "Community Development Financial Institutions (CDFIs) share a common goal of expanding economic opportunity in low-income communities by providing access to financial products and services for local residents and businesses.",
                      "type": "text"
                    }
                  ]
                }
              ]
            },
            "component": "contentWithMediaBlock"
          }
        ],
        "hasBackground": true,
        "hasPaddingTop": true,
        "showImageMobile": true,
        "hasPaddingBottom": true
      },
      {
        "_uid": "3451442a-a111-40ed-aecb-506101f499f9",
        "isLink": true,
        "component": "mediaSection3v2",
        "hasBorder": false,
        "sectionTitle": "Ponce Bank is an FDIC insured financial institution",
        "contentBlocks": [
          {
            "_uid": "fe07f47d-9933-4cea-9d2d-3357d6ffdac5",
            "link": [
              {
                "url": "https://www.fdic.gov/deposit/deposits/",
                "_uid": "bc9805cd-34fd-4ee0-b9c3-efedb36bfbb3",
                "text": "Click to learn more about FDIC insurance",
                "target": "_blank",
                "component": "link"
              }
            ],
            "media": [
              {
                "alt": "FDIC insured financial institution",
                "img": "//a.storyblok.com/f/70134/720x285/5e201cdf81/us-fdic-logo.svg",
                "_uid": "1f98c9c5-a7aa-4da0-870d-2a2d83c71863",
                "component": "media"
              }
            ],
            "title": "Federal Deposit Insurance Corporation",
            "content": {
              "type": "doc",
              "content": [
                {
                  "type": "paragraph",
                  "content": [
                    {
                      "text": "Ponce Bank is a member of the FDIC.  Deposits in Ponce Bank are insured by the FDIC up to the limits of federal law. The standard insurance amount is $250,000 per depositor, per insured bank, for each deposit account ownership category.",
                      "type": "text"
                    }
                  ]
                }
              ]
            },
            "component": "contentWithMediaBlock"
          }
        ],
        "hasBackground": false,
        "hasPaddingTop": true,
        "showImageMobile": true,
        "hasPaddingBottom": true
      },
      {
        "_uid": "823d59b8-a0f9-4223-8a08-b54adab7be1e",
        "media": [
          {
            "alt": "What is save better",
            "img": "//a.storyblok.com/f/180759/720x381/3ae7d90609/what-is-savebetter.jpeg",
            "_uid": "07655cd4-710c-49b5-9931-ecc60f04ad2e",
            "component": "media"
          }
        ],
        "title": "Ponce Bank, powered by SaveBetter",
        "button": [],
        "component": "mediaSection4",
        "hasBorder": false,
        "description": "Ponce Bank uses the secure SaveBetter platform to feature and manage specially selected savings products. Customers open accounts at SaveBetter.com and the platform manages all aspects of the products offered by Ponce Bank including operations, customer service and marketing. In simple terms, SaveBetter is a consumer facing digital storefront that provides access to Ponce Bank products. Best of all, SaveBetter is completely free!",
        "hasBackground": true,
        "hasPaddingTop": true,
        "hasPaddingBottom": true
      },
      {
        "_uid": "b6b708a3-8530-4a6f-bf18-b03585f7e5e0",
        "link": [],
        "steps": [
          {
            "_uid": "054dc6a2-2d91-48df-8217-f2ba03ac7860",
            "text": "Discover competitive savings products.",
            "media": [
              {
                "alt": "discover savings products",
                "img": "//a.storyblok.com/f/180759/x/cfc185abac/step-1.svg",
                "_uid": "829e12e6-b96b-411e-8140-0531496fee08",
                "component": "media"
              }
            ],
            "component": "stepv2"
          },
          {
            "_uid": "8aa50585-81cc-43b5-9823-e5350d893503",
            "text": "Select the right products for your savings goals.",
            "media": [
              {
                "alt": "select a product for savings goals",
                "img": "//a.storyblok.com/f/180759/x/f830e23cb7/step-2-1-1.svg",
                "_uid": "a8760217-a7ef-4632-a2e8-a454ffe07309",
                "component": "media"
              }
            ],
            "component": "stepv2"
          },
          {
            "_uid": "a20547e7-8c95-4783-8e2d-98d9ae65242c",
            "text": "Register for a SaveBetter account — one is all you need!",
            "media": [
              {
                "alt": "register for SaveBetter",
                "img": "//a.storyblok.com/f/180759/x/c31edded4a/step-3-2.svg",
                "_uid": "6a2bd48e-262a-46ec-9072-108325f415be",
                "component": "media"
              }
            ],
            "component": "stepv2"
          },
          {
            "_uid": "c38e586f-6046-4ea9-b1b3-5a97fcf3fdcd",
            "text": "Fund and access your new savings products.",
            "media": [
              {
                "alt": "fund and access new savings products",
                "img": "//a.storyblok.com/f/180759/x/f474b8dadf/step-4-3.svg",
                "_uid": "3d89c7fa-fb4c-40f1-abfa-092e700cedeb",
                "component": "media"
              }
            ],
            "component": "stepv2"
          }
        ],
        "title": "Start saving in 4 simple steps:",
        "component": "stepsv2",
        "hasBorder": false,
        "sectionTitle": "Now you can add more savings products any time you want. It’s that simple!",
        "hasBackGround": false,
        "hasBackground": false,
        "hasPaddingTop": true,
        "hasPaddingBottom": true
      },
      {
        "_uid": "6b7749f8-ebe1-4935-8fd9-b7483adad285",
        "link": [
          {
            "url": "/faq",
            "_uid": "1897acd8-af65-47d1-8f2e-d94c0e32ed8e",
            "text": "Read more FAQs",
            "target": "_self",
            "component": "link"
          }
        ],
        "title": "FAQs",
        "component": "faq",
        "hasBorder": false,
        "questions": [
          {
            "_uid": "cd9be0c7-c0e5-40ff-9978-8fb1b1ce009e",
            "answer": {
              "type": "doc",
              "content": [
                {
                  "type": "paragraph",
                  "content": [
                    {
                      "text": "SaveBetter is a digital platform that gives savers unparalleled access to a variety of deposit products through the convenience of a single account, helping you unlock the growth potential of your cash savings.",
                      "type": "text"
                    }
                  ]
                },
                {
                  "type": "paragraph",
                  "content": [
                    {
                      "text": "SaveBetter customers use the platform to fund federally insured deposit products offered by numerous U.S. banks and credit unions with a wide range of maturities and APYs (annual percentage yield), allowing you to build a savings strategy to suit your earning and liquidity needs.",
                      "type": "text"
                    }
                  ]
                },
                {
                  "type": "paragraph",
                  "content": [
                    {
                      "text": "SaveBetter is not a bank. It provides the digital “storefront” where banks and credit unions can promote their deposit products.",
                      "type": "text"
                    }
                  ]
                },
                {
                  "type": "paragraph",
                  "content": [
                    {
                      "text": "SaveBetter is operated by SaveBetter LLC, a 100% subsidiary of Raisin GmbH, a trailblazer for open banking in the deposits and investments space. In the U.S., Raisin helps banks and credit unions improve their deposit funding by offering national reach for their retail deposit products, and provides savers with better access, more choice and higher convenience when evaluating savings products from FDIC insured banks and NCUA insured credit unions.",
                      "type": "text"
                    }
                  ]
                }
              ]
            },
            "question": "What is SaveBetter?",
            "component": "faqItem",
            "hasPaddingTop": false,
            "hasPaddingBottom": false
          },
          {
            "_uid": "52993d6f-29d7-47e8-aaaa-b3bac1505ab2",
            "answer": {
              "type": "doc",
              "content": [
                {
                  "type": "paragraph",
                  "content": [
                    {
                      "text": "Your SaveBetter account gives you access to savings accounts and Certificates of Deposit (CDs) offered by a variety of banks and credit unions with the security of FDIC and NCUA insurance, respectively. These products include:",
                      "type": "text"
                    }
                  ]
                },
                { "type": "paragraph" },
                {
                  "type": "bullet_list",
                  "content": [
                    {
                      "type": "list_item",
                      "content": [
                        {
                          "type": "paragraph",
                          "content": [
                            {
                              "text": "High-yield Savings Account (HYSA).",
                              "type": "text",
                              "marks": [{ "type": "bold" }]
                            },
                            {
                              "text": " As its name indicates, this account type functions like a traditional savings account—with typically no restrictions on depositing and withdrawing funds—but earns interest at rates that are higher than the national average for standard savings accounts. ",
                              "type": "text"
                            }
                          ]
                        },
                        { "type": "paragraph" }
                      ]
                    },
                    {
                      "type": "list_item",
                      "content": [
                        {
                          "type": "paragraph",
                          "content": [
                            {
                              "text": "Money Market Deposit Account (MMDA).",
                              "type": "text",
                              "marks": [{ "type": "bold" }]
                            },
                            {
                              "text": " Also known as a money market account or MMA, this type of savings account offers a varying rate that allows you to earn interest on your funds with maximum flexibility for withdrawals. Like a HYSA, an MMDA offers features of a traditional savings account with typically higher returns. ",
                              "type": "text"
                            }
                          ]
                        },
                        { "type": "paragraph" }
                      ]
                    },
                    {
                      "type": "list_item",
                      "content": [
                        {
                          "type": "paragraph",
                          "content": [
                            {
                              "text": "No Penalty CD.",
                              "type": "text",
                              "marks": [{ "type": "bold" }]
                            },
                            {
                              "text": " Through the flexibility of a No Penalty CD, you can lock in a competitive rate for a fixed term with the option to make a full withdrawal at any time beginning seven (7) calendar days after funding without having to pay a penalty for the early termination.",
                              "type": "text"
                            }
                          ]
                        },
                        { "type": "paragraph" }
                      ]
                    },
                    {
                      "type": "list_item",
                      "content": [
                        {
                          "type": "paragraph",
                          "content": [
                            {
                              "text": "Fixed Term CD.",
                              "type": "text",
                              "marks": [{ "type": "bold" }]
                            },
                            {
                              "text": " With this longstanding savings vehicle, funds are held for a fixed term, and a competitive interest rate provides safe, predictable earnings. In contrast to No Penalty CDs, typically you are charged a fee if you do not complete the full term of the Fixed Term CD.",
                              "type": "text"
                            }
                          ]
                        }
                      ]
                    }
                  ]
                }
              ]
            },
            "question": "What types of products are available through SaveBetter?",
            "component": "faqItem",
            "hasPaddingTop": false,
            "hasPaddingBottom": false
          },
          {
            "_uid": "30fc7be8-d68a-4847-9dfa-488b080912cf",
            "answer": {
              "type": "doc",
              "content": [
                {
                  "type": "paragraph",
                  "content": [
                    {
                      "text": "Interest (or dividend in the case of credit union savings products) is compounded daily and posted to your account monthly. ",
                      "type": "text"
                    }
                  ]
                }
              ]
            },
            "question": "How often is interest compounded?",
            "component": "faqItem",
            "hasPaddingTop": false,
            "hasPaddingBottom": false
          },
          {
            "_uid": "81eb7436-1c12-4db1-82ba-41e3dd435a52",
            "answer": {
              "type": "doc",
              "content": [
                {
                  "type": "paragraph",
                  "content": [
                    { "text": "The short answer is yes! ", "type": "text" }
                  ]
                },
                {
                  "type": "paragraph",
                  "content": [
                    {
                      "text": "For SaveBetter customers who hold savings products offered by one of our partner banks, funds are ",
                      "type": "text"
                    },
                    {
                      "text": "insured by the FDIC",
                      "type": "text",
                      "marks": [
                        {
                          "type": "link",
                          "attrs": {
                            "href": "https://www.fdic.gov/resources/deposit-insurance/",
                            "uuid": null,
                            "anchor": null,
                            "target": "_blank",
                            "linktype": "url"
                          }
                        }
                      ]
                    },
                    {
                      "text": " up to the maximum amount in accordance with and as permitted by law at each bank holding their funds. The standard deposit insurance coverage limit is $250,000 per depositor, per FDIC-insured bank, per account ownership category. Ownership categories as defined by the FDIC include single bank accounts (owned by one person/depositor) and joint bank accounts (owned by two or more persons/depositors). Revocable trust accounts and some types of retirement accounts (e.g., IRAs) are among the other ownership categories covered by FDIC insurance. All deposits you have at a bank — whether facilitated through SaveBetter or otherwise — count toward the deposit insurance limit. If funds held at a bank in a certain ownership category exceed the coverage limit, then the amount in excess of the limit will not be insured.",
                      "type": "text"
                    }
                  ]
                },
                {
                  "type": "paragraph",
                  "content": [
                    {
                      "text": "If you hold a savings product offered by one of our partner credit unions — making you a member of the institution — funds are ",
                      "type": "text"
                    },
                    {
                      "text": "insured by the NCUA",
                      "type": "text",
                      "marks": [
                        {
                          "type": "link",
                          "attrs": {
                            "href": "https://www.ncua.gov/support-services/share-insurance-fund",
                            "uuid": null,
                            "anchor": null,
                            "target": "_blank",
                            "linktype": "url"
                          }
                        }
                      ]
                    },
                    {
                      "text": " through its Share Insurance Fund. According to the NCUA, each credit union member has at least $250,000 in total coverage. The Share Insurance Fund insures individual accounts up to $250,000. Additionally, a member’s interest in all joint accounts combined is insured up to $250,000.",
                      "type": "text"
                    }
                  ]
                }
              ]
            },
            "question": "Does my SaveBetter account have deposit insurance?",
            "component": "faqItem",
            "hasPaddingTop": false,
            "hasPaddingBottom": false
          },
          {
            "_uid": "2a2c73f4-86d8-4b5c-8649-4c17caf543f3",
            "answer": {
              "type": "doc",
              "content": [
                {
                  "type": "paragraph",
                  "content": [
                    {
                      "text": "At SaveBetter, cybersecurity is our priority. SaveBetter is a SOC 2 certified platform, meaning it has been validated by outside auditors across five (5) key information security principles. We also use a variety of measures to protect our customers' data, privacy and transactions, including:",
                      "type": "text"
                    }
                  ]
                },
                {
                  "type": "paragraph",
                  "content": [
                    {
                      "text": "•\tUser authentication.",
                      "type": "text",
                      "marks": [{ "type": "bold" }]
                    },
                    {
                      "text": " The SaveBetter platform uses multi-factor authentication combined with leading authentication technology to validate our customers’ identities.",
                      "type": "text"
                    }
                  ]
                },
                {
                  "type": "paragraph",
                  "content": [
                    {
                      "text": "•\tData encryption.",
                      "type": "text",
                      "marks": [{ "type": "bold" }]
                    },
                    {
                      "text": " Your personal information is encrypted in-transit and at rest using advanced cryptographic security algorithms.",
                      "type": "text"
                    }
                  ]
                },
                {
                  "type": "paragraph",
                  "content": [
                    {
                      "text": "•\tSite protection.",
                      "type": "text",
                      "marks": [{ "type": "bold" }]
                    },
                    {
                      "text": " Cloudflare™ advanced internet protection technologies are implemented to protect SaveBetter.com from malicious actors, botnets and denial of service attacks (DDOS).",
                      "type": "text"
                    }
                  ]
                },
                {
                  "type": "paragraph",
                  "content": [
                    {
                      "text": "•\tMonitoring.",
                      "type": "text",
                      "marks": [{ "type": "bold" }]
                    },
                    {
                      "text": " An always-on information security monitoring platform detects and alerts us to information security events.",
                      "type": "text"
                    }
                  ]
                },
                {
                  "type": "paragraph",
                  "content": [
                    {
                      "text": "•\tAssessments.",
                      "type": "text",
                      "marks": [{ "type": "bold" }]
                    },
                    {
                      "text": " Our platform undergoes vigorous security assessments and testing throughout the lifecycle of application development, from architecture planning to production phases.",
                      "type": "text"
                    }
                  ]
                },
                {
                  "type": "paragraph",
                  "content": [
                    {
                      "text": "Cloudflare™ is a registered trademark of Cloudflare, Inc.",
                      "type": "text"
                    }
                  ]
                }
              ]
            },
            "question": "How does SaveBetter protect my data, privacy, and finances?",
            "component": "faqItem",
            "hasPaddingTop": false,
            "hasPaddingBottom": false
          },
          {
            "_uid": "0d0c07db-2ca4-472b-b371-35c582991186",
            "answer": {
              "type": "doc",
              "content": [
                {
                  "type": "paragraph",
                  "content": [
                    {
                      "text": "A. Check out our savings marketplace and choose a product in which you would like to deposit money. ",
                      "type": "text"
                    }
                  ]
                },
                {
                  "type": "paragraph",
                  "content": [
                    {
                      "text": "B. Create your username and password.",
                      "type": "text"
                    }
                  ]
                },
                {
                  "type": "paragraph",
                  "content": [
                    {
                      "text": "C. Complete an application and, after successful identity verification, link a bank account from which to fund your first savings product.",
                      "type": "text"
                    }
                  ]
                },
                {
                  "type": "paragraph",
                  "content": [
                    {
                      "text": "D. Start earning interest as soon as your money is received by the bank or credit union offering the savings product you selected.",
                      "type": "text"
                    }
                  ]
                },
                {
                  "type": "paragraph",
                  "content": [
                    {
                      "text": "Any questions or concerns? Email us at ",
                      "type": "text"
                    },
                    {
                      "text": "service@SaveBetter.com",
                      "type": "text",
                      "marks": [
                        {
                          "type": "link",
                          "attrs": {
                            "href": "service@SaveBetter.com",
                            "uuid": null,
                            "anchor": null,
                            "target": "_blank",
                            "linktype": "email"
                          }
                        }
                      ]
                    },
                    { "text": ".", "type": "text" }
                  ]
                }
              ]
            },
            "question": "How do I open a SaveBetter account?",
            "component": "faqItem",
            "hasPaddingTop": false,
            "hasPaddingBottom": false
          },
          {
            "_uid": "59f65eb8-c6d3-4423-a0be-2847d355ac97",
            "answer": {
              "type": "doc",
              "content": [
                {
                  "type": "paragraph",
                  "content": [
                    {
                      "text": "All deposits and withdrawals are completed within one to three (1-3) business days. After the initial deposit a withdrawals limitation for the first few business days may exist.",
                      "type": "text"
                    }
                  ]
                },
                {
                  "type": "paragraph",
                  "content": [
                    {
                      "text": "Business days are Monday through Friday excluding U.S. bank holidays.",
                      "type": "text"
                    }
                  ]
                }
              ]
            },
            "question": "How long does it take to deposit my money? What about withdrawals?",
            "component": "faqItem",
            "hasPaddingTop": false,
            "hasPaddingBottom": false
          },
          {
            "_uid": "bbf3b8b6-b47e-469a-8678-966233bcefef",
            "answer": {
              "type": "doc",
              "content": [
                {
                  "type": "paragraph",
                  "content": [
                    {
                      "text": "For products offered by banks, all necessary registration is handled when you become a SaveBetter customer. One of the many benefits of our platform is that you can open a single account and earn competitive interest rates from banks in the SaveBetter network. When you select and fund a savings product offered by a credit union, there is an additional step of becoming a member. SaveBetter makes that process quick, easy and free. You still have one SaveBetter login and can view all your savings products in one convenient dashboard.",
                      "type": "text"
                    }
                  ]
                }
              ]
            },
            "question": "Will I need to register for accounts at the financial institutions where I've chosen to deposit my money? Am I a customer of those banks or a member of those credit unions?",
            "component": "faqItem",
            "hasPaddingTop": false,
            "hasPaddingBottom": false
          },
          {
            "_uid": "b6a2c476-dc2c-4df8-bde9-ffb8fdf7d5c3",
            "answer": {
              "type": "doc",
              "content": [
                {
                  "type": "paragraph",
                  "content": [
                    {
                      "text": "The current APY for your savings products can always be viewed on the Account Overview page when you are logged in to SaveBetter. This information also appears on monthly statements.",
                      "type": "text"
                    }
                  ]
                }
              ]
            },
            "question": "Where can I view my savings products’ Annual Percentage Yield (APY)?",
            "component": "faqItem",
            "hasPaddingTop": false,
            "hasPaddingBottom": false
          },
          {
            "_uid": "0d2ab3ac-2a58-4b19-8296-f404ff69fd12",
            "answer": {
              "type": "doc",
              "content": [
                {
                  "type": "paragraph",
                  "content": [
                    {
                      "text": "You cannot currently link your SaveBetter account to a third-party app, but we may offer this feature in the future.  For now, you will not be able to link your selected savings product to a third-party app even if the bank or credit union offering that product does so outside of the SaveBetter platform.",
                      "type": "text"
                    }
                  ]
                }
              ]
            },
            "question": "Can I link my SaveBetter account or selected savings product to a third-party app? ",
            "component": "faqItem",
            "hasPaddingTop": false,
            "hasPaddingBottom": false
          }
        ],
        "hasBackground": true,
        "hasPaddingTop": true,
        "hasPaddingBottom": true
      }
    ],
    "logo": [
      {
        "alt": "Ponce Bank logo",
        "img": "//a.storyblok.com/f/70134/236x72/e51beb46b1/ponce-bank-logo-w.svg",
        "_uid": "2b855fae-df94-4d86-9b9b-54f49f549d8f",
        "component": "media"
      }
    ],
    "test": "",
    "title": "Exclusive offers",
    "layout": {
      "id": "a7887b35-4fec-4639-a28f-c4afd03fa845",
      "url": "savedo.ch",
      "linktype": "story",
      "fieldtype": "multilink",
      "cached_url": "layouts/explore-product-no-nav-layout"
    },
    "metadata": {
      "_uid": "3724defc-38a4-4567-a304-1085c4999972",
      "title": "Ponce Bank: View Savings Accounts | SaveBetter",
      "plugin": "meta-fields",
      "description": "View current savings products available from Ponce Bank."
    },
    "component": "page",
    "isTextWhite": true,
    "headerOutline": [
      {
        "_uid": "a3aed430-b861-4a36-9cd3-922171fe5f02",
        "title": "All Savings Products from Ponce Bank",
        "bankCode": "6189498061e8a80001e05184",
        "component": "productOfferTable",
        "hasBorder": false,
        "productId": "",
        "hasBackground": false,
        "hasPaddingTop": false,
        "featuredProducts": [],
        "hasPaddingBottom": false,
        "showSelectedProductTypes": [],
        "hasFinancialInstitutionsDropdown": false
      }
    ],
    "disableIndexing": false,
    "showBreadcrumbs": false,
    "headerBackground": [
      {
        "alt": "Mother and daughter hugging and laughing",
        "img": "//a.storyblok.com/f/180759/2560x800/41ca9e2b37/ponce-1.webp",
        "_uid": "4768358c-8f1d-4891-9949-edc1c1f49e0b",
        "component": "media"
      }
    ],
    "introductionLink": [],
    "introductionList": [
      {
        "_uid": "0d55b9cb-e7df-447d-8880-2d8ce2cb0cf7",
        "text": "FDIC insured. No fees.",
        "component": "introductionListItem"
      },
      {
        "_uid": "87f8f778-cdf9-4d5c-9a48-2402117e1d92",
        "text": "Bank with purpose: your deposit helps us keep investing in underserved communities hard hit by the Covid crisis.",
        "component": "introductionListItem"
      }
    ],
    "isLinkSecondaryColor": true,
    "introductionDescription": ""
  },
  "slug": "ponce-bank",
  "full_slug": "product-banks/ponce-bank",
  "sort_by_date": null,
  "position": 80,
  "tag_list": [],
  "is_startpage": false,
  "parent_id": 290604868,
  "meta_data": null,
  "group_id": "07c14bc1-c9bc-41b5-8ad8-d108d9d99eb7",
  "first_published_at": "2020-01-06T15:09:15.000Z",
  "release_id": null,
  "lang": "default",
  "path": null,
  "alternates": [],
  "default_full_slug": null,
  "translated_slugs": null
}
