{
  "name": "Continental Bank High-yield Savings Account",
  "created_at": "2023-04-12T09:56:30.244Z",
  "published_at": "2023-02-23T18:38:05.591Z",
  "id": 290605088,
  "uuid": "0ed75030-10de-43f2-b0bb-20f59c5b1f3f",
  "content": {
    "_uid": "1cdd7225-a154-4483-9fd5-13858a152f8b",
    "body": [
      {
        "_uid": "b53d24c3-7daf-4d05-a501-22e54a6cbb32",
        "title": "Earn {61a52f5bc952900001743a62-APY}{FDIC-S} times the national average APY",
        "component": "productComparison",
        "buttonLink": "https://app.savebetter.com/auth/register?productId=61a52f5bc952900001743a62",
        "layoutType": "col",
        "productVar": "{61a52f5bc952900001743a62-product}",
        "bankHexColor": "#2c3e50",
        "apyTitleColor": "text-white",
        "hasBackground": false,
        "hasPaddingTop": false,
        "comparisonTitle": "Don't settle for average rates",
        "hasPaddingBottom": false,
        "nationalAverageVar": "{FDIC-S}",
        "comparisonDescription": "Receive a competitive rate with the ability to withdraw or add funds whenever you like. Flexibility to withdraw as much as you want, whenever you want; there are no restrictions.",
        "nationalAverageDisclaimer": "Non-jumbo deposits under $100,000",
        "nationalAverageDescription": "Savings Accounts"
      },
      {
        "_uid": "504b270b-e3de-4e5b-aad3-4f24cffc88ad",
        "link": [
          {
            "url": "https://app.savebetter.com/auth/register?productId=61a52f5bc952900001743a62",
            "_uid": "eab16e24-4dae-4bac-9fc1-51403711f2ad",
            "text": "Start Saving",
            "target": "_blank",
            "component": "link"
          }
        ],
        "media": [
          {
            "alt": "The skyline of Salt Lake City",
            "img": "//a.storyblok.com/f/70134/585x381/ff722af756/continental-bank.jpg",
            "_uid": "91b6365f-d560-4852-afb8-0ca089b94f2e",
            "component": "media"
          }
        ],
        "title": "This deposit product is offered through SaveBetter by Continental Bank",
        "content": [
          {
            "_uid": "5889849a-af65-4e53-86cf-d2e63f2f1a6d",
            "content": {
              "type": "doc",
              "content": [
                {
                  "type": "paragraph",
                  "content": [
                    {
                      "text": "Continental Bank is a privately owned FDIC-insured commercial bank founded in 2003 and headquartered in Salt Lake City, Utah, serving the banking needs of small and medium-sized businesses nationwide. Seventeen years of experience has taught us to listen to our customers, identify their needs, and think outside the box to find a solution that works for everyone.",
                      "type": "text"
                    }
                  ]
                },
                {
                  "type": "paragraph",
                  "content": [{ "text": " ", "type": "text" }]
                },
                {
                  "type": "paragraph",
                  "content": [
                    {
                      "text": "Continental Bank’s mission is to create value through fostering a culture where the Bank’s employees, customers and communities thrive.",
                      "type": "text"
                    }
                  ]
                }
              ]
            },
            "heading": "About Continental Bank",
            "component": "mediaBlockContent"
          }
        ],
        "component": "mediaSection2",
        "hasBorder": false,
        "hasBackground": true,
        "hasPaddingTop": true,
        "hasPaddingBottom": true
      },
      {
        "_uid": "21783ed0-d537-4cb3-9b8f-cd9e5f54af37",
        "cards": [
          {
            "_uid": "ee80e03f-a15a-4f9b-8ba8-b013a66828a3",
            "link": [
              {
                "url": "https://www.fdic.gov/resources/deposit-insurance/understanding-deposit-insurance/",
                "_uid": "fe73e8a8-095a-4170-9a8a-326f19d3663d",
                "text": "Click to learn more about FDIC insurance",
                "target": "_blank",
                "component": "link"
              }
            ],
            "media": [
              {
                "alt": "FDIC logo",
                "img": "//a.storyblok.com/f/70134/720x285/5e201cdf81/us-fdic-logo.svg",
                "_uid": "aa05bd9b-1553-4fdd-b3e7-e554c13bf2f3",
                "mobile": "",
                "tablet": "",
                "desktop": "",
                "component": "media"
              }
            ],
            "title": "FDIC",
            "component": "card",
            "paragraph": "Continental Bank is a member of the FDIC. Deposits in Continental Bank are insured by the FDIC up to the limits of federal law. The standard insurance amount is $250,000 per depositor, per insured bank, for each deposit account ownership category."
          },
          {
            "_uid": "96031e85-7635-4728-9d41-1fed40c5c360",
            "link": [
              {
                "url": "https://www.savebetter.com/blogs/savebetter-data-protection",
                "_uid": "9940e6b4-c83f-4b98-a769-dfe7200c6a5d",
                "text": "Click to learn more about SOC 2 certification",
                "target": "_blank",
                "component": "link"
              }
            ],
            "media": [
              {
                "alt": "SOC2 logo",
                "img": "//a.storyblok.com/f/70134/250x250/177e6a0e23/soc-service-certifications.png",
                "_uid": "528cc730-72e7-4b4b-b5bd-60ee773f45b7",
                "mobile": "",
                "tablet": "",
                "desktop": "",
                "component": "media"
              }
            ],
            "title": "Cybersecurity is a top priority at SaveBetter",
            "component": "card",
            "paragraph": "We invest in a variety of technologies to protect our customer’s data, privacy and transactions. These include Multi-Factor authentication, encryption, and Cloudflare advanced internet protection and monitoring.  We are a SOC 2 certified organization, which means we have met the requirements outlined by the American Institute of Certified Public Accountants (AICPA) to ensure that we have the controls in place to keep customers' data secure and private. "
          }
        ],
        "title": "Security Is Our Top Priority",
        "component": "cardList1",
        "hasBorder": false,
        "description": "",
        "hasBackground": false,
        "hasPaddingTop": true,
        "hasPaddingBottom": true
      },
      {
        "_uid": "d66d3feb-9fb8-4af9-9dc5-3f194a702632",
        "media": [
          {
            "alt": "What is save better",
            "img": "//a.storyblok.com/f/70134/720x381/34f3a5f15e/what-is-savebetter.jpg",
            "_uid": "a23075ff-21ac-46a0-9c3b-82eca13c3419",
            "component": "media"
          }
        ],
        "title": "Continental Bank & SaveBetter",
        "button": [
          {
            "url": "https://app.savebetter.com/auth/register?productId=61a52f5bc952900001743a62",
            "_uid": "f9778904-7206-4d07-aa31-2f0e4ea7d61a",
            "text": "Start Saving",
            "target": "_blank",
            "component": "link"
          }
        ],
        "component": "mediaSection4",
        "hasBorder": false,
        "description": "The SaveBetter platform features an exclusive selection of high-yielding products offered by our network of banks. It’s your destination to discover competitive savings products and start saving wisely. Select and fund multiple savings products from different institutions, and manage them all from one account!",
        "hasBackground": true,
        "hasPaddingTop": true,
        "hasPaddingBottom": false
      },
      {
        "_uid": "1e5c8097-004e-4f5e-a058-e58bd539ddd4",
        "kind": "2",
        "text": "Open an Account in 3-5 Minutes",
        "block": "",
        "color": "text-black",
        "level": "1",
        "component": "heading",
        "hasPaddingTop": true,
        "hasPaddingBottom": false
      },
      {
        "_uid": "ffa330b4-45f6-40e0-9b3f-db39f275d7d4",
        "component": "mediaSection5",
        "hasBorder": false,
        "contentBlocks": [
          {
            "_uid": "2d59986a-ea0a-4959-8002-d30c95f78133",
            "text": "the right product for your savings goals.",
            "media": [
              {
                "alt": "Select a product",
                "img": "//a.storyblok.com/f/180759/x/cfc185abac/step-1.svg",
                "_uid": "736494a7-fac7-45cf-935c-d157833aa9bf",
                "component": "mediav2"
              }
            ],
            "title": "Select",
            "component": "contentWithMediaBlockv2"
          },
          {
            "_uid": "11cf096f-c417-4741-9090-be4ecb642412",
            "text": "with an email address and password, then verify your identity and bank information.",
            "media": [
              {
                "alt": "Register for a SaveBetter account",
                "img": "//a.storyblok.com/f/180759/x/c31edded4a/step-3-2.svg",
                "_uid": "ff20a869-0104-4ec3-9cfb-146661d1428c",
                "component": "mediav2"
              }
            ],
            "title": "Register",
            "component": "contentWithMediaBlockv2"
          },
          {
            "_uid": "e5f685f0-4b01-4170-aa03-385d2696a560",
            "text": "the savings products you add to your new SaveBetter account.",
            "media": [
              {
                "alt": "Add funds",
                "img": "//a.storyblok.com/f/180759/x/f474b8dadf/step-4-3.svg",
                "_uid": "61f5b78f-9564-4301-a711-cc370f8ad618",
                "component": "mediav2"
              }
            ],
            "title": "Fund",
            "component": "contentWithMediaBlockv2"
          }
        ],
        "hasBackground": false,
        "hasPaddingTop": false,
        "hasPaddingBottom": false
      },
      {
        "_uid": "a6a25b29-55b5-4626-bed0-fb0b464ed57b",
        "href": "https://app.savebetter.com/auth/register?productId=61a52f5bc952900001743a62",
        "kind": "primary",
        "size": "medium",
        "text": "Select product and save",
        "target": "_self",
        "justify": "justify-center",
        "rounded": "rounded",
        "disabled": false,
        "component": "button",
        "hasPaddingTop": false,
        "backgroundColor": "",
        "hasPaddingBottom": true
      },
      {
        "_uid": "d19bd1b4-0bb2-4721-97ce-e5e4658c39e8",
        "link": [
          {
            "url": "/faq",
            "_uid": "1c300ea2-66eb-4298-9a56-3efe38c4dfa2",
            "text": "Read more FAQs",
            "target": "_self",
            "component": "link"
          }
        ],
        "title": "FAQs",
        "component": "faq",
        "hasBorder": false,
        "questions": [
          {
            "_uid": "2fcd06af-b4f9-428d-a799-c8a4d980b64a",
            "answer": {
              "type": "doc",
              "content": [
                {
                  "type": "paragraph",
                  "content": [
                    {
                      "text": "SaveBetter is a digital platform that gives savers unparalleled access to a variety of deposit products through the convenience of a single account, helping you unlock the growth potential of your cash savings.",
                      "type": "text"
                    }
                  ]
                },
                {
                  "type": "paragraph",
                  "content": [
                    {
                      "text": "SaveBetter customers use the platform to fund federally insured deposit products offered by numerous U.S. banks and credit unions with a wide range of maturities and APYs (annual percentage yield), allowing you to build a savings strategy to suit your earning and liquidity needs.",
                      "type": "text"
                    }
                  ]
                },
                {
                  "type": "paragraph",
                  "content": [
                    {
                      "text": "SaveBetter is not a bank. It provides the digital “storefront” where banks and credit unions can promote their deposit products.",
                      "type": "text"
                    }
                  ]
                },
                {
                  "type": "paragraph",
                  "content": [
                    {
                      "text": "SaveBetter is operated by SaveBetter LLC, a 100% subsidiary of Raisin GmbH, a trailblazer for open banking in the deposits and investments space. In the U.S., Raisin helps banks and credit unions improve their deposit funding by offering national reach for their retail deposit products, and provides savers with better access, more choice and higher convenience when evaluating savings products from FDIC insured banks and NCUA insured credit unions.",
                      "type": "text"
                    }
                  ]
                }
              ]
            },
            "question": "What is SaveBetter?",
            "component": "faqItem",
            "hasPaddingTop": false,
            "hasPaddingBottom": false
          },
          {
            "_uid": "1282108e-7884-4a6f-afec-1fcb78677bb6",
            "answer": {
              "type": "doc",
              "content": [
                {
                  "type": "paragraph",
                  "content": [
                    {
                      "text": "Your SaveBetter account gives you access to savings accounts and Certificates of Deposit (CDs) offered by a variety of banks and credit unions with the security of FDIC and NCUA insurance, respectively. These products include:",
                      "type": "text"
                    }
                  ]
                },
                { "type": "paragraph" },
                {
                  "type": "bullet_list",
                  "content": [
                    {
                      "type": "list_item",
                      "content": [
                        {
                          "type": "paragraph",
                          "content": [
                            {
                              "text": "High-yield Savings Account (HYSA).",
                              "type": "text",
                              "marks": [{ "type": "bold" }]
                            },
                            {
                              "text": " As its name indicates, this account type functions like a traditional savings account—with typically no restrictions on depositing and withdrawing funds—but earns interest at rates that are higher than the national average for standard savings accounts. ",
                              "type": "text"
                            }
                          ]
                        },
                        { "type": "paragraph" }
                      ]
                    },
                    {
                      "type": "list_item",
                      "content": [
                        {
                          "type": "paragraph",
                          "content": [
                            {
                              "text": "Money Market Deposit Account (MMDA).",
                              "type": "text",
                              "marks": [{ "type": "bold" }]
                            },
                            {
                              "text": " Also known as a money market account or MMA, this type of savings account offers a varying rate that allows you to earn interest on your funds with maximum flexibility for withdrawals. Like a HYSA, an MMDA offers features of a traditional savings account with typically higher returns. ",
                              "type": "text"
                            }
                          ]
                        },
                        { "type": "paragraph" }
                      ]
                    },
                    {
                      "type": "list_item",
                      "content": [
                        {
                          "type": "paragraph",
                          "content": [
                            {
                              "text": "No Penalty CD.",
                              "type": "text",
                              "marks": [{ "type": "bold" }]
                            },
                            {
                              "text": " Through the flexibility of a No Penalty CD, you can lock in a competitive rate for a fixed term with the option to make a full withdrawal at any time beginning seven (7) calendar days after funding without having to pay a penalty for the early termination.",
                              "type": "text"
                            }
                          ]
                        },
                        { "type": "paragraph" }
                      ]
                    },
                    {
                      "type": "list_item",
                      "content": [
                        {
                          "type": "paragraph",
                          "content": [
                            {
                              "text": "Fixed Term CD.",
                              "type": "text",
                              "marks": [{ "type": "bold" }]
                            },
                            {
                              "text": " With this longstanding savings vehicle, funds are held for a fixed term, and a competitive interest rate provides safe, predictable earnings. In contrast to No Penalty CDs, typically you are charged a fee if you do not complete the full term of the Fixed Term CD.",
                              "type": "text"
                            }
                          ]
                        }
                      ]
                    }
                  ]
                }
              ]
            },
            "question": "What types of products are available through SaveBetter?",
            "component": "faqItem",
            "hasPaddingTop": false,
            "hasPaddingBottom": false
          },
          {
            "_uid": "be600683-de91-420f-a408-431ca3431578",
            "answer": {
              "type": "doc",
              "content": [
                {
                  "type": "paragraph",
                  "content": [
                    {
                      "text": "Interest (or dividend in the case of credit union savings products) is compounded daily and posted to your account monthly. ",
                      "type": "text"
                    }
                  ]
                }
              ]
            },
            "question": "How often is interest compounded?",
            "component": "faqItem",
            "hasPaddingTop": false,
            "hasPaddingBottom": false
          },
          {
            "_uid": "85dc51b2-eabd-4093-a64f-df597cfb03b4",
            "answer": {
              "type": "doc",
              "content": [
                {
                  "type": "paragraph",
                  "content": [
                    { "text": "The short answer is yes! ", "type": "text" }
                  ]
                },
                {
                  "type": "paragraph",
                  "content": [
                    {
                      "text": "For SaveBetter customers who hold savings products offered by one of our partner banks, funds are ",
                      "type": "text"
                    },
                    {
                      "text": "insured by the FDIC",
                      "type": "text",
                      "marks": [
                        {
                          "type": "link",
                          "attrs": {
                            "href": "https://www.fdic.gov/resources/deposit-insurance/",
                            "uuid": null,
                            "anchor": null,
                            "target": "_blank",
                            "linktype": "url"
                          }
                        }
                      ]
                    },
                    {
                      "text": " up to the maximum amount in accordance with and as permitted by law at each bank holding their funds. The standard deposit insurance coverage limit is $250,000 per depositor, per FDIC-insured bank, per account ownership category. Ownership categories as defined by the FDIC include single bank accounts (owned by one person/depositor) and joint bank accounts (owned by two or more persons/depositors). Revocable trust accounts and some types of retirement accounts (e.g., IRAs) are among the other ownership categories covered by FDIC insurance. All deposits you have at a bank — whether facilitated through SaveBetter or otherwise — count toward the deposit insurance limit. If funds held at a bank in a certain ownership category exceed the coverage limit, then the amount in excess of the limit will not be insured.",
                      "type": "text"
                    }
                  ]
                },
                {
                  "type": "paragraph",
                  "content": [
                    {
                      "text": "If you hold a savings product offered by one of our partner credit unions — making you a member of the institution — funds are ",
                      "type": "text"
                    },
                    {
                      "text": "insured by the NCUA",
                      "type": "text",
                      "marks": [
                        {
                          "type": "link",
                          "attrs": {
                            "href": "https://www.ncua.gov/support-services/share-insurance-fund",
                            "uuid": null,
                            "anchor": null,
                            "target": "_blank",
                            "linktype": "url"
                          }
                        }
                      ]
                    },
                    {
                      "text": " through its Share Insurance Fund. According to the NCUA, each credit union member has at least $250,000 in total coverage. The Share Insurance Fund insures individual accounts up to $250,000. Additionally, a member’s interest in all joint accounts combined is insured up to $250,000.",
                      "type": "text"
                    }
                  ]
                }
              ]
            },
            "question": "Does my SaveBetter account have deposit insurance?",
            "component": "faqItem",
            "hasPaddingTop": false,
            "hasPaddingBottom": false
          },
          {
            "_uid": "73508dac-7478-40a1-b251-3d427bd5665d",
            "answer": {
              "type": "doc",
              "content": [
                {
                  "type": "paragraph",
                  "content": [
                    {
                      "text": "At SaveBetter, cybersecurity is our priority. SaveBetter is a SOC 2 certified platform, meaning it has been validated by outside auditors across five (5) key information security principles. We also use a variety of measures to protect our customers' data, privacy and transactions, including:",
                      "type": "text"
                    }
                  ]
                },
                {
                  "type": "paragraph",
                  "content": [
                    {
                      "text": "•\tUser authentication.",
                      "type": "text",
                      "marks": [{ "type": "bold" }]
                    },
                    {
                      "text": " The SaveBetter platform uses multi-factor authentication combined with leading authentication technology to validate our customers’ identities.",
                      "type": "text"
                    }
                  ]
                },
                {
                  "type": "paragraph",
                  "content": [
                    {
                      "text": "•\tData encryption.",
                      "type": "text",
                      "marks": [{ "type": "bold" }]
                    },
                    {
                      "text": " Your personal information is encrypted in-transit and at rest using advanced cryptographic security algorithms.",
                      "type": "text"
                    }
                  ]
                },
                {
                  "type": "paragraph",
                  "content": [
                    {
                      "text": "•\tSite protection.",
                      "type": "text",
                      "marks": [{ "type": "bold" }]
                    },
                    {
                      "text": " Cloudflare™ advanced internet protection technologies are implemented to protect SaveBetter.com from malicious actors, botnets and denial of service attacks (DDOS).",
                      "type": "text"
                    }
                  ]
                },
                {
                  "type": "paragraph",
                  "content": [
                    {
                      "text": "•\tMonitoring.",
                      "type": "text",
                      "marks": [{ "type": "bold" }]
                    },
                    {
                      "text": " An always-on information security monitoring platform detects and alerts us to information security events.",
                      "type": "text"
                    }
                  ]
                },
                {
                  "type": "paragraph",
                  "content": [
                    {
                      "text": "•\tAssessments.",
                      "type": "text",
                      "marks": [{ "type": "bold" }]
                    },
                    {
                      "text": " Our platform undergoes vigorous security assessments and testing throughout the lifecycle of application development, from architecture planning to production phases.",
                      "type": "text"
                    }
                  ]
                },
                {
                  "type": "paragraph",
                  "content": [
                    {
                      "text": "Cloudflare™ is a registered trademark of Cloudflare, Inc.",
                      "type": "text"
                    }
                  ]
                }
              ]
            },
            "question": "How does SaveBetter protect my data, privacy, and finances?",
            "component": "faqItem",
            "hasPaddingTop": false,
            "hasPaddingBottom": false
          },
          {
            "_uid": "1b3b58d2-6fd1-4cbb-99c7-c6c0f278ef2f",
            "answer": {
              "type": "doc",
              "content": [
                {
                  "type": "paragraph",
                  "content": [
                    {
                      "text": "A. Check out our savings marketplace and choose a product in which you would like to deposit money. ",
                      "type": "text"
                    }
                  ]
                },
                {
                  "type": "paragraph",
                  "content": [
                    {
                      "text": "B. Create your username and password.",
                      "type": "text"
                    }
                  ]
                },
                {
                  "type": "paragraph",
                  "content": [
                    {
                      "text": "C. Complete an application and, after successful identity verification, link a bank account from which to fund your first savings product.",
                      "type": "text"
                    }
                  ]
                },
                {
                  "type": "paragraph",
                  "content": [
                    {
                      "text": "D. Start earning interest as soon as your money is received by the bank or credit union offering the savings product you selected.",
                      "type": "text"
                    }
                  ]
                },
                {
                  "type": "paragraph",
                  "content": [
                    {
                      "text": "Any questions or concerns? Email us at ",
                      "type": "text"
                    },
                    {
                      "text": "service@SaveBetter.com",
                      "type": "text",
                      "marks": [
                        {
                          "type": "link",
                          "attrs": {
                            "href": "service@SaveBetter.com",
                            "uuid": null,
                            "anchor": null,
                            "target": "_blank",
                            "linktype": "email"
                          }
                        }
                      ]
                    },
                    { "text": ".", "type": "text" }
                  ]
                }
              ]
            },
            "question": "How do I open a SaveBetter account?",
            "component": "faqItem",
            "hasPaddingTop": false,
            "hasPaddingBottom": false
          },
          {
            "_uid": "170fd244-3984-4717-a58b-90858bea6474",
            "answer": {
              "type": "doc",
              "content": [
                {
                  "type": "paragraph",
                  "content": [
                    {
                      "text": "All deposits and withdrawals are completed within one to three (1-3) business days. After the initial deposit a withdrawals limitation for the first few business days may exist.",
                      "type": "text"
                    }
                  ]
                },
                {
                  "type": "paragraph",
                  "content": [
                    {
                      "text": "Business days are Monday through Friday excluding U.S. bank holidays.",
                      "type": "text"
                    }
                  ]
                }
              ]
            },
            "question": "How long does it take to deposit my money? What about withdrawals?",
            "component": "faqItem",
            "hasPaddingTop": false,
            "hasPaddingBottom": false
          },
          {
            "_uid": "f1f411a8-eda7-436f-9b5d-5d99ff119845",
            "answer": {
              "type": "doc",
              "content": [
                {
                  "type": "paragraph",
                  "content": [
                    {
                      "text": "For products offered by banks, all necessary registration is handled when you become a SaveBetter customer. One of the many benefits of our platform is that you can open a single account and earn competitive interest rates from banks in the SaveBetter network. When you select and fund a savings product offered by a credit union, there is an additional step of becoming a member. SaveBetter makes that process quick, easy and free. You still have one SaveBetter login and can view all your savings products in one convenient dashboard.",
                      "type": "text"
                    }
                  ]
                }
              ]
            },
            "question": "Will I need to register for accounts at the financial institutions where I've chosen to deposit my money? Am I a customer of those banks or a member of those credit unions?",
            "component": "faqItem",
            "hasPaddingTop": false,
            "hasPaddingBottom": false
          },
          {
            "_uid": "cfdcddd2-341a-4417-9cd5-4a35243f66e5",
            "answer": {
              "type": "doc",
              "content": [
                {
                  "type": "paragraph",
                  "content": [
                    {
                      "text": "The current APY for your savings products can always be viewed on the Account Overview page when you are logged in to SaveBetter. This information also appears on monthly statements.",
                      "type": "text"
                    }
                  ]
                }
              ]
            },
            "question": "Where can I view my savings products’ Annual Percentage Yield (APY)?",
            "component": "faqItem",
            "hasPaddingTop": false,
            "hasPaddingBottom": false
          },
          {
            "_uid": "a31e35da-7170-450e-9778-aa84ca58db8e",
            "answer": {
              "type": "doc",
              "content": [
                {
                  "type": "paragraph",
                  "content": [
                    {
                      "text": "You cannot currently link your SaveBetter account to a third-party app, but we may offer this feature in the future.  For now, you will not be able to link your selected savings product to a third-party app even if the bank or credit union offering that product does so outside of the SaveBetter platform.",
                      "type": "text"
                    }
                  ]
                }
              ]
            },
            "question": "Can I link my SaveBetter account or selected savings product to a third-party app? ",
            "component": "faqItem",
            "hasPaddingTop": false,
            "hasPaddingBottom": false
          }
        ],
        "hasBackground": true,
        "hasPaddingTop": false,
        "hasPaddingBottom": true
      }
    ],
    "logo": [
      {
        "alt": "Continental Bank logo",
        "img": "//a.storyblok.com/f/70134/238x72/787f52c733/continental-bank-logo-w.svg",
        "_uid": "2b855fae-df94-4d86-9b9b-54f49f549d8f",
        "component": "media"
      }
    ],
    "test": "",
    "title": "High-Yield Savings Account",
    "layout": {
      "id": "a7887b35-4fec-4639-a28f-c4afd03fa845",
      "url": "savedo.ch",
      "linktype": "story",
      "fieldtype": "multilink",
      "cached_url": "layouts/explore-product-no-nav-layout"
    },
    "metadata": {
      "_uid": "3724defc-38a4-4567-a304-1085c4999972",
      "title": "Continental Bank: High-yield Savings Accounts | SaveBetter",
      "plugin": "meta-fields",
      "description": "View high-yield savings account details from Continental Bank."
    },
    "component": "page",
    "isTextWhite": true,
    "headerOutline": [
      {
        "_uid": "f3da701e-ceef-42a6-b809-5ac364e040f6",
        "title": "Continental Bank High-Yield Savings Account",
        "bankCode": "",
        "component": "productOfferTable",
        "hasBorder": false,
        "productId": "61a52f5bc952900001743a62",
        "hasBackground": false,
        "hasPaddingTop": false,
        "featuredProducts": [],
        "hasPaddingBottom": false,
        "showSelectedProductTypes": ["SAVINGS_ACCOUNT"],
        "hasFinancialInstitutionsDropdown": false
      }
    ],
    "disableIndexing": true,
    "showBreadcrumbs": false,
    "headerBackground": [
      {
        "alt": "Two men kayaking in a river in Utah",
        "img": "//a.storyblok.com/f/180759/2560x800/08a08355d8/continental.webp",
        "_uid": "4768358c-8f1d-4891-9949-edc1c1f49e0b",
        "component": "media"
      }
    ],
    "introductionLink": [
      {
        "url": "https://app.savebetter.com/auth/register?productId=61a52f5bc952900001743a62",
        "_uid": "c41d4c70-e89b-409a-a318-3aaf7b4dbdcb",
        "text": "Start Saving",
        "target": "_blank",
        "component": "link"
      }
    ],
    "introductionList": [
      {
        "_uid": "94410d24-892d-4f0a-83c6-852448b6eb25",
        "text": "{61a52f5bc952900001743a62-APY} APY high-yield savings account, {61a52f5bc952900001743a62-APY}{FDIC-S} higher than national average.",
        "component": "introductionListItem"
      },
      {
        "_uid": "d9ffee8d-d7be-46b0-aa9b-d9ade6e09da8",
        "text": "FDIC insured. No fees.",
        "component": "introductionListItem"
      },
      {
        "_uid": "21f71a36-ab22-49b9-b3a3-9176c638122d",
        "text": "Community focused Western bank committed to offering great products to help you save. ",
        "component": "introductionListItem"
      }
    ],
    "isLinkSecondaryColor": true,
    "introductionDescription": ""
  },
  "slug": "continental-bank-high-yield-savings-account",
  "full_slug": "bank/continental-bank/continental-bank-high-yield-savings-account",
  "sort_by_date": null,
  "position": 120,
  "tag_list": [],
  "is_startpage": false,
  "parent_id": 290605080,
  "meta_data": null,
  "group_id": "1fb9ed90-e992-4568-9d99-6d8e7de58171",
  "first_published_at": "2020-01-06T15:09:15.000Z",
  "release_id": null,
  "lang": "default",
  "path": null,
  "alternates": [
    {
      "id": 290605010,
      "name": "Continental Bank",
      "slug": "continental-bank",
      "published": true,
      "full_slug": "product-banks/continental-bank",
      "is_folder": false,
      "parent_id": 290604868
    }
  ],
  "default_full_slug": null,
  "translated_slugs": null
}
