{
  "name": "Ponce Bank",
  "created_at": "2023-04-12T09:56:34.247Z",
  "published_at": "2023-02-23T18:46:23.357Z",
  "id": 290605191,
  "uuid": "b46e675b-a550-440c-9cb1-2101c73c5fca",
  "content": {
    "_uid": "1cdd7225-a154-4483-9fd5-13858a152f8b",
    "body": [
      {
        "_uid": "fba42cd5-694e-46a4-8409-f708ffa62de1",
        "link": [],
        "media": [
          {
            "alt": "An illustration of a local deli and grocery store",
            "img": "//a.storyblok.com/f/70134/585x528/458bc272df/about-ponce-bank.svg",
            "_uid": "247a388d-12d6-4447-81fd-c6b612176517",
            "mobile": "",
            "tablet": "",
            "desktop": "",
            "component": "media"
          }
        ],
        "title": "About Ponce Bank",
        "content": [
          {
            "_uid": "126201de-e351-4366-93db-62ff23602e5d",
            "content": {
              "type": "doc",
              "content": [
                {
                  "type": "paragraph",
                  "content": [
                    {
                      "text": "Ponce Bank was born in The Bronx in 1960, a time when most banks had abandoned what was then perceived to be a community in decline but in which our founders saw nothing but the potential of proud neighborhoods anchored by a strong immigrant work ethic and entrepreneurial spirit. They dreamed that all that was needed was a financial fuel. And in the 60 years since, we’ve provided that fuel for this engine of creativity and resilience and we’ve helped develop pockets of this spirit throughout The Bronx, Brooklyn, Queens, Manhattan and New Jersey. We never landed in comfortable places, choosing to help where help was needed most, and during this time we’ve become trusted partners throughout the communities we serve.",
                      "type": "text"
                    }
                  ]
                },
                {
                  "type": "paragraph",
                  "content": [
                    {
                      "text": "Our designation as a Community Development Financial Institution (CDFI) certifies this role as an investor in the future of underserved and underbanked communities.",
                      "type": "text"
                    }
                  ]
                },
                {
                  "type": "paragraph",
                  "content": [
                    {
                      "text": "Ponce Bank. Dreamers Welcome.",
                      "type": "text",
                      "marks": [{ "type": "bold" }]
                    }
                  ]
                }
              ]
            },
            "heading": "",
            "component": "mediaBlockContent"
          }
        ],
        "component": "mediaSection2",
        "hasBorder": false,
        "hasBackground": false,
        "hasPaddingTop": true,
        "hasPaddingBottom": false
      },
      {
        "_uid": "407b9a30-b1ff-496f-b6cf-f3b4bce4bd57",
        "component": "mediaSection5",
        "hasBorder": false,
        "contentBlocks": [
          {
            "_uid": "1c06e42d-3b02-4f92-af36-e2629f779a62",
            "text": "Invests in underserved and underbanked communities",
            "media": [
              {
                "alt": "cdfi certified",
                "img": "//a.storyblok.com/f/180759/x/cdd8c4658a/cdfi-certified-1.svg",
                "_uid": "9faf859c-d782-4e04-b7d4-bd7e5bd7d4b1",
                "component": "mediav2"
              }
            ],
            "title": "Certified CDFI",
            "component": "contentWithMediaBlockv2"
          },
          {
            "_uid": "10dbe904-8191-4b01-a253-d1cc0db2ccc4",
            "text": "Ponce Bank is recognized as a Minority Depository Instutiion (MDI) owing to its Hispanic American ownership. It serves as fixture within the Hispanic community in The Bronx, New York",
            "media": [
              {
                "alt": "community",
                "img": "//a.storyblok.com/f/180759/x/6a8314608b/community.svg",
                "_uid": "298baf99-0257-4d8f-83bb-141c78d71663",
                "component": "mediav2"
              }
            ],
            "title": "Minority Owned",
            "component": "contentWithMediaBlockv2"
          },
          {
            "_uid": "38ad9f8f-8740-4fb0-9e22-d74d8ffa90b8",
            "text": "Ponce Bank offers competitive savings products exclusively through SaveBetter",
            "media": [
              {
                "alt": "money",
                "img": "//a.storyblok.com/f/180759/x/0f0c7b6690/money-outline.svg",
                "_uid": "eb09f203-633a-4fc9-966a-148fdef040f5",
                "component": "mediav2"
              }
            ],
            "title": "Offering Savings and CDs",
            "component": "contentWithMediaBlockv2"
          }
        ],
        "hasBackground": false,
        "hasPaddingTop": false,
        "hasPaddingBottom": false
      },
      {
        "_uid": "ca3b2f04-a4a9-4516-9007-742622f07ce6",
        "href": "/banks/ponce-bank#all_high_yield_savings_products_from_ponce_bank",
        "kind": "primary",
        "size": "medium",
        "text": "Select a product and save",
        "target": "_self",
        "justify": "justify-center",
        "rounded": "rounded",
        "disabled": false,
        "component": "button",
        "hasBackground": false,
        "hasPaddingTop": false,
        "hasPaddingBottom": true
      },
      {
        "_uid": "142dfcbf-0c15-4f09-81ba-7e357d142a0c",
        "cards": [
          {
            "_uid": "ea361795-738b-441b-9afc-7d0d924268a6",
            "link": [
              {
                "url": "https://www.fdic.gov/resources/deposit-insurance/understanding-deposit-insurance/",
                "_uid": "e3aebc33-f210-474c-99f5-041f3366cb1f",
                "text": "Click to learn more about FDIC insurance",
                "target": "_blank",
                "component": "link"
              }
            ],
            "media": [
              {
                "alt": "FDIC logo",
                "img": "//a.storyblok.com/f/70134/720x285/5e201cdf81/us-fdic-logo.svg",
                "_uid": "88421f8a-1d0d-456f-8a53-d7b35ec6379a",
                "mobile": "",
                "tablet": "",
                "desktop": "",
                "component": "media"
              }
            ],
            "title": "FDIC",
            "component": "card",
            "paragraph": "Ponce Bank is a member of the FDIC. Deposits in Ponce Bank are insured by the FDIC up to the limits of federal law. The standard insurance amount is $250,000 per depositor, per insured bank, for each deposit account ownership category."
          },
          {
            "_uid": "1f426831-0f5a-444e-9f1c-c16ca6ee68b7",
            "link": [
              {
                "url": "https://www.savebetter.com/blogs/savebetter-data-protection",
                "_uid": "b97ea0d0-dc62-41cf-8db4-5c7244eeb16f",
                "text": "Click to learn more about SOC 2 certification",
                "target": "_blank",
                "component": "link"
              }
            ],
            "media": [
              {
                "alt": "SOC2 logo",
                "img": "//a.storyblok.com/f/70134/250x250/177e6a0e23/soc-service-certifications.png",
                "_uid": "4e953dd8-4566-4229-9c44-97de7f9a17d3",
                "mobile": "",
                "tablet": "",
                "desktop": "",
                "component": "media"
              }
            ],
            "title": "Cybersecurity is a top priority at SaveBetter",
            "component": "card",
            "paragraph": "We invest in a variety of technologies to protect our customer’s data, privacy and transactions. These include Multi-Factor authentication, encryption, and Cloudflare advanced internet protection and monitoring.  We are a SOC 2 certified organization, which means we have met the requirements outlined by the American Institute of Certified Public Accountants (AICPA) to ensure that we have the controls in place to keep customers' data secure and private. "
          }
        ],
        "title": "Security Is Our Top Priority",
        "component": "cardList1",
        "hasBorder": false,
        "description": "",
        "hasBackground": true,
        "hasPaddingTop": true,
        "hasPaddingBottom": true
      },
      {
        "_uid": "823d59b8-a0f9-4223-8a08-b54adab7be1e",
        "media": [
          {
            "alt": "Family enjoying outdoor time",
            "img": "//a.storyblok.com/f/70134/720x381/966c1d5c5f/family-ourdoor.jpg",
            "_uid": "07655cd4-710c-49b5-9931-ecc60f04ad2e",
            "mobile": "",
            "tablet": "",
            "desktop": "",
            "component": "media"
          }
        ],
        "title": "Ponce Bank, Powered by SaveBetter",
        "button": [],
        "component": "mediaSection4",
        "hasBorder": false,
        "description": "Ponce Bank uses the secure SaveBetter platform to offer savings products to savers nationwide. Customers open accounts at SaveBetter.com, and the platform manages all aspects of the products offered by Ponce Bank, including a customer's deposits and withdrawals, statements and any customer service needs. In simple terms, SaveBetter provides you exclusive access to a special selection of Ponce Bank products. Best of all, SaveBetter is completely free!",
        "hasBackground": false,
        "hasPaddingTop": true,
        "hasPaddingBottom": false
      },
      {
        "_uid": "855b029c-4ba4-4d29-93a3-610c889497ac",
        "items": [
          {
            "_uid": "4947cae2-3360-4031-a5de-ec55c532d765",
            "text": "Security: Funds deposited into any of the products accessible through SaveBetter are held by federally insured institutions. We use a host of cybersecurity measures to protect your funds and sensitive information. ",
            "component": "ListIcon2Item"
          },
          {
            "_uid": "0877bdec-a72b-4f2a-817c-b8ba5587d1ef",
            "text": "Choice: Savings products from our network of financial institutions offer flexible terms and some of the most competitive interest rates. You can easily find the right product or mix of products for you.",
            "component": "ListIcon2Item"
          },
          {
            "_uid": "9d7c96d6-2669-444c-9d99-524abf7d1b4e",
            "text": "Convenience: One account to hold all your deposit products. Simplified statements. Easy access to manage your funds – all through a streamlined digital platform.",
            "component": "ListIcon2Item"
          },
          {
            "_uid": "8baf84c5-111e-4d1e-b1e9-fd20738b01d9",
            "text": "Service: A supportive, accessible, responsive customer service team based in New York, NY, sets SaveBetter apart. ",
            "component": "ListIcon2Item"
          },
          {
            "_uid": "912a033a-f317-4599-b8ec-5fd630f6526b",
            "text": "Access: Enjoy 24/7 online access to your account and funds.   ",
            "component": "ListIcon2Item"
          }
        ],
        "title": "",
        "component": "ListIcon2",
        "hasPaddingTop": false,
        "hasPaddingBottom": false
      },
      {
        "_uid": "e748c0af-3275-4542-966a-5c5766159337",
        "href": "/banks/ponce-bank#all_high_yield_savings_products_from_ponce_bank",
        "kind": "primary",
        "size": "medium",
        "text": "Select a product and save",
        "target": "_self",
        "justify": "justify-center",
        "rounded": "rounded",
        "disabled": false,
        "component": "button",
        "hasBackground": false,
        "hasPaddingTop": false,
        "hasPaddingBottom": true
      },
      {
        "_uid": "4e52a4dc-6fa2-4241-95a8-0734e14806fd",
        "title": "Press",
        "component": "pressRecognition",
        "hasBorder": false,
        "description": "Read what the media is saying about SaveBetter.",
        "hasBackground": true,
        "hasPaddingTop": false,
        "pressReleases": [
          {
            "_uid": "e9832c9c-2248-4b6e-97fe-74cc6f581f0a",
            "link": [
              {
                "url": "https://money.usnews.com/investing/news/articles/2020-09-29/thiel-backed-fintech-deposit-solutions-launches-in-united-states",
                "_uid": "7822b9da-fb01-4047-8b0c-a5e172b5ddef",
                "text": "Read article",
                "target": "_blank",
                "component": "link"
              }
            ],
            "text": "Deposit Solutions is launching its savings portal in the United States ",
            "media": [
              {
                "alt": "U.S. News",
                "img": "//a.storyblok.com/f/70134/0x0/4a8aeb0d62/us-news2.svg",
                "_uid": "c99ee397-a59e-4eb0-bf4c-1b8a59377a64",
                "component": "media"
              }
            ],
            "heading": "U.S News",
            "component": "pressRelease"
          },
          {
            "_uid": "4ade056c-be55-4a01-b227-b03e2569e4c2",
            "link": [
              {
                "url": "https://www.forbes.com/sites/joewalleneurope/2018/11/24/how-can-a-german-open-banking-firm-revolutionize-americas-savings-industry/?sh=7a1c44702e74",
                "_uid": "d88e881a-971e-46e5-b96d-2387cbc7f712",
                "text": "Read article",
                "target": "_blank",
                "component": "link"
              }
            ],
            "text": "Revolutionary Open Banking pioneer Deposit Solutions has announced that it has …",
            "media": [
              {
                "alt": "",
                "img": "//a.storyblok.com/f/70134/0x0/d347124a8d/forbes2.svg",
                "_uid": "e5faefcd-209f-441d-b09d-6157f20b7d0a",
                "component": "media"
              }
            ],
            "heading": "Forbes",
            "component": "pressRelease"
          },
          {
            "_uid": "4f8d817a-16cb-45fe-be1b-d4ca9cc7c8e2",
            "link": [
              {
                "url": "https://www.reuters.com/article/us-deposit-solutions-usa/thiel-backed-fintech-deposit-solutions-launches-in-united-states-idUSKBN26K2HS",
                "_uid": "f8dc8478-05e3-421c-a494-9da11a322268",
                "text": "Read article",
                "target": "_blank",
                "component": "link"
              }
            ],
            "text": "Thiel-backed fintech Deposit Solutions launches in United States",
            "media": [
              {
                "alt": "Reuters",
                "img": "//a.storyblok.com/f/70134/0x0/a983cc3fed/reuters.svg",
                "_uid": "ef758e3b-7e96-47b9-a9a5-715c6235537d",
                "component": "media"
              }
            ],
            "heading": "Reuters",
            "component": "pressRelease"
          },
          {
            "_uid": "65144913-9b77-414c-af33-2d7a296267e3",
            "link": [
              {
                "url": "https://www.gobankingrates.com/retirement/planning/how-to-make-yourself-retirement-millionaire/?utm_campaign=1143100&utm_source=yahoo.com&utm_content=15&utm_medium=rss",
                "_uid": "242f45c5-1243-4b4e-ad64-cecfdad5ebdf",
                "text": "Read article",
                "target": "_blank",
                "component": "link"
              }
            ],
            "text": "SaveBetter’s Ben McLaughlin on building up your nest egg",
            "media": [
              {
                "alt": "GOBankingRates",
                "img": "//a.storyblok.com/f/70134/284x36/2622a1aab6/gobankingrates.svg",
                "_uid": "695d7d63-238e-4ccd-9505-43690558d469",
                "mobile": "",
                "tablet": "",
                "desktop": "",
                "component": "media"
              }
            ],
            "title": "Title",
            "heading": "GOBankingRates",
            "component": "pressRelease",
            "rich_text": {
              "_uid": "102bde82-e999-46b4-a8af-1bb50a780039",
              "type": "doc",
              "content": [
                {
                  "_uid": "cda99c42-f37c-44f4-a825-d38f2f01d78c",
                  "type": "paragraph",
                  "content": [
                    {
                      "_uid": "8c360f8d-9ac5-4892-94f5-069c3ad37ff0",
                      "text": "Finance Yahoo",
                      "type": "text",
                      "marks": [
                        {
                          "_uid": "9822f12c-1160-4d12-bb82-f90845b86727",
                          "type": "bold"
                        }
                      ]
                    }
                  ]
                },
                {
                  "_uid": "7463b4c5-d05e-4b37-b62c-d719a4cbc8fd",
                  "type": "paragraph",
                  "content": [
                    {
                      "_uid": "9241197b-e7e4-4e33-ae1c-4f62143a6dfa",
                      "text": "Thiel-backed fintech Deposit Solutions launches in United States",
                      "type": "text"
                    }
                  ]
                }
              ]
            }
          },
          {
            "_uid": "7f367bb9-7689-4b52-acc9-92150eea7c62",
            "link": [
              {
                "url": "https://www.businessinsider.com/deposit-solutions-will-launch-savings-marketplace-in-us-2020-9",
                "_uid": "6f78e478-6035-4279-8d33-9d179deea41f",
                "text": "Read article",
                "target": "_blank",
                "component": "link"
              }
            ],
            "text": "Deposit Solutions is launching in the US to bring choice and convenience …",
            "media": [
              {
                "alt": "Business Insider",
                "img": "//a.storyblok.com/f/70134/0x0/6e5b606dac/business-insider.svg",
                "_uid": "33ce003d-6ec5-4f6a-8c5d-12a26805942d",
                "component": "media"
              }
            ],
            "title": "Title",
            "heading": "Business Insider",
            "component": "pressRelease",
            "rich_text": {
              "_uid": "351ed6f9-5b5b-4570-83ed-d4790ed8968e",
              "type": "doc",
              "content": [
                {
                  "_uid": "bf1ae783-e30c-4284-87b2-f3bd6457b3cb",
                  "type": "paragraph",
                  "content": [
                    {
                      "_uid": "4e083b24-03ce-434b-a020-18b6f57f7c32",
                      "text": "Finance Yahoo",
                      "type": "text",
                      "marks": [
                        {
                          "_uid": "6c0fe29c-0ceb-4cb6-8d52-69ea53c4ebe1",
                          "type": "bold"
                        }
                      ]
                    }
                  ]
                },
                {
                  "_uid": "508c57f4-72e2-48ef-9d6c-aa1cfc351422",
                  "type": "paragraph",
                  "content": [
                    {
                      "_uid": "bbaad0ab-b265-4096-80f1-6b406e900146",
                      "text": "Thiel-backed fintech Deposit Solutions launches in United States",
                      "type": "text"
                    }
                  ]
                }
              ]
            }
          },
          {
            "_uid": "cfbdf927-32a7-407f-a857-67de3221bca6",
            "link": [
              {
                "url": "https://www.foxbusiness.com/money/how-much-savings-age-40",
                "_uid": "7f54cf93-a9d4-4569-9e76-2b6ae4833532",
                "text": "Read article",
                "target": "_blank",
                "component": "link"
              }
            ],
            "text": "SaveBetter President Ben McLaughlin talks about savings",
            "media": [
              {
                "alt": "Fox Business",
                "img": "//a.storyblok.com/f/70134/0x0/ae5695e64d/fox-business-2.svg",
                "_uid": "2283ffaa-572b-4ed6-88a1-e4374a012a96",
                "component": "media"
              }
            ],
            "heading": "Fox Business",
            "component": "pressRelease"
          },
          {
            "_uid": "30b24dfa-6984-4df9-acca-5bcd4fd38d6f",
            "link": [
              {
                "url": "https://finance.yahoo.com/news/thiel-backed-fintech-deposit-solutions-141039509.html?guccounter=1",
                "_uid": "4caaeb8a-f4aa-4610-b12a-5bcc319cf3d7",
                "text": "Read article",
                "target": "_blank",
                "component": "link"
              }
            ],
            "text": "Thiel-backed fintech Deposit Solutions launches in United States",
            "media": [
              {
                "alt": "Yahoo Finance",
                "img": "//a.storyblok.com/f/70134/0x0/3b4667baf0/yahoofinance2.svg",
                "_uid": "36153715-e0ef-4729-8d53-2d5473e261b7",
                "component": "media"
              }
            ],
            "title": "Title",
            "heading": "Yahoo Finance",
            "component": "pressRelease",
            "rich_text": {
              "_uid": "ab5a173c-7b3e-4b3b-a344-62660c5c2457",
              "type": "doc",
              "content": [
                {
                  "_uid": "276bdaa7-81a8-4d63-8813-ca1366ca0d79",
                  "type": "paragraph",
                  "content": [
                    {
                      "_uid": "2af0e7e0-04a6-42c1-8a4f-4602109f1005",
                      "text": "Finance Yahoo",
                      "type": "text",
                      "marks": [
                        {
                          "_uid": "d2db8a09-1f75-4d7b-94ce-117f8687169e",
                          "type": "bold"
                        }
                      ]
                    }
                  ]
                },
                {
                  "_uid": "2cfb19a4-01ac-4de9-8d0b-c492b4c49967",
                  "type": "paragraph",
                  "content": [
                    {
                      "_uid": "625e4239-1cbb-44a6-9ed7-0f2424992c30",
                      "text": "Thiel-backed fintech Deposit Solutions launches in United States",
                      "type": "text"
                    }
                  ]
                }
              ]
            }
          }
        ],
        "hasPaddingBottom": false
      },
      {
        "_uid": "b0d2cbd6-d546-489a-b0b1-f2043c57b4ac",
        "kind": "2",
        "text": "Open an Account in 3-5 Minutes",
        "block": "",
        "color": "text-black",
        "level": "1",
        "component": "heading",
        "hasPaddingTop": true,
        "hasPaddingBottom": false
      },
      {
        "_uid": "858f72f7-f16f-46a8-bcfa-fbbd36f0637f",
        "component": "mediaSection5",
        "hasBorder": false,
        "contentBlocks": [
          {
            "_uid": "6ebfed8f-0f71-44c9-973a-6c799a7a8364",
            "text": "the right product for your savings goals.",
            "media": [
              {
                "alt": "Select a product",
                "img": "//a.storyblok.com/f/180759/x/cfc185abac/step-1.svg",
                "_uid": "f0e59d73-69d4-4c4e-8a2e-c1765839aab6",
                "component": "mediav2"
              }
            ],
            "title": "Select",
            "component": "contentWithMediaBlockv2"
          },
          {
            "_uid": "727d6d1e-9d26-4ecb-9800-1afbc387ba9b",
            "text": "with an email address and password, then verify your identity and bank information.",
            "media": [
              {
                "alt": "Register for a SaveBetter account",
                "img": "//a.storyblok.com/f/180759/x/c31edded4a/step-3-2.svg",
                "_uid": "128c4a1b-753c-4daf-bc6a-28b4a15cce41",
                "component": "mediav2"
              }
            ],
            "title": "Register",
            "component": "contentWithMediaBlockv2"
          },
          {
            "_uid": "1c4dcf97-4d40-4eed-80e5-c78e7578973d",
            "text": "the savings products you add to your new SaveBetter account.",
            "media": [
              {
                "alt": "Add funds",
                "img": "//a.storyblok.com/f/180759/x/f474b8dadf/step-4-3.svg",
                "_uid": "b6f3ebfe-0d75-47ff-af84-272d0336dd7e",
                "component": "mediav2"
              }
            ],
            "title": "Fund",
            "component": "contentWithMediaBlockv2"
          }
        ],
        "hasBackground": false,
        "hasPaddingTop": false,
        "hasPaddingBottom": false
      },
      {
        "_uid": "67799201-9c89-4885-b2ab-8f36a39c0e4d",
        "href": "/banks/ponce-bank#all_high_yield_savings_products_from_ponce_bank",
        "kind": "primary",
        "size": "medium",
        "text": "Select a product and save",
        "target": "_self",
        "justify": "justify-center",
        "rounded": "rounded",
        "disabled": false,
        "component": "button",
        "hasBackground": false,
        "hasPaddingTop": false,
        "hasPaddingBottom": true
      },
      {
        "_uid": "29310c84-cf80-4a49-970b-6ff85dd59162",
        "link": [
          {
            "url": "/faq",
            "_uid": "84135198-10f3-4d1b-bd35-117d9896cd85",
            "text": "Read more FAQs",
            "target": "_self",
            "component": "link"
          }
        ],
        "title": "FAQs",
        "component": "faq",
        "hasBorder": false,
        "questions": [
          {
            "_uid": "c4d0b21c-9346-477a-a932-3eaa1498bc29",
            "answer": {
              "type": "doc",
              "content": [
                {
                  "type": "paragraph",
                  "content": [
                    {
                      "text": "SaveBetter is a digital platform that gives savers unparalleled access to a variety of deposit products through the convenience of a single account, helping you unlock the growth potential of your cash savings. ",
                      "type": "text"
                    }
                  ]
                },
                {
                  "type": "paragraph",
                  "content": [
                    {
                      "text": "SaveBetter customers use the platform to fund Federal Deposit Insurance Corp. (FDIC) insured deposit products offered by numerous U.S. banks with a wide range of maturities and interest rates, allowing you to build a savings strategy to suit your earning and liquidity needs.",
                      "type": "text"
                    }
                  ]
                },
                {
                  "type": "paragraph",
                  "content": [
                    {
                      "text": "SaveBetter is not a bank. It’s a New York-based financial technology company (“Fintech” for short) that provides the digital “storefront” where banks can promote their deposit products.",
                      "type": "text"
                    }
                  ]
                },
                {
                  "type": "paragraph",
                  "content": [
                    {
                      "text": "SaveBetter.com is operated by SaveBetter LLC, a 100% subsidiary of Deposit Solutions LLC (Deposit Solutions). Headquartered in New York, Deposit Solutions provides a proprietary open architecture platform for deposits products. Deposit Solutions helps banks improve their deposit funding by offering national reach for their retail deposit products, and provides savers with better access, more choice and higher convenience when evaluating savings products from FDIC insured banks.",
                      "type": "text"
                    }
                  ]
                },
                {
                  "type": "paragraph",
                  "content": [
                    {
                      "text": "Deposit Solutions LLC is a 100% subsidiary of Raisin GmbH, a trailblazer for open banking in the deposits and investments space.",
                      "type": "text"
                    }
                  ]
                }
              ]
            },
            "question": "What is SaveBetter?",
            "component": "faqItem",
            "hasPaddingTop": false,
            "hasPaddingBottom": false
          },
          {
            "_uid": "74e7fba6-8152-4cfc-acbb-770db891fadb",
            "answer": {
              "type": "doc",
              "content": [
                {
                  "type": "paragraph",
                  "content": [
                    {
                      "text": "Your SaveBetter account gives you access to savings accounts and Certificates of Deposit (CDs) offered by a variety of banks with the security of FDIC insurance. These products include:",
                      "type": "text"
                    }
                  ]
                },
                { "type": "paragraph" },
                {
                  "type": "bullet_list",
                  "content": [
                    {
                      "type": "list_item",
                      "content": [
                        {
                          "type": "paragraph",
                          "content": [
                            {
                              "text": "High-yield Savings Account (HYSA).",
                              "type": "text",
                              "marks": [{ "type": "bold" }]
                            },
                            {
                              "text": " As its name indicates, this account type functions like a traditional savings account—with typically no restrictions on depositing and withdrawing funds—but earns interest at rates that are higher than the national average for standard savings accounts. ",
                              "type": "text"
                            }
                          ]
                        },
                        { "type": "paragraph" }
                      ]
                    },
                    {
                      "type": "list_item",
                      "content": [
                        {
                          "type": "paragraph",
                          "content": [
                            {
                              "text": "Money Market Deposit Account (MMDA).",
                              "type": "text",
                              "marks": [{ "type": "bold" }]
                            },
                            {
                              "text": " Also known as a money market account or MMA, this type of savings account offers a varying rate that allows you to earn interest on your funds with maximum flexibility for withdrawals. Like a HYSA, an MMDA offers features of a traditional savings account with typically higher returns. ",
                              "type": "text"
                            }
                          ]
                        },
                        { "type": "paragraph" }
                      ]
                    },
                    {
                      "type": "list_item",
                      "content": [
                        {
                          "type": "paragraph",
                          "content": [
                            {
                              "text": "No Penalty CD.",
                              "type": "text",
                              "marks": [{ "type": "bold" }]
                            },
                            {
                              "text": " Through the flexibility of a No Penalty CD, you can lock in a competitive rate for a fixed term with the option to make a full withdrawal at any time beginning seven (7) calendar days after funding without having to pay a penalty for the early termination.",
                              "type": "text"
                            }
                          ]
                        },
                        { "type": "paragraph" }
                      ]
                    },
                    {
                      "type": "list_item",
                      "content": [
                        {
                          "type": "paragraph",
                          "content": [
                            {
                              "text": "Fixed Term CD.",
                              "type": "text",
                              "marks": [{ "type": "bold" }]
                            },
                            {
                              "text": " With this longstanding savings vehicle, funds are held for a fixed term, and a competitive interest rate provides safe, predictable earnings. In contrast to No Penalty CDs, typically you are charged a fee if you do not complete the full term of the Fixed Term CD.",
                              "type": "text"
                            }
                          ]
                        }
                      ]
                    }
                  ]
                }
              ]
            },
            "question": "What types of products are available through SaveBetter?",
            "component": "faqItem",
            "hasPaddingTop": false,
            "hasPaddingBottom": false
          },
          {
            "_uid": "e44f32c9-99a9-4d7f-a095-03ba8d2a0ae4",
            "answer": {
              "type": "doc",
              "content": [
                {
                  "type": "paragraph",
                  "content": [
                    {
                      "text": "Interest is compounded daily and posted to your account monthly.",
                      "type": "text"
                    }
                  ]
                }
              ]
            },
            "question": "How often is interest compounded?",
            "component": "faqItem",
            "hasPaddingTop": false,
            "hasPaddingBottom": false
          },
          {
            "_uid": "7871ff11-5b1e-4110-9703-2d9a27442670",
            "answer": {
              "type": "doc",
              "content": [
                {
                  "type": "paragraph",
                  "content": [
                    {
                      "text": "Yes! A depositor’s savings are insured by the FDIC up to the maximum amount in accordance with and as permitted by law at each bank holding their funds. ",
                      "type": "text"
                    }
                  ]
                },
                {
                  "type": "paragraph",
                  "content": [
                    {
                      "text": "The standard deposit insurance coverage limit is $250,000 per depositor, per FDIC-insured bank, per account ownership category. Ownership categories as defined by the FDIC include single bank accounts (owned by one person/depositor) and joint bank accounts (owned by two or more persons/depositors). Revocable trust accounts and some types of retirement accounts (e.g., IRAs) are among the other ownership categories covered by FDIC insurance. ",
                      "type": "text"
                    }
                  ]
                },
                {
                  "type": "paragraph",
                  "content": [
                    {
                      "text": "Deposits held in different ownership categories are separately insured, even if held at the same bank. ",
                      "type": "text"
                    }
                  ]
                },
                {
                  "type": "paragraph",
                  "content": [
                    {
                      "text": "All deposits you have at a bank — whether facilitated through SaveBetter or otherwise — count toward the deposit insurance limit. If funds held at a bank in a certain ownership category exceed the coverage limit, then the amount in excess of the limit will not be insured.",
                      "type": "text"
                    }
                  ]
                }
              ]
            },
            "question": "Does my SaveBetter account have FDIC insurance?",
            "component": "faqItem",
            "hasPaddingTop": false,
            "hasPaddingBottom": false
          },
          {
            "_uid": "a728e41d-64a3-4fef-a95d-12c9f2e7a674",
            "answer": {
              "type": "doc",
              "content": [
                {
                  "type": "paragraph",
                  "content": [
                    {
                      "text": "At SaveBetter, cybersecurity is our priority. SaveBetter is a SOC 2 certified platform, meaning it has been validated by outside auditors across five (5) key information security principles. We also use a variety of measures to protect our customers' data, privacy and transactions, including:",
                      "type": "text"
                    }
                  ]
                },
                {
                  "type": "paragraph",
                  "content": [
                    {
                      "text": "•\tUser authentication.",
                      "type": "text",
                      "marks": [{ "type": "bold" }]
                    },
                    {
                      "text": " The SaveBetter platform uses multi-factor authentication combined with leading authentication technology to validate our customers’ identities.",
                      "type": "text"
                    }
                  ]
                },
                {
                  "type": "paragraph",
                  "content": [
                    {
                      "text": "•\tData encryption.",
                      "type": "text",
                      "marks": [{ "type": "bold" }]
                    },
                    {
                      "text": " Your personal information is encrypted in-transit and at rest using advanced cryptographic security algorithms.",
                      "type": "text"
                    }
                  ]
                },
                {
                  "type": "paragraph",
                  "content": [
                    {
                      "text": "•\tSite protection.",
                      "type": "text",
                      "marks": [{ "type": "bold" }]
                    },
                    {
                      "text": " Cloudflare™ advanced internet protection technologies are implemented to protect SaveBetter.com from malicious actors, botnets and denial of service attacks (DDOS).",
                      "type": "text"
                    }
                  ]
                },
                {
                  "type": "paragraph",
                  "content": [
                    {
                      "text": "•\tMonitoring.",
                      "type": "text",
                      "marks": [{ "type": "bold" }]
                    },
                    {
                      "text": " An always-on information security monitoring platform detects and alerts us to information security events.",
                      "type": "text"
                    }
                  ]
                },
                {
                  "type": "paragraph",
                  "content": [
                    {
                      "text": "•\tAssessments.",
                      "type": "text",
                      "marks": [{ "type": "bold" }]
                    },
                    {
                      "text": " Our platform undergoes vigorous security assessments and testing throughout the lifecycle of application development, from architecture planning to production phases.",
                      "type": "text"
                    }
                  ]
                },
                {
                  "type": "paragraph",
                  "content": [
                    {
                      "text": "Cloudflare™ is a registered trademark of Cloudflare, Inc.",
                      "type": "text"
                    }
                  ]
                }
              ]
            },
            "question": "How does SaveBetter protect my data, privacy, and finances?",
            "component": "faqItem",
            "hasPaddingTop": false,
            "hasPaddingBottom": false
          },
          {
            "_uid": "49536c6b-cac9-4f68-8476-ed8306389e6a",
            "answer": {
              "type": "doc",
              "content": [
                {
                  "type": "paragraph",
                  "content": [
                    {
                      "text": "A.\tCheck out our savings marketplace and choose a product in which you would like to deposit money.",
                      "type": "text"
                    }
                  ]
                },
                {
                  "type": "paragraph",
                  "content": [
                    {
                      "text": "B.\tCreate your username and password.",
                      "type": "text"
                    }
                  ]
                },
                {
                  "type": "paragraph",
                  "content": [
                    {
                      "text": "C.\tComplete an application and, after successful identity verification, link a bank account from which to fund your first savings product.",
                      "type": "text"
                    }
                  ]
                },
                {
                  "type": "paragraph",
                  "content": [
                    {
                      "text": "D.\tStart earning interest as soon as your money is received by the bank.",
                      "type": "text"
                    }
                  ]
                },
                {
                  "type": "paragraph",
                  "content": [
                    {
                      "text": "Any questions or concerns? Email us at ",
                      "type": "text"
                    },
                    {
                      "text": "service@SaveBetter.com",
                      "type": "text",
                      "marks": [
                        {
                          "type": "link",
                          "attrs": {
                            "href": "service@SaveBetter.com",
                            "uuid": null,
                            "anchor": null,
                            "target": "_blank",
                            "linktype": "email"
                          }
                        }
                      ]
                    },
                    { "text": ".", "type": "text" }
                  ]
                }
              ]
            },
            "question": "How do I open a SaveBetter account?",
            "component": "faqItem",
            "hasPaddingTop": false,
            "hasPaddingBottom": false
          },
          {
            "_uid": "1c644ec8-44d5-4375-9a3a-5c11697763af",
            "answer": {
              "type": "doc",
              "content": [
                {
                  "type": "paragraph",
                  "content": [
                    {
                      "text": "All deposits and withdrawals are completed within one to three (1-3) business days. After the initial deposit a withdrawals limitation for the first few business days may exist.",
                      "type": "text"
                    }
                  ]
                },
                {
                  "type": "paragraph",
                  "content": [
                    {
                      "text": "Business days are Monday through Friday excluding U.S. bank holidays.",
                      "type": "text"
                    }
                  ]
                }
              ]
            },
            "question": "How long does it take to deposit my money? What about withdrawals?",
            "component": "faqItem",
            "hasPaddingTop": false,
            "hasPaddingBottom": false
          },
          {
            "_uid": "55ef904c-318a-419a-95c2-d4af313eee21",
            "answer": {
              "type": "doc",
              "content": [
                {
                  "type": "paragraph",
                  "content": [
                    {
                      "text": "No. All necessary registration is handled when you become a SaveBetter customer. One of the many benefits of our platform is that you can open a single account and earn competitive interest rates from banks in the SaveBetter network.",
                      "type": "text"
                    }
                  ]
                }
              ]
            },
            "question": "Will I need to register for accounts at the banks where I’ve chosen to deposit my money? Am I a customer of those banks?",
            "component": "faqItem",
            "hasPaddingTop": false,
            "hasPaddingBottom": false
          },
          {
            "_uid": "f6799a76-63a3-4cf2-8d4c-3b3b98d9fbe3",
            "answer": {
              "type": "doc",
              "content": [
                {
                  "type": "paragraph",
                  "content": [
                    {
                      "text": "The current APY for your savings products can always be viewed on the Account Overview page when you are logged in to SaveBetter. This information also appears on monthly statements.",
                      "type": "text"
                    }
                  ]
                }
              ]
            },
            "question": "Where can I view my savings products’ Annual Percentage Yield (APY)?",
            "component": "faqItem",
            "hasPaddingTop": false,
            "hasPaddingBottom": false
          },
          {
            "_uid": "a3f806bb-6b52-4141-85b9-518ad0600454",
            "answer": {
              "type": "doc",
              "content": [
                {
                  "type": "paragraph",
                  "content": [
                    {
                      "text": "You cannot currently link your SaveBetter account to a third-party app, but we may offer this feature in the future.  For now, you will not be able to link your selected savings product to a third-party app even if the bank offering that product does so outside of the SaveBetter platform.",
                      "type": "text"
                    }
                  ]
                }
              ]
            },
            "question": "Can I link my SaveBetter account or selected savings product to a third-party app? ",
            "component": "faqItem",
            "hasPaddingTop": false,
            "hasPaddingBottom": false
          }
        ],
        "hasBackground": true,
        "hasPaddingTop": true,
        "hasPaddingBottom": true
      }
    ],
    "logo": [
      {
        "alt": "Ponce Bank logo",
        "img": "//a.storyblok.com/f/70134/236x72/e51beb46b1/ponce-bank-logo-w.svg",
        "_uid": "adeec091-1be1-4df2-961c-5ec11d5b38b7",
        "mobile": "",
        "tablet": "",
        "desktop": "",
        "component": "media"
      }
    ],
    "test": "",
    "title": "Explore Savings Products",
    "layout": {
      "id": "a7887b35-4fec-4639-a28f-c4afd03fa845",
      "url": "savedo.ch",
      "linktype": "story",
      "fieldtype": "multilink",
      "cached_url": "layouts/explore-product-no-nav-layout"
    },
    "metadata": {
      "_uid": "3724defc-38a4-4567-a304-1085c4999972",
      "title": "Explore Savings Products from Ponce Bank with Rates as High as 1.61% | SaveBetter",
      "plugin": "meta-fields",
      "description": "Access competitive savings products from Ponce Bank exclusively through SaveBetter. Ponce Bank is all about maximizing customers' financial success. "
    },
    "component": "page",
    "isTextWhite": true,
    "headerOutline": [
      {
        "_uid": "3c035f89-772a-40b4-8038-fed1b0eb70c1",
        "title": "All High-Yield Savings Products from Ponce Bank",
        "bankCode": "6189498061e8a80001e05184",
        "component": "productOfferTable",
        "hasBorder": false,
        "productId": "",
        "hasBackground": false,
        "hasPaddingTop": false,
        "featuredProducts": [],
        "hasPaddingBottom": false,
        "showSelectedProductTypes": [],
        "hasFinancialInstitutionsDropdown": false
      }
    ],
    "disableIndexing": false,
    "showBreadcrumbs": false,
    "headerBackground": [
      {
        "alt": "Mother and daughter hugging and laughing",
        "img": "//a.storyblok.com/f/180759/2560x800/41ca9e2b37/ponce-1.webp",
        "_uid": "4768358c-8f1d-4891-9949-edc1c1f49e0b",
        "mobile": "",
        "tablet": "",
        "desktop": "",
        "component": "media"
      }
    ],
    "introductionLink": [
      {
        "url": "https://app.savebetter.com/auth/register?productId=61a52e9fc952900001743a5e",
        "_uid": "9aa6bee1-e0ed-4566-8152-ce69814878d6",
        "text": "Save now",
        "target": "_self",
        "component": "link"
      }
    ],
    "introductionList": [
      {
        "_uid": "10663a5b-feb2-4fc7-8b7b-8670f879b224",
        "text": "Trending offer: {61a52e9fc952900001743a5e-APY} APY high-yield MMDA, {623a35b5a9f1c5000165584d-APY}{FDIC-MM} higher than national average.",
        "component": "introductionListItem"
      },
      {
        "_uid": "0d55b9cb-e7df-447d-8880-2d8ce2cb0cf7",
        "text": "FDIC insured. No fees. $1 minimum deposit.",
        "component": "introductionListItem"
      },
      {
        "_uid": "df5450fc-333c-47ef-88b8-aaec2ad75a98",
        "text": "24/7 online access to funds.",
        "component": "introductionListItem"
      }
    ],
    "isLinkSecondaryColor": true,
    "productCardsCustomiser": [],
    "introductionDescription": ""
  },
  "slug": "ponce-bank",
  "full_slug": "banks/ponce-bank/",
  "sort_by_date": null,
  "position": 20,
  "tag_list": [],
  "is_startpage": true,
  "parent_id": 290605161,
  "meta_data": null,
  "group_id": "6f7d0d43-b143-440e-a563-803ee74cf8e1",
  "first_published_at": "2020-01-06T15:09:15.000Z",
  "release_id": null,
  "lang": "default",
  "path": null,
  "alternates": [],
  "default_full_slug": null,
  "translated_slugs": null
}
