{
  "name": "Landing layout Ponce Bank bonus enrolled 2021 04",
  "created_at": "2023-04-12T09:56:25.375Z",
  "published_at": "2021-03-29T19:54:55.285Z",
  "id": 290604931,
  "uuid": "7c880a4e-5d18-40e3-9539-49247dd41432",
  "content": {
    "_uid": "c1a65a64-b116-4df9-a246-0d162141e5aa",
    "footer": [
      {
        "_uid": "b042124c-7c49-4dbc-8e97-b8ec5d9f53eb",
        "text": {
          "type": "doc",
          "content": [
            {
              "type": "paragraph",
              "content": [
                {
                  "text": "* Bonus offer Terms and Conditions:",
                  "type": "text"
                }
              ]
            },
            {
              "type": "paragraph",
              "content": [
                {
                  "text": "New customers are eligible to receive a discretionary $25USD bonus cash for the first $5000.00USD deposited in a deposit product through SaveBetter.com, and $5USD for each additional $5000.00USD deposited in the same product.  Each customer is eligible to receive a maximum of $125USD of bonus cash.  Customer must maintain the minimum daily deposit amount for each level of bonus for a period of at least 90 days (e.g., a minimum balance of $5000USD daily to be eligible for a $25USD bonus cash; or a minimum deposit of $10,000USD daily to be eligible for a $30USD bonus).  Bonus cash to be deposited by SaveBetter LLC into customer’s Customer Account within 30 days after customer qualifies for the offer.  Offer ends 04/30/21.  US customers only.  Not open to SaveBetter or Deposit Solutions employees.  SaveBetter reserves the right to terminate this offer at any time and to deny Customer bonus cash for any reason.",
                  "type": "text"
                }
              ]
            },
            {
              "type": "paragraph",
              "content": [
                {
                  "text": "The SaveBetter name and logo are trademarks of SaveBetter LLC.  The Deposit Solutions name and logo are trademarks of Deposit Solutions GmbH, used with permission.  Ponce Bank and the Ponce De Leon image are trademarks of Ponce De Leon Federal Bank, used with permission.",
                  "type": "text"
                }
              ]
            },
            {
              "type": "paragraph",
              "content": [
                {
                  "text": "© 2021 SaveBetter LLC.  All rights reserved.",
                  "type": "text"
                }
              ]
            },
            {
              "type": "paragraph",
              "content": [
                {
                  "text": "APY means Annual Percentage Yield. APY is accurate as of March 29, 2021.  Interest rate may change after initial deposit.  Minimum opening deposit is $1.00.",
                  "type": "text"
                }
              ]
            },
            {
              "type": "paragraph",
              "content": [
                {
                  "text": "Banking services provided by Central Bank of Kansas City. Each customer authorizes the Service Bank to hold the customer’s funds in a custodial capacity in order to facilitate the customer’s deposits to and withdrawals from any product at Ponce Bank that the customer requests through SaveBetter.com.  The Service Bank does not establish the terms of the  deposit accounts or offer the deposit accounts to customers,and provides no advice to customers about deposit accounts at Ponce Bank.  Central Bank of Kansas City, Member FDIC, d.b.a. Central Payments is the Service Bank.",
                  "type": "text"
                }
              ]
            }
          ]
        },
        "links": [
          {
            "url": "https://dsusprd01pubassets.blob.core.windows.net/ds-us/privacy_policy.pdf",
            "_uid": "c75ef125-a0e1-49d3-9b4e-3aae8eff5461",
            "text": "Privacy policy",
            "target": "_blank",
            "component": "link"
          },
          {
            "url": "https://dsusprd01pubassets.blob.core.windows.net/ds-us/cookie_policy.pdf",
            "_uid": "cc5c3ac9-df2c-49fe-8620-266c1d063a47",
            "text": "Cookie policy",
            "target": "_blank",
            "component": "link"
          },
          {
            "url": "https://dsusprd01pubassets.blob.core.windows.net/ds-us/terms_and_conditions.pdf",
            "_uid": "5f3583c7-61e3-4a00-82a6-562fe0694e5c",
            "text": "Terms and conditions",
            "target": "_blank",
            "component": "link"
          }
        ],
        "component": "footerv2",
        "socialBox": [],
        "contactBar": [
          {
            "_uid": "6bb37f2e-6f0f-4434-a920-95ff1b7eabcd",
            "email": "service@savebetter.com",
            "component": "contactBar",
            "phoneNumber": "844-994-EARN (3276)",
            "workingHours": "Monday to Friday from 9:00 a.m - 4:00 p.m"
          }
        ]
      }
    ],
    "header": [
      {
        "_uid": "8f46daf8-e62b-4244-9dc0-e6d453be316d",
        "media": [
          {
            "alt": "SaveBetter",
            "img": "//a.storyblok.com/f/70134/532x63/51977ed684/savebetter_logo_tm-min.png",
            "_uid": "bb53d875-336e-4e87-833d-fb6b067c0bc2",
            "component": "media"
          }
        ],
        "component": "headerImage"
      }
    ],
    "component": "global",
    "hasNavigation": false
  },
  "slug": "landing-layout-ponce-bank-bonus-enrolled-2021-04",
  "full_slug": "layouts/landing-layout-ponce-bank-bonus-enrolled-2021-04",
  "sort_by_date": null,
  "position": 20,
  "tag_list": [],
  "is_startpage": false,
  "parent_id": 290604865,
  "meta_data": null,
  "group_id": "5472cb51-5ce6-4551-a5a0-59b05d3c9370",
  "first_published_at": "2020-01-03T10:54:58.357Z",
  "release_id": null,
  "lang": "default",
  "path": null,
  "alternates": [],
  "default_full_slug": null,
  "translated_slugs": null
}
