{
  "name": "Money Market Accounts",
  "created_at": "2023-04-12T09:56:32.861Z",
  "published_at": "2023-04-01T01:53:43.531Z",
  "id": 290605147,
  "uuid": "01119e90-2b7b-4734-864d-472d46fbb894",
  "content": {
    "_uid": "1cdd7225-a154-4483-9fd5-13858a152f8b",
    "body": [
      {
        "_uid": "cfd41829-2ba7-4f5b-8adf-5f8cbc7d7639",
        "link": [
          {
            "url": "/products/money-market-accounts#compare_money_market_accounts_on_savebetter",
            "_uid": "7e713c0b-7245-4555-8102-9a2bf89a51f0",
            "text": "Select a product and save",
            "target": "_self",
            "component": "link"
          }
        ],
        "media": [
          {
            "alt": "Flat lay with a calculator, a pen, and cash",
            "img": "//a.storyblok.com/f/70134/585x364/8353df9f35/savings-benefits2.jpg",
            "_uid": "deed0334-33de-4778-8403-a21acef0b360",
            "mobile": "",
            "tablet": "",
            "desktop": "",
            "component": "media"
          }
        ],
        "title": "Benefits of a Money Market Account",
        "content": [
          {
            "_uid": "4acdda93-eab6-40fd-9ebb-28ddc4506f44",
            "content": {
              "type": "doc",
              "content": [
                {
                  "type": "paragraph",
                  "content": [
                    {
                      "text": "A money market account, also known as a money market deposit account or MMDA",
                      "type": "text",
                      "marks": [{ "type": "bold" }]
                    },
                    {
                      "text": ", is a type of interest-earning savings account offered by some banks, credit unions, and online financial institutions. Money market accounts provide many of the conveniences of a typical savings account but with a major added benefit — they often offer higher rates than traditional savings account or even high-yield savings accounts. Some financial instiutions set limits on how frequently you can withdraw funds from their money market accounts. However, money market accounts opened through SaveBetter do not currently have any withdrawal limits. So a money market account allows you to earn more interest on your savings while still having easy access to your funds when needed.",
                      "type": "text"
                    }
                  ]
                }
              ]
            },
            "heading": "",
            "component": "mediaBlockContent"
          }
        ],
        "component": "mediaSection2",
        "hasBorder": false,
        "hasBackground": false,
        "hasPaddingTop": true,
        "hasPaddingBottom": true
      },
      {
        "_uid": "3c4d50bf-6fed-42aa-8ec3-a3a342c0a294",
        "link": [
          {
            "url": "https://www.savebetter.com/blogs/what-is-a-money-market-account",
            "_uid": "b1f9f645-bb5c-43c8-b1f0-33787d547e7b",
            "text": "Learn More",
            "target": "_blank",
            "component": "link"
          }
        ],
        "media": [
          {
            "alt": "A women in yellow sweater typing on a laptop",
            "img": "//a.storyblok.com/f/70134/1100x1106/6c17fa33b6/mmda-tips.jpg",
            "_uid": "e6d1d0bf-e906-48a5-9356-3530bb533034",
            "mobile": "",
            "tablet": "",
            "desktop": "",
            "component": "media"
          }
        ],
        "title": "Tips for Using Money Market Accounts",
        "content": [
          {
            "_uid": "eb06bed2-7bff-4f6b-a23c-ad604605b7a8",
            "content": {
              "type": "doc",
              "content": [
                {
                  "type": "paragraph",
                  "content": [
                    {
                      "text": "Why settle for average rates when it comes to your savings? A traditional savings account may offer more interest than, say, a checking account. But savers can do much better extracting value from their cash reserves by opting for a higher-yielding savings product like a money market account. ",
                      "type": "text"
                    }
                  ]
                },
                {
                  "type": "paragraph",
                  "content": [
                    {
                      "text": "What can you do with a money market account? Consider money market accounts for holding your emergency fund; savings for a major expense, like college tuition; or extra cash you don't need access to on a daily basis. By holding those reserves in a money market account, you're putting them to work. Click the button below to read more about how you can use a money market account to up your savings game.",
                      "type": "text"
                    }
                  ]
                }
              ]
            },
            "heading": "",
            "component": "mediaBlockContent"
          }
        ],
        "component": "mediaSection2",
        "hasBorder": false,
        "hasBackground": true,
        "hasPaddingTop": true,
        "hasPaddingBottom": true
      },
      {
        "_uid": "5ecb6c87-92d1-48c9-a283-e1b513bda770",
        "cards": [
          {
            "_uid": "38da2987-bd48-4571-b119-f4ce9ab60124",
            "left": "Highly competitive interest rate, typically well above national average for traditional savings accounts",
            "right": "Interest rate typically above that of a checking account, but well below that of a money market account",
            "component": "whySaveBetterCard"
          },
          {
            "_uid": "c84f7bc7-2019-4ef3-96cc-8bdb5d9db2e7",
            "left": "Some banks may require high minimum deposits and charge fees if you dip below the minmum (SaveBetter does not)",
            "right": "Minimum deposit is typically low ",
            "component": "whySaveBetterCard"
          },
          {
            "_uid": "a168779b-2624-4de4-8c9c-597d090525be",
            "left": "Some banks may place limits on frequency of withdrawals from money market accounts (SaveBetter does not)",
            "right": "Some banks may place limits on frequency of withdrawals from traditional savings accounts",
            "component": "whySaveBetterCard"
          }
        ],
        "title": "Money Market Accounts vs. Traditional Savings Accounts",
        "component": "whySaveBetter",
        "hasBorder": false,
        "hasBackground": false,
        "hasPaddingTop": true,
        "leftColumnTitle": "Money Market Accounts",
        "hasPaddingBottom": true,
        "rightColumnTitle": "Traditional Savings Accounts"
      },
      {
        "_uid": "f3921e59-78bd-4d51-90ba-79252a75333d",
        "href": "/products/money-market-accounts#compare_money_market_accounts_on_savebetter",
        "kind": "primary",
        "size": "medium",
        "text": "Select a product and save",
        "target": "_self",
        "justify": "justify-center",
        "rounded": "rounded",
        "disabled": false,
        "component": "button",
        "hasBackground": false,
        "hasPaddingTop": false,
        "hasPaddingBottom": true
      },
      {
        "_uid": "4cf3e7c4-6e5e-47e2-be4c-847b826e9449",
        "kind": "2",
        "text": "More About Money Market Accounts",
        "block": "",
        "color": "text-black",
        "level": "2",
        "component": "heading",
        "hasBackground": true,
        "hasPaddingTop": true,
        "hasPaddingBottom": false
      },
      {
        "_uid": "5185cc00-8550-46e7-a599-97206cb5d7bd",
        "text": {
          "type": "doc",
          "content": [
            {
              "type": "paragraph",
              "content": [
                {
                  "text": "A money market account is a type of interest-earning savings account offered by some banks, credit unions, and online financial institutions. MMAs provide many of the conveniences of a typical savings account but with a major added benefit — they often offer higher rates than traditional savings accounts or even high-yield savings accounts (HYSAs).",
                  "type": "text",
                  "marks": [{ "type": "styled", "attrs": { "class": "" } }]
                }
              ]
            },
            { "type": "paragraph" },
            {
              "type": "paragraph",
              "content": [
                {
                  "text": "A money market account (abbreviated as MMA) is often also called a money market deposit account (MMDA). The money market deposit accounts offered through SaveBetter are equivalent to money market accounts. ",
                  "type": "text",
                  "marks": [{ "type": "styled", "attrs": { "class": "" } }]
                }
              ]
            }
          ]
        },
        "title": "What Is a Money Market Account?",
        "component": "blogPostSection",
        "hasBorder": false,
        "hasBackground": true,
        "hasPaddingTop": false,
        "hasPaddingBottom": false
      },
      {
        "_uid": "2a2f65bd-cfc8-4570-b92e-59ef66429278",
        "text": {
          "type": "doc",
          "content": [
            {
              "type": "paragraph",
              "content": [
                {
                  "text": "Money market account interest rates can be similar or just slightly less than those offered through certificates of deposit (CD), but MMAs are much more liquid; CDs require you to hold a set amount of savings untouched in an account to obtain their higher rates, but with MMAs, you can withdraw and deposit money at any time without penalty fees.",
                  "type": "text",
                  "marks": [{ "type": "styled", "attrs": { "class": "" } }]
                }
              ]
            }
          ]
        },
        "title": "Money Market Account Rates",
        "component": "blogPostSection",
        "hasBorder": false,
        "hasBackground": true,
        "hasPaddingTop": false,
        "hasPaddingBottom": false
      },
      {
        "_uid": "70aa303b-797d-48f3-94f9-1e3ba523aca1",
        "text": {
          "type": "doc",
          "content": [
            {
              "type": "paragraph",
              "content": [
                {
                  "text": "When choosing an account to park your hard-earned money, the decision often comes down to greater accessibility or earning a higher interest rate. But a money market account may strike just the right balance between both benefits. After opening the account, you can continue to deposit money into and withdraw money from a money market account, unlike the way a certificate of deposit works. ",
                  "type": "text",
                  "marks": [{ "type": "styled", "attrs": { "class": "" } }]
                }
              ]
            }
          ]
        },
        "title": "How Does a Money Market Account Work?",
        "component": "blogPostSection",
        "hasBorder": false,
        "hasBackground": true,
        "hasPaddingTop": false,
        "hasPaddingBottom": false
      },
      {
        "_uid": "b763ca36-8057-4a4f-b7b9-c4fdc1ea3ad2",
        "text": {
          "type": "doc",
          "content": [
            {
              "type": "paragraph",
              "content": [
                {
                  "text": "Withdrawals from money market accounts had been limited to six per month, but in April 2020 the Federal Reserve Board announced a new regulation allowing financial institutions to lift the cap on withdrawals on all savings accounts. This announcement was introduced due to the Covid-19 pandemic to make it easier for customers to access their savings in a time of financial need. A few months after the initial announcement, the Fed updated its Frequently Asked Questions on savings deposits to indicate that the Board does not have plans to re-impose transfer limits.",
                  "type": "text",
                  "marks": [{ "type": "styled", "attrs": { "class": "" } }]
                }
              ]
            },
            { "type": "paragraph" },
            {
              "type": "paragraph",
              "content": [
                {
                  "text": "While banks and credit unions are not required to make these changes, money market accounts opened through SaveBetter do not have any withdrawal limits.",
                  "type": "text",
                  "marks": [{ "type": "styled", "attrs": { "class": "" } }]
                }
              ]
            }
          ]
        },
        "title": "Can I Withdraw Money from a Money Market Account?",
        "component": "blogPostSection",
        "hasBorder": false,
        "hasBackground": true,
        "hasPaddingTop": false,
        "hasPaddingBottom": false
      },
      {
        "_uid": "df6554b3-ba4a-4969-a84b-b4410839167a",
        "text": {
          "type": "doc",
          "content": [
            {
              "type": "paragraph",
              "content": [
                {
                  "text": "With SaveBetter’s unique online marketplace, you can compare and access an exclusive selection of federally insured money market accounts with competitive interest rates and flexible features, all with a single one-time registration, all in one portfolio. ",
                  "type": "text",
                  "marks": [{ "type": "styled", "attrs": { "class": "" } }]
                }
              ]
            },
            { "type": "paragraph" },
            {
              "type": "paragraph",
              "content": [
                {
                  "text": "The money market accounts offered through SaveBetter are a great alternative to the standard savings account you may get through a local brick-and-mortar bank, which in addition to offering a paltry interest rate may also put limits on the frequency of withdrawals. SaveBetter exclusively selects higher-earning savings accounts from its network of partner banks. ",
                  "type": "text",
                  "marks": [{ "type": "styled", "attrs": { "class": "" } }]
                }
              ]
            },
            { "type": "paragraph", "content": [{ "type": "hard_break" }] }
          ]
        },
        "title": "Find and Open Online Money Market Accounts, All Through the Convenience of Savebetter",
        "component": "blogPostSection",
        "hasBorder": false,
        "hasBackground": true,
        "hasPaddingTop": false,
        "hasPaddingBottom": false
      },
      {
        "_uid": "bd11190d-7690-49e2-a2db-ababc4701e2c",
        "text": {
          "type": "doc",
          "content": [
            {
              "type": "paragraph",
              "content": [
                {
                  "text": "A money market account allows you to earn more interest on your savings while still having easy access to your funds when needed. These features make MMAs great options for the following savings goals:",
                  "type": "text",
                  "marks": [{ "type": "styled", "attrs": { "class": "" } }]
                }
              ]
            },
            { "type": "paragraph" },
            {
              "type": "bullet_list",
              "content": [
                {
                  "type": "list_item",
                  "content": [
                    {
                      "type": "paragraph",
                      "content": [
                        {
                          "text": "An emergency fund for unexpected costs, such as medical bills or car repairs",
                          "type": "text",
                          "marks": [
                            { "type": "styled", "attrs": { "class": "" } }
                          ]
                        }
                      ]
                    }
                  ]
                },
                {
                  "type": "list_item",
                  "content": [
                    {
                      "type": "paragraph",
                      "content": [
                        {
                          "text": "Major expenses, like a down payment for a new home or college tuition",
                          "type": "text",
                          "marks": [
                            { "type": "styled", "attrs": { "class": "" } }
                          ]
                        }
                      ]
                    }
                  ]
                },
                {
                  "type": "list_item",
                  "content": [
                    {
                      "type": "paragraph",
                      "content": [
                        {
                          "text": "Short-term wants and needs, like an upcoming vacation or new car purchase",
                          "type": "text",
                          "marks": [
                            { "type": "styled", "attrs": { "class": "" } }
                          ]
                        }
                      ]
                    }
                  ]
                },
                {
                  "type": "list_item",
                  "content": [
                    {
                      "type": "paragraph",
                      "content": [
                        {
                          "text": "Extra funds that you don’t need access to on a daily basis",
                          "type": "text",
                          "marks": [
                            { "type": "styled", "attrs": { "class": "" } }
                          ]
                        }
                      ]
                    }
                  ]
                }
              ]
            }
          ]
        },
        "title": "What Can a Money Market Account Be Used for?",
        "component": "blogPostSection",
        "hasBorder": false,
        "hasBackground": true,
        "hasPaddingTop": false,
        "hasPaddingBottom": false
      },
      {
        "_uid": "44d3430c-763b-4b38-99fb-48026cd41f91",
        "href": "/products/money-market-accounts#compare_money_market_accounts_on_savebetter",
        "kind": "primary",
        "size": "medium",
        "text": "Select a product and save",
        "target": "_self",
        "justify": "justify-center",
        "rounded": "rounded",
        "disabled": false,
        "component": "button",
        "hasBackground": true,
        "hasPaddingTop": false,
        "hasPaddingBottom": true
      },
      {
        "_uid": "60f063ef-baed-4117-9452-9cf4142d015f",
        "cards": [
          {
            "_uid": "68ed5975-e6b7-451e-a02d-29e6dfe783de",
            "media": [
              {
                "alt": "Interest rate",
                "img": "//a.storyblok.com/f/180759/x/a391a31395/interest-rate-1-01.svg",
                "_uid": "d1cad6dd-742e-4096-a3e7-56a7b0f0af3a",
                "mobile": "",
                "tablet": "",
                "desktop": "xs",
                "component": "media"
              }
            ],
            "title": "APY.",
            "content": {
              "type": "doc",
              "content": [
                {
                  "type": "paragraph",
                  "content": [
                    {
                      "text": "Annual percentage yield",
                      "type": "text",
                      "marks": [
                        {
                          "type": "link",
                          "attrs": {
                            "href": "https://www.savebetter.com/blogs/how-apy-helps-your-savings-grow",
                            "uuid": null,
                            "anchor": null,
                            "target": null,
                            "linktype": null
                          }
                        },
                        { "type": "styled", "attrs": { "class": "" } },
                        { "type": "underline" }
                      ]
                    },
                    {
                      "text": " (APY) is one of the most important figures associated with a savings account because it dictates how much you’ll earn in interest on your money. The higher the rate, the more you’ll make over time. Unlike that of a CD, an MMA’s interest rate is variable; it may change based on overall market conditions. For example, if the Federal Reserve raises interest rates, then the rates banks offer on MMAs may increase as well. The reverse also is true.",
                      "type": "text",
                      "marks": [{ "type": "styled", "attrs": { "class": "" } }]
                    }
                  ]
                }
              ]
            },
            "subtitle": "",
            "component": "leadershipCard",
            "isCollapsible": false
          },
          {
            "_uid": "7ea6e838-5785-49f1-b093-e336901a2f67",
            "media": [
              {
                "alt": "Security",
                "img": "//a.storyblok.com/f/180759/x/f9a0916cd4/insurance-1-01.svg",
                "_uid": "a54fed9a-a691-4fad-acd1-b1f59696fb88",
                "mobile": "",
                "tablet": "",
                "desktop": "",
                "component": "media"
              }
            ],
            "title": "Security.",
            "content": {
              "type": "doc",
              "content": [
                {
                  "type": "paragraph",
                  "content": [
                    {
                      "text": "MMAs are a type of deposit account, which means they are eligible for FDIC or NCUA insurance through financial institutions. FDIC insurance (covering banks) and NCUA insurance (covering credit unions) offers government-backed protection on your money, up to $250,000 per depositor, per insured institution. Ensure your funds will be covered by choosing a federally insured account.",
                      "type": "text",
                      "marks": [{ "type": "styled", "attrs": { "class": "" } }]
                    }
                  ]
                }
              ]
            },
            "subtitle": "",
            "component": "leadershipCard",
            "isCollapsible": false
          },
          {
            "_uid": "7ca85630-fc51-4577-bf9b-6849d911e392",
            "media": [
              {
                "alt": "Piggy bank",
                "img": "//a.storyblok.com/f/180759/x/59c9e52d96/piggy-bank.svg",
                "_uid": "362b5ec1-4d08-4a18-9e3d-542310f53c73",
                "mobile": "",
                "tablet": "",
                "desktop": "",
                "component": "media"
              }
            ],
            "title": "Minimum deposit.",
            "content": {
              "type": "doc",
              "content": [
                {
                  "type": "paragraph",
                  "content": [
                    {
                      "text": "Different MMAs have different rules for the minimum amount required to open an account — varying from as little as $1 to as high as several thousand dollars. The money market deposit accounts available through SaveBetter can be opened with as little as $1. ",
                      "type": "text",
                      "marks": [{ "type": "styled", "attrs": { "class": "" } }]
                    }
                  ]
                }
              ]
            },
            "subtitle": "",
            "component": "leadershipCard",
            "isCollapsible": false
          },
          {
            "_uid": "68569795-8fc8-4062-afe4-60d693fcd0d7",
            "media": [
              {
                "alt": "requirement",
                "img": "//a.storyblok.com/f/180759/x/897382410b/requirement.svg",
                "_uid": "3d134f13-674a-4766-8894-4dc44e49d323",
                "mobile": "",
                "tablet": "",
                "desktop": "",
                "component": "media"
              }
            ],
            "title": "Minimum balance.",
            "content": {
              "type": "doc",
              "content": [
                {
                  "type": "paragraph",
                  "content": [
                    {
                      "text": "If an MMA requires you to maintain a minimum balance — say, $1,000 — you may incur a fee if the amount in your account dips below that threshold. So, if you’d rather be able to access all of your money, be sure to look for an account that requires a low or no minimum balance. SaveBetter does not set a minimum balance for the money market accounts accessible through its platform.",
                      "type": "text",
                      "marks": [{ "type": "styled", "attrs": { "class": "" } }]
                    }
                  ]
                }
              ]
            },
            "subtitle": "",
            "component": "leadershipCard",
            "isCollapsible": false
          },
          {
            "_uid": "be547c99-be57-4914-ae6c-bc303b34895f",
            "media": [
              {
                "alt": "Fees",
                "img": "//a.storyblok.com/f/180759/x/3feae212a6/fees-1-01.svg",
                "_uid": "60143946-deff-4231-8bc7-2d0470f1ab1a",
                "mobile": "",
                "tablet": "",
                "desktop": "",
                "component": "media"
              }
            ],
            "title": "Fees (or lack thereof). ",
            "content": {
              "type": "doc",
              "content": [
                {
                  "type": "paragraph",
                  "content": [
                    {
                      "text": "Some financial institutions charge monthly maintenance fees, which can quickly eat into your savings. Make sure you understand any fees that are associated with an account — or choose one that doesn’t charge any. There are no fees to open or maintain a money market deposit account through SaveBetter.",
                      "type": "text",
                      "marks": [{ "type": "styled", "attrs": { "class": "" } }]
                    }
                  ]
                }
              ]
            },
            "subtitle": "",
            "component": "leadershipCard",
            "isCollapsible": false
          },
          {
            "_uid": "a148daf8-ca2e-4d6f-875e-33a27b1cc2d2",
            "media": [
              {
                "alt": "Limit",
                "img": "//a.storyblok.com/f/180759/x/0d19286c97/limit-1-01.svg",
                "_uid": "cfacaee3-53f8-439e-a066-ad48599cbbe4",
                "mobile": "",
                "tablet": "",
                "desktop": "",
                "component": "media"
              }
            ],
            "title": "Withdrawal limits.",
            "content": {
              "type": "doc",
              "content": [
                {
                  "type": "paragraph",
                  "content": [
                    {
                      "text": "MMAs are considered liquid, which means you can withdraw or transfer funds when needed, without penalty. Just keep in mind, some financial institutions may restrict your withdrawals to the six-per-month limit, despite recent changes in Fed rules. There are no such restrictions with a money market deposit account you get through SaveBetter.",
                      "type": "text",
                      "marks": [{ "type": "styled", "attrs": { "class": "" } }]
                    }
                  ]
                }
              ]
            },
            "subtitle": "",
            "component": "leadershipCard",
            "isCollapsible": false
          }
        ],
        "title": "How to Choose a Money Market Account",
        "component": "leadership",
        "hasBorder": false,
        "hasBackground": false,
        "hasPaddingTop": true,
        "hasPaddingBottom": false
      },
      {
        "_uid": "5653784d-5a2f-4a6b-8c40-14166a62068d",
        "href": "/products/money-market-accounts#compare_money_market_accounts_on_savebetter",
        "kind": "primary",
        "size": "medium",
        "text": "Select a product and save",
        "target": "_self",
        "justify": "justify-center",
        "rounded": "rounded",
        "disabled": false,
        "component": "button",
        "hasBackground": false,
        "hasPaddingTop": false,
        "hasPaddingBottom": true
      },
      {
        "_uid": "6ddbd64e-941e-4ddf-937a-c1ce5a25dd93",
        "kind": "2",
        "text": "Money Market Accounts Versus Other Deposit Accounts",
        "block": "",
        "color": "text-black",
        "level": "2",
        "component": "heading",
        "hasBackground": false,
        "hasPaddingTop": true,
        "hasPaddingBottom": false
      },
      {
        "_uid": "68743ac6-ca04-41fc-9004-7d4314be4941",
        "title": "",
        "component": "table",
        "tableGrid": {
          "_uid": "2a93905a-e0a8-4f1f-a905-142a72d54044",
          "tbody": [
            {
              "_uid": "8122a763-84ad-4c20-a97a-d968f2720494",
              "body": [
                {
                  "_uid": "afefcddc-d8fd-40d6-9f40-dc7fa38b927a",
                  "value": "Traditional Checking",
                  "component": "_table_col"
                },
                {
                  "_uid": "33bfec73-8952-49d4-a396-fd70d3be030b",
                  "value": "Not always, but if so, variable",
                  "component": "_table_col"
                },
                {
                  "_uid": "fbbe9b99-03f6-4da5-a51d-23bcdea40987",
                  "value": "Minimal, if any",
                  "component": "_table_col"
                },
                {
                  "_uid": "fd9fae78-e905-41cb-bdbe-03fb1e3ecd97",
                  "value": "Yes",
                  "component": "_table_col"
                },
                {
                  "_uid": "c1bd9019-5848-4b0c-bb05-0e861ac34aae",
                  "value": "Yes",
                  "component": "_table_col"
                }
              ],
              "component": "_table_row"
            },
            {
              "_uid": "16c51569-32c4-493a-83e4-d4e5f182fe9a",
              "body": [
                {
                  "_uid": "688fb59e-bc26-4d1e-af84-2068ef3d2176",
                  "value": "Traditional Savings",
                  "component": "_table_col"
                },
                {
                  "_uid": "527aa340-be84-4fa2-a3d9-ce0ad34b17e3",
                  "value": "Yes, variable",
                  "component": "_table_col"
                },
                {
                  "_uid": "f93eef2f-a726-4864-b06f-dd555010faf6",
                  "value": "Higher than checking accounts",
                  "component": "_table_col"
                },
                {
                  "_uid": "fdbd5475-f96a-4e3b-aab9-a5d4660277f7",
                  "value": "No",
                  "component": "_table_col"
                },
                {
                  "_uid": "011ef9b6-bf5e-4472-9bd9-57143e5ec5dd",
                  "value": "Yes, withdrawal limits may apply",
                  "component": "_table_col"
                }
              ],
              "component": "_table_row"
            },
            {
              "_uid": "3ed0d2c4-cb78-4424-8815-784bbb0b4e83",
              "body": [
                {
                  "_uid": "72d9f978-a3cb-4681-b55b-188637b029af",
                  "value": "High-yield Savings Account (HYSA)",
                  "component": "_table_col"
                },
                {
                  "_uid": "f2caf132-313c-4840-8bb3-0d48bbae5a19",
                  "value": "Yes, variable",
                  "component": "_table_col"
                },
                {
                  "_uid": "771b743e-a020-4f2f-8668-7bc0a529b08c",
                  "value": "Higher than traditional savings accounts",
                  "component": "_table_col"
                },
                {
                  "_uid": "21f3b7be-aef4-4931-a40b-1c3742414362",
                  "value": "No",
                  "component": "_table_col"
                },
                {
                  "_uid": "f7c52ee6-0188-4022-832c-a597ff51af7e",
                  "value": "Yes, withdrawal limits may apply",
                  "component": "_table_col"
                }
              ],
              "component": "_table_row"
            },
            {
              "_uid": "e18df113-1681-4a70-8dc9-7dd9f43de481",
              "body": [
                {
                  "_uid": "7c0da5be-41db-4e40-96d2-6ba8549f2814",
                  "value": "Money market account (MMA)",
                  "component": "_table_col"
                },
                {
                  "_uid": "ae4448e9-3415-4b38-b19e-b015ade4cc55",
                  "value": "Yes, variable",
                  "component": "_table_col"
                },
                {
                  "_uid": "6d364cda-f6c0-4be7-8acb-dbeb29dbd51b",
                  "value": "Comparable to or higher than HYSAs",
                  "component": "_table_col"
                },
                {
                  "_uid": "e12d4ce9-f87d-4b34-8658-d5067f990678",
                  "value": "Sometimes",
                  "component": "_table_col"
                },
                {
                  "_uid": "d5a2e07b-2a60-4489-8304-c8cc05314476",
                  "value": "Yes, withdrawal limits may apply",
                  "component": "_table_col"
                }
              ],
              "component": "_table_row"
            },
            {
              "_uid": "1b2a73e1-7a21-493c-9214-c0094e67e14b",
              "body": [
                {
                  "_uid": "08b9d532-007b-4903-96d1-1e428bf049be",
                  "value": "Certificate or deposit (CD)",
                  "component": "_table_col"
                },
                {
                  "_uid": "eed6c56e-7787-4a49-b77d-65efd427e552",
                  "value": "Yes, fixed",
                  "component": "_table_col"
                },
                {
                  "_uid": "548ca38f-cc14-4b22-891d-8bf46230640c",
                  "value": "Comparable to or higher than MMAs",
                  "component": "_table_col"
                },
                {
                  "_uid": "8f7d2777-4bd4-47fe-a58b-c58712612f71",
                  "value": "No",
                  "component": "_table_col"
                },
                {
                  "_uid": "421a9990-21c9-4cd4-85dd-95799b72e6b6",
                  "value": "No",
                  "component": "_table_col"
                }
              ],
              "component": "_table_row"
            }
          ],
          "thead": [
            { "value": "" },
            { "value": "Interest offered" },
            { "value": "How interest rates compare" },
            { "value": "Check/ATM accessible funds" },
            { "value": "Deposit/withdraw money as needed" }
          ],
          "plugin": "translateable-table"
        },
        "hasBackground": false,
        "hasPaddingTop": false,
        "hasPaddingBottom": false
      },
      {
        "_uid": "4a471618-c5d2-4fe6-a62c-62f816f968d4",
        "href": "/products/money-market-accounts#compare_money_market_accounts_on_savebetter",
        "kind": "primary",
        "size": "medium",
        "text": "Select a product and save",
        "target": "_self",
        "justify": "justify-center",
        "rounded": "rounded",
        "disabled": false,
        "component": "button",
        "hasBackground": false,
        "hasPaddingTop": false,
        "hasPaddingBottom": true
      },
      {
        "_uid": "023b0e30-4381-4867-8a49-1bf31dce22e0",
        "media": [
          {
            "alt": "Family spending time out door",
            "img": "//a.storyblok.com/f/70134/720x381/966c1d5c5f/family-ourdoor.jpg",
            "_uid": "75d9cf2d-2372-4435-a65c-e76ecd927d5d",
            "component": "media"
          }
        ],
        "title": "What Is SaveBetter?",
        "button": [
          {
            "url": "/how-it-works",
            "_uid": "5fbbaad5-5d8d-4e6a-8498-02bf5735da45",
            "text": "Learn how SaveBetter works",
            "target": "_self",
            "component": "link"
          }
        ],
        "component": "mediaSection4",
        "hasBorder": false,
        "description": "SaveBetter brings together high-yielding savings products offered by a network of U.S. financial institutions. It’s your destination to discover competitive savings products and start saving wisely. Select and fund multiple savings products from different institutions and manage them all from one account.",
        "hasBackground": false,
        "hasPaddingTop": true,
        "hasPaddingBottom": true
      },
      {
        "_uid": "82410011-5739-444d-adb2-3835b8d3ce42",
        "component": "mediaSection5",
        "hasBorder": false,
        "contentBlocks": [
          {
            "_uid": "457490d1-47d7-4c01-a8d8-59657df3e516",
            "text": "Funds deposited into any of the savings products available through SaveBetter are always held by a federally insured financial institution. A very easy and safe way to diversify your deposit portfolio. We use a host of cybersecurity measures to protect your funds and sensitive information.",
            "media": [
              {
                "alt": "Safety",
                "img": "//a.storyblok.com/f/180759/x/43f3770557/safety-sq.svg",
                "_uid": "bffff085-daaf-426d-b8ed-6b6d3249d904",
                "component": "mediav2"
              }
            ],
            "title": "Safety",
            "component": "contentWithMediaBlockv2"
          },
          {
            "_uid": "27feff50-5916-4193-b425-2503b7213e1f",
            "text": "Savings products from our network of financial institutions offer flexible terms and some of the most competitive interest rates. You can easily find the right product or mix of products for you.",
            "media": [
              {
                "alt": "Choice",
                "img": "//a.storyblok.com/f/180759/x/47cb25fc7c/choice-sq.svg",
                "_uid": "012f78af-3eec-476d-8d16-50a320e16bb2",
                "component": "mediav2"
              }
            ],
            "title": "Choice",
            "component": "contentWithMediaBlockv2"
          },
          {
            "_uid": "82778118-3c2c-4e38-ac89-a5bf8ac753ef",
            "text": "One account to hold all your deposit products. Simplified statements. Easy access to manage your funds – all through a streamlined digital platform.",
            "media": [
              {
                "alt": "Convenience",
                "img": "//a.storyblok.com/f/180759/x/7c751d5985/convenience-sq.svg",
                "_uid": "123efc40-b23a-4cf7-a6b8-951b33043f54",
                "component": "mediav2"
              }
            ],
            "title": "Convenience",
            "component": "contentWithMediaBlockv2"
          }
        ],
        "hasBackground": false,
        "hasPaddingTop": false,
        "hasPaddingBottom": false
      },
      {
        "_uid": "377557bb-ff3a-4973-83f2-22e5fbd9adfc",
        "href": "/products/money-market-accounts#compare_money_market_accounts_on_savebetter",
        "kind": "primary",
        "size": "medium",
        "text": "Select a product and save",
        "target": "_self",
        "justify": "justify-center",
        "rounded": "rounded",
        "disabled": false,
        "component": "button",
        "hasBackground": false,
        "hasPaddingTop": false,
        "hasPaddingBottom": true
      },
      {
        "_uid": "839a737a-3f53-4f65-9fec-144ddae69435",
        "cards": [
          {
            "_uid": "761aea5a-8aab-494f-aec8-1a554694ab98",
            "link": [
              {
                "url": "https://www.fdic.gov/resources/deposit-insurance/understanding-deposit-insurance/",
                "_uid": "97c01a31-2d16-4d8d-80e0-4e4f2d16a836",
                "text": "Click to learn more about FDIC insurance",
                "target": "_blank",
                "component": "link"
              }
            ],
            "media": [
              {
                "alt": "FDIC logo",
                "img": "//a.storyblok.com/f/70134/720x285/5e201cdf81/us-fdic-logo.svg",
                "_uid": "c5024f44-f3c3-4ac5-b867-29b7bd05d770",
                "mobile": "",
                "tablet": "",
                "desktop": "",
                "component": "media"
              }
            ],
            "title": "Federal Deposit Insurance Corporation",
            "component": "card",
            "paragraph": "All participating banks are members of the FDIC. Deposits in participating banks are insured by the FDIC up to the limits of federal law. The standard insurance amount is $250,000 per depositor, per insured bank, for each deposit account ownership category."
          },
          {
            "_uid": "e24a0b8f-7fea-4b33-865f-1ea24db991db",
            "link": [
              {
                "url": "https://www.ncua.gov/support-services/share-insurance-fund",
                "_uid": "b6b980a9-fbd4-4f70-aa88-e7cba2b38a5d",
                "text": "Click to learn more about NCUA insurance ",
                "target": "_blank",
                "component": "link"
              }
            ],
            "media": [
              {
                "alt": "NCUA logo",
                "img": "//a.storyblok.com/f/70134/800x500/b2cc8df0ef/ncua_seal_blue-500x800.png",
                "_uid": "95a4955c-9d9b-4e44-a7a0-afd8ce924cdf",
                "mobile": "",
                "tablet": "",
                "desktop": "",
                "component": "media"
              }
            ],
            "title": "National Credit Union Administration",
            "component": "card",
            "paragraph": "All participating credit unions are insured by the NCUA through its Share Insurance Fund. Deposits in participating credit unions are insured by the NCUA up to the limits of federal law. The standard insurance amount is $250,000 per depositor, per insured credit union, for each deposit account ownership category."
          },
          {
            "_uid": "93e8c96a-2704-4754-83a4-77def777bcde",
            "link": [
              {
                "url": "https://www.savebetter.com/blogs/savebetter-data-protection",
                "_uid": "cc069216-898a-4d64-8776-6552818b35da",
                "text": "Click to learn more about SOC 2 certification",
                "target": "_blank",
                "component": "link"
              }
            ],
            "media": [
              {
                "alt": "SOC2 logo",
                "img": "//a.storyblok.com/f/70134/250x250/177e6a0e23/soc-service-certifications.png",
                "_uid": "00237927-633b-495b-9305-16fe07e4bc8b",
                "mobile": "",
                "tablet": "",
                "desktop": "",
                "component": "media"
              }
            ],
            "title": "Cybersecurity is a top priority at SaveBetter",
            "component": "card",
            "paragraph": "We invest in a variety of technologies to protect our customer’s data, privacy and transactions. These include Multi-Factor authentication, encryption, and Cloudflare advanced internet protection and monitoring.  We are a SOC 2 certified organization, which means we have met the requirements outlined by the American Institute of Certified Public Accountants (AICPA) to ensure that we have the controls in place to keep customers' data secure and private. "
          }
        ],
        "title": "How SaveBetter Protects Your Money and Personal Information",
        "component": "cardList1",
        "hasBorder": false,
        "description": "",
        "hasBackground": true,
        "hasPaddingTop": true,
        "hasPaddingBottom": true
      },
      {
        "_uid": "0b112952-84ce-4d9c-a4dc-2fc035b18836",
        "kind": "2",
        "text": "Open an Account in 3-5 Minutes",
        "block": "",
        "color": "text-black",
        "level": "1",
        "component": "heading",
        "hasBackground": false,
        "hasPaddingTop": true,
        "textAlignment": "",
        "hasPaddingBottom": false
      },
      {
        "_uid": "80f80335-7d24-4db4-9012-bf22f9f346f7",
        "component": "mediaSection5",
        "hasBorder": false,
        "contentBlocks": [
          {
            "_uid": "83ea88ac-6998-4df1-8b8b-204ddb7cbeac",
            "text": "the right product for your savings goals.",
            "media": [
              {
                "alt": "Select a product",
                "img": "//a.storyblok.com/f/180759/x/cfc185abac/step-1.svg",
                "_uid": "33a87b87-4940-48ee-bdfd-109e91cfa7b9",
                "component": "mediav2"
              }
            ],
            "title": "Select",
            "component": "contentWithMediaBlockv2"
          },
          {
            "_uid": "6123d610-cb70-4bc9-a6f8-d30fe6b85444",
            "text": "with an email address and password, then verify your identity and bank information.",
            "media": [
              {
                "alt": "Register for a SaveBetter account",
                "img": "//a.storyblok.com/f/180759/x/c31edded4a/step-3-2.svg",
                "_uid": "81b15b80-e51b-4e01-b433-42ad13d26996",
                "component": "mediav2"
              }
            ],
            "title": "Register",
            "component": "contentWithMediaBlockv2"
          },
          {
            "_uid": "9c16a5a2-a868-4b4d-9f5d-cc3317e9b26f",
            "text": "the savings products you add to your new SaveBetter account.",
            "media": [
              {
                "alt": "Add funds",
                "img": "//a.storyblok.com/f/180759/x/f474b8dadf/step-4-3.svg",
                "_uid": "0919a9e5-0d77-4232-8ac5-84c571922244",
                "component": "mediav2"
              }
            ],
            "title": "Fund",
            "component": "contentWithMediaBlockv2"
          }
        ],
        "hasBackground": false,
        "hasPaddingTop": false,
        "hasPaddingBottom": false
      },
      {
        "_uid": "4e408382-9fe4-4618-986e-9041e78ead68",
        "href": "/products/money-market-accounts#compare_money_market_accounts_on_savebetter",
        "kind": "primary",
        "size": "medium",
        "text": "Select a product and save",
        "target": "_self",
        "justify": "justify-center",
        "rounded": "rounded",
        "disabled": false,
        "component": "button",
        "hasBackground": false,
        "hasPaddingTop": false,
        "hasPaddingBottom": true
      },
      {
        "_uid": "a251fc20-631c-44c8-95d1-c0ef409cddfa",
        "cards": [
          {
            "_uid": "dee231c8-4cf5-454a-b38d-4fc75143ae7f",
            "left": "One secure account guards your personal data and safely allows you to tap into yields from multiple savings products",
            "right": "Multiple signups, savings accounts, and products at different institutions each require you to provide sensitive personal information.",
            "component": "whySaveBetterCard"
          },
          {
            "_uid": "1087d480-388a-4a39-ba62-c35aafb89710",
            "left": "The platform brings together diverse and competitive federally insured savings products, including CDs with a range of terms, that increase your earnings potential.",
            "right": "There are fewer product options, possibly limiting your savings potential.",
            "component": "whySaveBetterCard"
          },
          {
            "_uid": "dec33dea-6b35-4833-9490-d9d78e77313e",
            "left": "Only one account is required. You manage all your chosen savings products through the SaveBetter platform.",
            "right": "By opening new accounts at multiple institutions, you get more statements, must remember more passwords, and waste time.",
            "component": "whySaveBetterCard"
          }
        ],
        "title": "Why SaveBetter Is, Well, Better",
        "component": "whySaveBetter",
        "hasBorder": false,
        "hasBackground": true,
        "hasPaddingTop": true,
        "leftColumnTitle": "With SaveBetter",
        "hasPaddingBottom": true,
        "rightColumnTitle": "With traditional banking"
      },
      {
        "_uid": "5e320f2e-3401-402c-98bc-458ead65cded",
        "link": [
          {
            "url": "/faq",
            "_uid": "1adbc9d2-054e-4332-8b1f-b8162466faf1",
            "text": "Read more FAQs",
            "target": "_self",
            "component": "link"
          }
        ],
        "title": "FAQs",
        "component": "faq",
        "hasBorder": false,
        "questions": [
          {
            "_uid": "7a3d3d8c-c976-48ae-911f-2aa7f87b0c93",
            "answer": {
              "type": "doc",
              "content": [
                {
                  "type": "paragraph",
                  "content": [
                    {
                      "text": "SaveBetter is a digital platform that gives savers unparalleled access to a variety of deposit products through the convenience of a single account, helping you unlock the growth potential of your cash savings.",
                      "type": "text"
                    }
                  ]
                },
                {
                  "type": "paragraph",
                  "content": [
                    {
                      "text": "SaveBetter customers use the platform to fund federally insured deposit products offered by numerous U.S. banks and credit unions with a wide range of maturities and APYs (annual percentage yield), allowing you to build a savings strategy to suit your earning and liquidity needs.",
                      "type": "text"
                    }
                  ]
                },
                {
                  "type": "paragraph",
                  "content": [
                    {
                      "text": "SaveBetter is not a bank. It provides the digital “storefront” where banks and credit unions can promote their deposit products.",
                      "type": "text"
                    }
                  ]
                },
                {
                  "type": "paragraph",
                  "content": [
                    {
                      "text": "SaveBetter is operated by SaveBetter LLC, a 100% subsidiary of Raisin GmbH, a trailblazer for open banking in the deposits and investments space. In the U.S., Raisin helps banks and credit unions improve their deposit funding by offering national reach for their retail deposit products, and provides savers with better access, more choice and higher convenience when evaluating savings products from FDIC insured banks and NCUA insured credit unions.",
                      "type": "text"
                    }
                  ]
                }
              ]
            },
            "question": "What is SaveBetter?",
            "component": "faqItem",
            "hasPaddingTop": false,
            "hasPaddingBottom": false
          },
          {
            "_uid": "85949db6-a991-4465-b648-6329487be82a",
            "answer": {
              "type": "doc",
              "content": [
                {
                  "type": "paragraph",
                  "content": [
                    {
                      "text": "Your SaveBetter account gives you access to savings accounts and certificates of deposit offered by a variety of banks and credit unions with the security of federal deposit insurance. These products include:",
                      "type": "text"
                    }
                  ]
                },
                { "type": "paragraph" },
                {
                  "type": "bullet_list",
                  "content": [
                    {
                      "type": "list_item",
                      "content": [
                        {
                          "type": "paragraph",
                          "content": [
                            {
                              "text": "High-yield Savings Account (HYSA).",
                              "type": "text",
                              "marks": [{ "type": "bold" }]
                            },
                            {
                              "text": " As its name indicates, this account type functions like a traditional savings account — with typically no restrictions on depositing and withdrawing funds — but earns interest (or dividends in the case of credit union savings products) at rates that are higher than the national average for standard savings accounts.",
                              "type": "text"
                            }
                          ]
                        },
                        { "type": "paragraph" }
                      ]
                    },
                    {
                      "type": "list_item",
                      "content": [
                        {
                          "type": "paragraph",
                          "content": [
                            {
                              "text": "Money Market Deposit Account (MMDA).",
                              "type": "text",
                              "marks": [{ "type": "bold" }]
                            },
                            {
                              "text": " Also known as a money market account or MMA, this type of savings account offers a varying rate that allows you to earn interest (or dividends) on your funds with maximum flexibility for withdrawals. Like a HYSA, an MMDA offers features of a traditional savings account with typically higher returns.",
                              "type": "text"
                            }
                          ]
                        },
                        { "type": "paragraph" }
                      ]
                    },
                    {
                      "type": "list_item",
                      "content": [
                        {
                          "type": "paragraph",
                          "content": [
                            {
                              "text": "No Penalty CD.",
                              "type": "text",
                              "marks": [{ "type": "bold" }]
                            },
                            {
                              "text": " Through the flexibility of a No Penalty CD, you can lock in a competitive rate for a fixed term with the option to make a full withdrawal at any time beginning seven (7) calendar days after funding without having to pay a penalty for the early termination.",
                              "type": "text"
                            }
                          ]
                        },
                        { "type": "paragraph" }
                      ]
                    },
                    {
                      "type": "list_item",
                      "content": [
                        {
                          "type": "paragraph",
                          "content": [
                            {
                              "text": "Fixed Term CD.",
                              "type": "text",
                              "marks": [{ "type": "bold" }]
                            },
                            {
                              "text": " With this longstanding savings vehicle, funds are held for a fixed term, and a competitive APY (annual percentage yield) provides safe, predictable earnings. In contrast to No Penalty CDs, typically you are charged a fee if you do not complete the full term of the Fixed Term CD.",
                              "type": "text"
                            }
                          ]
                        }
                      ]
                    }
                  ]
                }
              ]
            },
            "question": "What types of products are available through SaveBetter?",
            "component": "faqItem",
            "hasPaddingTop": false,
            "hasPaddingBottom": false
          },
          {
            "_uid": "605c34a7-9fb7-496d-abc8-cbe801c8e289",
            "answer": {
              "type": "doc",
              "content": [
                {
                  "type": "paragraph",
                  "content": [
                    {
                      "text": "Interest (or dividend in the case of credit union savings products) is compounded daily and posted to your account monthly.",
                      "type": "text"
                    }
                  ]
                }
              ]
            },
            "question": "How often is interest compounded?",
            "component": "faqItem",
            "hasPaddingTop": false,
            "hasPaddingBottom": false
          },
          {
            "_uid": "bd6fef89-b462-4c82-9034-9d43ea189d83",
            "answer": {
              "type": "doc",
              "content": [
                {
                  "type": "paragraph",
                  "content": [
                    { "text": "The short answer is yes! ", "type": "text" }
                  ]
                },
                {
                  "type": "paragraph",
                  "content": [
                    {
                      "text": "For SaveBetter customers who hold savings products offered by one of our partner banks, funds are insured by the FDIC up to the maximum amount in accordance with and as permitted by law at each bank holding their funds. The standard deposit insurance coverage limit is $250,000 per depositor, per FDIC-insured bank, per account ownership category. Ownership categories as defined by the FDIC include single bank accounts (owned by one person/depositor) and joint bank accounts (owned by two or more persons/depositors). Revocable trust accounts and some types of retirement accounts (e.g., IRAs) are among the other ownership categories covered by FDIC insurance. All deposits you have at a bank — whether facilitated through SaveBetter or otherwise — count toward the deposit insurance limit. If funds held at a bank in a certain ownership category exceed the coverage limit, then the amount in excess of the limit will not be insured.",
                      "type": "text"
                    }
                  ]
                },
                {
                  "type": "paragraph",
                  "content": [
                    {
                      "text": "If you hold a savings product offered by one of our partner credit unions — making you a member of the institution — funds are insured by the NCUA through its Share Insurance Fund. According to the NCUA, each credit union member has at least $250,000 in total coverage. The Share Insurance Fund insures individual accounts up to $250,000. Additionally, a member’s interest in all joint accounts combined is insured up to $250,000.",
                      "type": "text"
                    }
                  ]
                }
              ]
            },
            "question": "Does my SaveBetter account have deposit insurance?",
            "component": "faqItem",
            "hasPaddingTop": false,
            "hasPaddingBottom": false
          },
          {
            "_uid": "58e626e9-ab8e-4501-9ff4-1f65e9b68407",
            "answer": {
              "type": "doc",
              "content": [
                {
                  "type": "paragraph",
                  "content": [
                    {
                      "text": "At SaveBetter, cybersecurity is our priority. SaveBetter is a SOC 2 certified platform, meaning it has been validated by outside auditors across five (5) key information security principles. We also use a variety of measures to protect our customers' data, privacy and transactions, including:",
                      "type": "text"
                    }
                  ]
                },
                {
                  "type": "paragraph",
                  "content": [
                    {
                      "text": "•\tUser authentication.",
                      "type": "text",
                      "marks": [{ "type": "bold" }]
                    },
                    {
                      "text": " The SaveBetter platform uses multi-factor authentication combined with leading authentication technology to validate our customers’ identities.",
                      "type": "text"
                    }
                  ]
                },
                {
                  "type": "paragraph",
                  "content": [
                    {
                      "text": "•\tData encryption.",
                      "type": "text",
                      "marks": [{ "type": "bold" }]
                    },
                    {
                      "text": " Your personal information is encrypted in-transit and at rest using advanced cryptographic security algorithms.",
                      "type": "text"
                    }
                  ]
                },
                {
                  "type": "paragraph",
                  "content": [
                    {
                      "text": "•\tSite protection.",
                      "type": "text",
                      "marks": [{ "type": "bold" }]
                    },
                    {
                      "text": " Cloudflare™ advanced internet protection technologies are implemented to protect SaveBetter.com from malicious actors, botnets and denial of service attacks (DDOS).",
                      "type": "text"
                    }
                  ]
                },
                {
                  "type": "paragraph",
                  "content": [
                    {
                      "text": "•\tMonitoring.",
                      "type": "text",
                      "marks": [{ "type": "bold" }]
                    },
                    {
                      "text": " An always-on information security monitoring platform detects and alerts us to information security events.",
                      "type": "text"
                    }
                  ]
                },
                {
                  "type": "paragraph",
                  "content": [
                    {
                      "text": "•\tAssessments.",
                      "type": "text",
                      "marks": [{ "type": "bold" }]
                    },
                    {
                      "text": " Our platform undergoes vigorous security assessments and testing throughout the lifecycle of application development, from architecture planning to production phases.",
                      "type": "text"
                    }
                  ]
                },
                {
                  "type": "paragraph",
                  "content": [
                    {
                      "text": "Cloudflare™ is a registered trademark of Cloudflare, Inc.",
                      "type": "text"
                    }
                  ]
                }
              ]
            },
            "question": "How does SaveBetter protect my data, privacy, and finances?",
            "component": "faqItem",
            "hasPaddingTop": false,
            "hasPaddingBottom": false
          },
          {
            "_uid": "1b4c704b-483c-4f09-9833-79cf59fd522c",
            "answer": {
              "type": "doc",
              "content": [
                {
                  "type": "paragraph",
                  "content": [
                    {
                      "text": "A.\tCheck out our savings marketplace and choose a product in which you would like to deposit money.",
                      "type": "text"
                    }
                  ]
                },
                {
                  "type": "paragraph",
                  "content": [
                    {
                      "text": "B.\tCreate your username and password.",
                      "type": "text"
                    }
                  ]
                },
                {
                  "type": "paragraph",
                  "content": [
                    {
                      "text": "C.\tComplete an application and, after successful identity verification, link a bank account from which to fund your first savings product.",
                      "type": "text"
                    }
                  ]
                },
                {
                  "type": "paragraph",
                  "content": [
                    {
                      "text": "D.\tStart earning interest as soon as your money is received by the bank or credit union offering the savings product you selected.",
                      "type": "text"
                    }
                  ]
                },
                {
                  "type": "paragraph",
                  "content": [
                    {
                      "text": "Any questions or concerns? Email us at ",
                      "type": "text"
                    },
                    {
                      "text": "service@SaveBetter.com",
                      "type": "text",
                      "marks": [
                        {
                          "type": "link",
                          "attrs": {
                            "href": "service@SaveBetter.com",
                            "uuid": null,
                            "anchor": null,
                            "target": "_blank",
                            "linktype": "email"
                          }
                        }
                      ]
                    },
                    { "text": ".", "type": "text" }
                  ]
                }
              ]
            },
            "question": "How do I open a SaveBetter account?",
            "component": "faqItem",
            "hasPaddingTop": false,
            "hasPaddingBottom": false
          },
          {
            "_uid": "bb04f8c4-18e7-436a-aec6-8ef64e88d832",
            "answer": {
              "type": "doc",
              "content": [
                {
                  "type": "paragraph",
                  "content": [
                    {
                      "text": "All deposits and withdrawals are completed within one to three (1-3) business days. After the initial deposit a withdrawals limitation for the first few business days may exist.",
                      "type": "text"
                    }
                  ]
                },
                {
                  "type": "paragraph",
                  "content": [
                    {
                      "text": "Business days are Monday through Friday excluding U.S. bank holidays.",
                      "type": "text"
                    }
                  ]
                }
              ]
            },
            "question": "How long does it take to deposit my money? What about withdrawals?",
            "component": "faqItem",
            "hasPaddingTop": false,
            "hasPaddingBottom": false
          },
          {
            "_uid": "0ab5867d-655a-4225-b222-2dbdbafa5fd6",
            "answer": {
              "type": "doc",
              "content": [
                {
                  "type": "paragraph",
                  "content": [
                    {
                      "text": "For products offered by banks, all necessary registration is handled when you become a SaveBetter customer. One of the many benefits of our platform is that you can open a single account and earn competitive interest rates from banks in the SaveBetter network. When you select and fund a savings product offered by a credit union, there is an additional step of becoming a member. SaveBetter makes that process quick, easy and free. You still have one SaveBetter login and can view all your savings products in one convenient dashboard.",
                      "type": "text"
                    }
                  ]
                }
              ]
            },
            "question": "Will I need to register for accounts at the financial institutions where I've chosen to deposit my money? Am I a customer of those banks or a member of those credit unions?",
            "component": "faqItem",
            "hasPaddingTop": false,
            "hasPaddingBottom": false
          },
          {
            "_uid": "1e0e0df6-82e6-4cbc-8d5a-eba49e0adf12",
            "answer": {
              "type": "doc",
              "content": [
                {
                  "type": "paragraph",
                  "content": [
                    {
                      "text": "The current APY for your savings products can always be viewed on the Account Overview page when you are logged in to SaveBetter. This information also appears on monthly statements.",
                      "type": "text"
                    }
                  ]
                }
              ]
            },
            "question": "Where can I view my savings products’ Annual Percentage Yield (APY)?",
            "component": "faqItem",
            "hasPaddingTop": false,
            "hasPaddingBottom": false
          },
          {
            "_uid": "582c5bb7-3d80-47f2-8647-922cf20a5056",
            "answer": {
              "type": "doc",
              "content": [
                {
                  "type": "paragraph",
                  "content": [
                    {
                      "text": "You cannot currently link your SaveBetter account to a third-party app, but we may offer this feature in the future.  For now, you will not be able to link your selected savings product to a third-party app even if the bank or credit union offering that product does so outside of the SaveBetter platform.",
                      "type": "text"
                    }
                  ]
                }
              ]
            },
            "question": "Can I link my SaveBetter account or selected savings product to a third-party app? ",
            "component": "faqItem",
            "hasPaddingTop": false,
            "hasPaddingBottom": false
          }
        ],
        "hasBackground": false,
        "hasPaddingTop": true,
        "hasPaddingBottom": true
      }
    ],
    "logo": [],
    "test": "",
    "title": "Best Money Market Account Rates on SaveBetter in April 2023",
    "layout": {
      "id": "a7887b35-4fec-4639-a28f-c4afd03fa845",
      "url": "savedo.ch",
      "linktype": "story",
      "fieldtype": "multilink",
      "cached_url": "layouts/explore-product-no-nav-layout"
    },
    "metadata": {
      "_uid": "3724defc-38a4-4567-a304-1085c4999972",
      "title": "FDIC and NCUA Insured Money Market Accounts. | SaveBetter",
      "plugin": "meta-fields",
      "description": "Explore competitive high-interest money market accounts offered by FDIC-insured banks and NCUA-insured credit unions through SaveBetter's unique online marketplace. Open an account with as little as $1 and no fees."
    },
    "component": "page",
    "isTextWhite": true,
    "headerOutline": [
      {
        "_uid": "40daf0f2-5057-4036-9d6d-ed1a86a7f4cf",
        "title": "Compare Money Market Accounts on SaveBetter",
        "bankCode": "",
        "component": "productOfferTable",
        "hasBorder": false,
        "productId": "",
        "hasBackground": false,
        "hasPaddingTop": false,
        "featuredProducts": [],
        "hasPaddingBottom": false,
        "showSelectedProductTypes": ["SAVINGS_ACCOUNT"],
        "hasFinancialInstitutionsDropdown": true
      }
    ],
    "disableIndexing": true,
    "showBreadcrumbs": false,
    "headerBackground": [
      {
        "alt": "Savings",
        "img": "//a.storyblok.com/f/180759/2560x550/4e7a7f6f77/normal_u15.png",
        "_uid": "4768358c-8f1d-4891-9949-edc1c1f49e0b",
        "mobile": "",
        "tablet": "",
        "desktop": "",
        "component": "media"
      }
    ],
    "introductionLink": [
      {
        "url": "/products/money-market-accounts#compare_money_market_accounts_on_savebetter",
        "_uid": "4ff30c35-0cb3-45e1-bdfd-be2be443e2c8",
        "text": "Select a product and save",
        "target": "_self",
        "component": "link"
      }
    ],
    "introductionList": [
      {
        "_uid": "65fcadc5-e66d-462f-98f8-842a4bfae411",
        "text": "FDIC or NCUA insured. No fees. $1 minimum deposit.",
        "component": "introductionListItem"
      },
      {
        "_uid": "a59ad35a-bc95-4fb0-95c2-cf24a3967943",
        "text": "24/7 online access to funds.",
        "component": "introductionListItem"
      }
    ],
    "isLinkSecondaryColor": true,
    "productCardsCustomiser": [],
    "introductionDescription": ""
  },
  "slug": "money-market-accounts",
  "full_slug": "products/money-market-accounts",
  "sort_by_date": null,
  "position": 10,
  "tag_list": [],
  "is_startpage": false,
  "parent_id": 290604898,
  "meta_data": null,
  "group_id": "32133561-4c84-42be-bd26-8767da91a6df",
  "first_published_at": "2020-01-06T15:09:15.000Z",
  "release_id": null,
  "lang": "default",
  "path": null,
  "alternates": [],
  "default_full_slug": null,
  "translated_slugs": null
}
