{
  "name": "2022-02 sweet bonus layout",
  "created_at": "2023-04-12T09:56:25.375Z",
  "published_at": "2023-01-03T15:14:32.192Z",
  "id": 290604958,
  "uuid": "d3b8e5f4-06c8-466e-9828-e0096ddd3dd2",
  "content": {
    "_uid": "6005f6fb-409f-48ab-916b-ed233a53557e",
    "footer": [
      {
        "_uid": "b6818a61-a541-4bd2-8bb1-d900a9ee8b95",
        "text": {
          "type": "doc",
          "content": [
            {
              "type": "paragraph",
              "content": [
                {
                  "text": "* Bonus offer Terms and Conditions:",
                  "type": "text"
                }
              ]
            },
            {
              "type": "paragraph",
              "content": [
                {
                  "text": "New customers are eligible to receive a discretionary $25USD in bonus cash for the first $5000USD deposited through SaveBetter.com, and $5USD for each additional $5000USD deposited in the same product. Maximum eligible bonus payout is based on customer’s deposit balance on the 30th day after their first deposit (the “Deposit Eligibility Period”). In order to qualify, first deposits must be made by 02/28/22. Each customer is eligible to receive a maximum of $125USD of bonus cash. Customer must maintain the minimum daily deposit amount for each level of bonus for a period of at least 90 days following the Deposit Eligibility Period (e.g., a minimum balance of $5000USD daily to be eligible for a $25USD bonus; or a minimum deposit of $10,000USD daily to be eligible for a $30USD bonus). Bonus cash to be deposited by SaveBetter LLC into customer’s Customer Account within 30 days after the day on which customer qualifies for a bonus. Offer valid from 02/01/22 to 02/28/22. US customers only. Not open to SaveBetter or Deposit Solutions employees. SaveBetter reserves the right to terminate this offer at any time and to deny Customer bonus cash for any reason.",
                  "type": "text"
                }
              ]
            },
            { "type": "paragraph" },
            {
              "type": "paragraph",
              "content": [
                {
                  "text": "The SaveBetter name and logo are trademarks of SaveBetter LLC.  The Deposit Solutions name and logo are trademarks of Raisin DS GmbH, used with permission.  The Central Bank of Kansas City name and logo are trademarks of Central Bank of Kansas City, used with permission.  Continental Bank is a trademark of Continental Bank, used with permission.  Ponce Bank and the Ponce De Leon image are trademarks of Ponce De Leon Federal Bank, used with permission. WEX Bank is a trademark of WEX Bank, used with permission. The State Exchange Bank is a trademark of The State Exchange Bank, used with permission. Patriot Bank is a trademark of Patriot Bank N.A., used with permission. Liberty Savings Bank is a trademark of Liberty Savings Bank, used with permission.",
                  "type": "text"
                }
              ]
            },
            {
              "type": "paragraph",
              "content": [
                {
                  "text": "© 2023 SaveBetter LLC.  All rights reserved.",
                  "type": "text"
                }
              ]
            },
            {
              "type": "paragraph",
              "content": [
                {
                  "text": "APY means Annual Percentage Yield. APY is accurate as of February 7, 2022. Interest rate may change after initial deposit. Minimum opening deposit is $1.00.",
                  "type": "text"
                }
              ]
            },
            {
              "type": "paragraph",
              "content": [
                {
                  "text": "Each customer authorizes the Custodian Bank to hold the customer’s funds in a custodial capacity in order to facilitate the customer’s deposits to and withdrawals from deposit accounts at various Product Banks that the customer requests through SaveBetter.com. The Custodian Bank does not establish the terms of the deposit accounts, or offer the deposit accounts to customers, and provides no advice to customers about deposit accounts. Central Bank of Kansas City, Member FDIC, d.b.a. Central Payments is the Service Bank. Custodian services are provided by Lewis and Clark Bank.",
                  "type": "text"
                }
              ]
            }
          ]
        },
        "links": [
          {
            "url": "/about-us",
            "_uid": "a6a0c558-b6c2-4b55-a8e7-61b8851c0ea7",
            "text": "About us",
            "target": "_self",
            "component": "link"
          },
          {
            "url": "/explore-products",
            "_uid": "e4bc083d-5b53-463f-8496-c3ac88f5dc61",
            "text": "Explore products",
            "target": "_self",
            "component": "link"
          },
          {
            "url": "/faq",
            "_uid": "184e2eac-7cd9-4bda-9926-d52cb0dd0ff8",
            "text": "Help",
            "target": "_self",
            "component": "link"
          },
          {
            "url": "https://dsusprd01pubassets.blob.core.windows.net/ds-us/privacy_policy.pdf",
            "_uid": "bb471518-f37e-4bcb-abf9-ea890f5544b7",
            "text": "Privacy policy",
            "target": "_blank",
            "component": "link"
          },
          {
            "url": "https://dsusprd01pubassets.blob.core.windows.net/ds-us/cookie_policy.pdf",
            "_uid": "e356ee8e-0b48-4690-a110-1a4e0f66b851",
            "text": "Cookie policy",
            "target": "_blank",
            "component": "link"
          },
          {
            "url": "https://dsusprd01pubassets.blob.core.windows.net/ds-us/terms_and_conditions.pdf",
            "_uid": "ad6e4217-e26b-48a1-98fa-3daff79dd6e0",
            "text": "Terms and conditions",
            "target": "_blank",
            "component": "link"
          },
          {
            "url": "https://dsusprd01pubassets.blob.core.windows.net/ds-us/savebetter_terms_of_service_combined.pdf",
            "_uid": "8bbc7df7-0abd-4249-b578-0b0b5c0de2f7",
            "text": "Terms of Service",
            "target": "_blank",
            "component": "link"
          }
        ],
        "component": "footerv2",
        "socialBox": [
          {
            "_uid": "ef8edebb-79c9-44eb-bf99-2d74bedffa65",
            "links": [
              {
                "url": "https://www.facebook.com/savebetterus",
                "_uid": "41a3c052-1317-4b7d-9d85-7c3d6f38bccc",
                "icon": ["Facebook"],
                "target": "_blank",
                "component": "socialBoxLink"
              },
              {
                "url": "https://www.linkedin.com/showcase/savebetter",
                "_uid": "4d7e3a15-268a-4af3-a11a-0c3065abeae7",
                "icon": ["LinkedIn"],
                "target": "_blank",
                "component": "socialBoxLink"
              }
            ],
            "title": "Let's connect",
            "component": "socialBox"
          }
        ],
        "contactBar": [
          {
            "_uid": "12e7de9e-b9c1-4b74-85d2-40d7677ff434",
            "email": "service@savebetter.com",
            "component": "contactBar",
            "phoneNumber": "844-994-EARN (3276)",
            "workingHours": "Monday to Friday from 9:00 a.m. - 4:00 p.m. ET"
          }
        ]
      }
    ],
    "header": [
      {
        "_uid": "b395999c-87ed-4568-9a8e-d51e04911c67",
        "logo": "//a.storyblok.com/f/70134/376x46/52b1febc50/savebetter-logo.png",
        "logoLink": {
          "id": "99aac140-a36b-461c-a625-53ada9204fae",
          "url": "",
          "linktype": "story",
          "fieldtype": "multilink",
          "cached_url": "expired/home-20210104"
        },
        "component": "navigation",
        "logoImage": [
          {
            "alt": "SaveBetter",
            "img": "//a.storyblok.com/f/70134/532x63/51977ed684/savebetter_logo_tm-min.png",
            "_uid": "26c9eadc-bd3b-4fae-befd-f9a07aa1714d",
            "component": "media"
          }
        ],
        "primaryButton": [
          {
            "url": "https://app.savebetter.com/auth/login",
            "_uid": "24036cbe-871d-4730-93f6-41062f3ad5d4",
            "text": "Log In",
            "target": "_self",
            "component": "link"
          }
        ],
        "secondaryButton": [],
        "navigationElements": [
          {
            "_uid": "5a584c65-be53-4b14-9dae-f0e7a41d3629",
            "link": {
              "id": "89c66cdc-a0f7-49ab-869e-54d100b0ebf7",
              "url": "",
              "linktype": "story",
              "fieldtype": "multilink",
              "cached_url": "how-it-works"
            },
            "label": "How it works",
            "component": "navigationElement",
            "navigationElements": []
          },
          {
            "_uid": "0d26d4b8-8c5a-45d3-9b98-cd02daca48b2",
            "link": {
              "id": "b8f225b9-fe65-4fbf-b968-64e27f9ba665",
              "url": "",
              "linktype": "story",
              "fieldtype": "multilink",
              "cached_url": "explore-products"
            },
            "label": "Explore products",
            "component": "navigationElement",
            "navigationElements": []
          },
          {
            "_uid": "12ca4ab4-9a0b-40bb-aa50-f587c2e4ecc2",
            "link": {
              "id": "5aa34857-d332-4e0a-855e-d452fdd838f0",
              "url": "",
              "linktype": "story",
              "fieldtype": "multilink",
              "cached_url": "about-us"
            },
            "label": "About us",
            "component": "navigationElement",
            "navigationElements": []
          },
          {
            "_uid": "fd1da204-7a79-4e70-ab83-a5b74608d200",
            "link": {
              "id": "26103454-48c6-4c87-a2c6-e1f1d6eff911",
              "url": "",
              "linktype": "story",
              "fieldtype": "multilink",
              "cached_url": "faq"
            },
            "label": "FAQ",
            "component": "navigationElement",
            "navigationElements": []
          },
          {
            "_uid": "9d6e8e2d-71fa-47b7-89c4-6e9076445ee3",
            "link": {
              "id": "",
              "url": "education-center",
              "_uid": "3d50461b-2fd9-4b9c-a6c1-a1274156d08f",
              "linktype": "url",
              "fieldtype": "multilink",
              "cached_url": "education-center"
            },
            "label": "Education center",
            "component": "navigationElement",
            "navigationElements": []
          }
        ]
      }
    ],
    "component": "global",
    "hasNavigation": true
  },
  "slug": "2022-02-sweet-bonus-layout",
  "full_slug": "layouts/2022-02-sweet-bonus-layout",
  "sort_by_date": null,
  "position": 10,
  "tag_list": [],
  "is_startpage": false,
  "parent_id": 290604865,
  "meta_data": null,
  "group_id": "c9323216-222d-4237-8a71-ce7fc3b86758",
  "first_published_at": "2020-02-18T16:21:36.000Z",
  "release_id": null,
  "lang": "default",
  "path": null,
  "alternates": [],
  "default_full_slug": null,
  "translated_slugs": null
}
