{
  "name": "9 Month Share Certificate",
  "created_at": "2023-04-12T09:56:31.792Z",
  "published_at": "2023-03-30T14:36:15.505Z",
  "id": 290605132,
  "uuid": "65c41908-a67b-4f9a-91d5-2edc2e146352",
  "content": {
    "_uid": "3b79ceea-1646-489e-b9bc-95f2e7326c50",
    "body": [
      {
        "_uid": "ee4748c8-57a6-4c17-bcbe-f1677b18cf8a",
        "title": "Earn {productID-APY}{NCUA-1Y-CD-10K} more than the national average APY",
        "component": "productComparison",
        "buttonLink": "https://app.savebetter.com/auth/register?productId=XXXXXXXXXXX",
        "layoutType": "col",
        "productVar": "{productID-product}",
        "bankHexColor": "#0096db",
        "apyTitleColor": "text-black",
        "hasBackground": false,
        "hasPaddingTop": false,
        "comparisonTitle": "Don't settle for average rates",
        "hasPaddingBottom": false,
        "nationalAverageVar": "{NCUA-1Y-CD-10K}",
        "comparisonDescription": "Receive a competitive rate with the ability to withdraw or add funds whenever you like. Flexibility to withdraw as much as you want, whenever you want; there are no restrictions.",
        "nationalAverageDisclaimer": "1 Year CD, 10K",
        "nationalAverageDescription": "12 Month CDs"
      },
      {
        "_uid": "7617a021-4820-4217-88c8-0c3c2d45a7e3",
        "link": [],
        "media": [
          {
            "alt": "Woman and child on beach",
            "img": "//a.storyblok.com/f/70134/800x500/c17677bec1/about-blue-fcu.png",
            "_uid": "bce3d0d9-ab1f-4e6f-809c-9c21d04f3408",
            "mobile": "",
            "tablet": "",
            "desktop": "",
            "component": "media"
          }
        ],
        "title": "About Blue Federal Credit Union",
        "content": [
          {
            "_uid": "c71e3881-acbe-49a7-86bc-124b51eeea43",
            "content": {
              "type": "doc",
              "content": [
                {
                  "type": "paragraph",
                  "content": [
                    {
                      "text": "Blue Federal Credit Union was originally chartered in 1951 as Warren Federal Credit Union by a group of civilian personnel at F.E. Warren Air Force Base, located in the Cheyenne, Wyoming, area. For the following 70-plus years, the organization has transformed through expansion, successful mergers and an ever-growing membership base to become a financial institution that today is all about empowering people to tap into the potential of their money, life and community. \"Blue\" nods not only to Air Force Blue, but also to a deep connection to the Rockies, to limitless open skies — and to a promise of financial opportunity that's equally boundless.",
                      "type": "text"
                    }
                  ]
                }
              ]
            },
            "heading": "",
            "component": "mediaBlockContent"
          }
        ],
        "component": "mediaSection2",
        "hasBorder": false,
        "hasBackground": false,
        "hasPaddingTop": false,
        "hasPaddingBottom": false
      },
      {
        "_uid": "bf54860f-4616-4a03-8175-f909ac35b11d",
        "component": "mediaSection5",
        "hasBorder": false,
        "contentBlocks": [
          {
            "_uid": "ec7b4407-7e32-4a58-9982-e26c57aea4a1",
            "text": "Blue currently has over 115,000 members, with many based in Colorado and Wyoming. ",
            "media": [
              {
                "alt": "Community",
                "img": "//a.storyblok.com/f/180759/x/6a8314608b/community.svg",
                "_uid": "6bcfc1ef-4e21-482b-9522-4b919aeebf7e",
                "component": "mediav2"
              }
            ],
            "title": " A Thriving Community",
            "component": "contentWithMediaBlockv2"
          },
          {
            "_uid": "4ed943c3-2451-4be1-aa7e-402c6bbb2045",
            "text": "Charitable giving is directed through the Blue Foundation — launched to help do good in Blue Federal Credit Union's local communities",
            "media": [
              {
                "alt": "A badge icon",
                "img": "//a.storyblok.com/f/180759/x/64133708f4/giving-back.svg",
                "_uid": "4511fadd-6ba7-4a39-aa65-9422ec974d97",
                "component": "mediav2"
              }
            ],
            "title": "Charity is Central",
            "component": "contentWithMediaBlockv2"
          },
          {
            "_uid": "9acf43bf-4358-4f64-8835-e0eaa3dbeb9a",
            "text": "For every donation dollar the Blue Foundation receives, Blue Federal Credit Union matches it at up to 80%",
            "media": [
              {
                "alt": "Recycle ",
                "img": "//a.storyblok.com/f/180759/x/59c9e52d96/piggy-bank.svg",
                "_uid": "92d89794-ba15-4e57-9bd4-d869825fe16d",
                "component": "mediav2"
              }
            ],
            "title": "Advancing Worthy Causes",
            "component": "contentWithMediaBlockv2"
          }
        ],
        "hasBackground": false,
        "hasPaddingTop": false,
        "hasPaddingBottom": false
      },
      {
        "_uid": "b3a22ca0-479b-4c61-8b6e-b3c6896e9b9e",
        "href": "https://app.savebetter.com/auth/register?productId=12D83C14CB9648E0810540A3",
        "kind": "primary",
        "size": "medium",
        "text": "Save Now",
        "target": "_self",
        "justify": "justify-center",
        "rounded": "rounded",
        "disabled": false,
        "component": "button",
        "hasBackground": false,
        "hasPaddingTop": false,
        "backgroundColor": "",
        "hasPaddingBottom": true
      },
      {
        "_uid": "feeee1cd-770f-4a1d-a7fd-f9e6e6913a83",
        "cards": [
          {
            "_uid": "b00f0af4-dcdc-4ca9-82ef-f09406db1a1d",
            "link": [
              {
                "url": "https://www.ncua.gov/support-services/share-insurance-fund",
                "_uid": "5cc27ee4-2672-44e7-b11c-af74fa7fce97",
                "text": "Click to learn more about NCUA insurance",
                "target": "_blank",
                "component": "link"
              }
            ],
            "media": [
              {
                "alt": "NCUA insured",
                "img": "//a.storyblok.com/f/70134/2021x2021/3a1638673b/25542495_1752115101518706_2887136597949032630_o.png",
                "_uid": "e9898bb5-144c-4df1-8435-1b15e6c84ef7",
                "mobile": "",
                "tablet": "",
                "desktop": "",
                "component": "media"
              }
            ],
            "title": "National Credit Union Administration",
            "component": "card",
            "paragraph": "Savings in Blue Federal Credit Union are insured by the NCUA up to the limits of federal law. The standard insurance amount is $250,000 per member, per insured credit union, for each share account ownership category."
          },
          {
            "_uid": "c9a68deb-522d-4f8c-9923-e0b6fa97fc97",
            "link": [
              {
                "url": "https://www.savebetter.com/blogs/savebetter-data-protection",
                "_uid": "970e6e82-4635-47f4-848c-62363c9dd2c7",
                "text": "Click to learn more about SOC 2 certification",
                "target": "_blank",
                "component": "link"
              }
            ],
            "media": [
              {
                "alt": "SOC2 logo",
                "img": "//a.storyblok.com/f/70134/250x250/177e6a0e23/soc-service-certifications.png",
                "_uid": "e4ce7a02-84ad-405d-9f60-337ca12ddf95",
                "mobile": "",
                "tablet": "",
                "desktop": "",
                "component": "media"
              }
            ],
            "title": "Cybersecurity is a top priority at SaveBetter",
            "component": "card",
            "paragraph": "We invest in a variety of technologies to protect our customer’s data, privacy and transactions. These include Multi-Factor authentication, encryption, and Cloudflare advanced internet protection and monitoring.  We are a SOC 2 certified organization, which means we have met the requirements outlined by the American Institute of Certified Public Accountants (AICPA) to ensure that we have the controls in place to keep customers' data secure and private. "
          }
        ],
        "title": "Security Is Our Top Priority",
        "component": "cardList1",
        "hasBorder": false,
        "description": "",
        "hasBackground": true,
        "hasPaddingTop": true,
        "hasPaddingBottom": true
      },
      {
        "_uid": "532c1688-bbd3-49c5-83c7-4367ffbc5e08",
        "media": [
          {
            "alt": "Family enjoying outdoor time",
            "img": "//a.storyblok.com/f/70134/720x381/966c1d5c5f/family-ourdoor.jpg",
            "_uid": "18d823d9-c81c-43c0-90a3-8fba842db21a",
            "mobile": "",
            "tablet": "",
            "desktop": "",
            "component": "media"
          }
        ],
        "title": "Blue Federal Credit Union, Powered by SaveBetter",
        "button": [],
        "component": "mediaSection4",
        "hasBorder": false,
        "description": "Blue Federal Credit Union uses the secure SaveBetter platform to offer savings products to savers nationwide. Customers open accounts at SaveBetter.com, and the platform manages all aspects of the products offered by Blue Federal Credit Union, including a customer's deposits and withdrawals, statements and any customer service needs. In simple terms, SaveBetter provides you exclusive access to a special selection of Blue products. Best of all, SaveBetter is completely free!",
        "hasBackground": false,
        "hasPaddingTop": true,
        "hasPaddingBottom": false
      },
      {
        "_uid": "cb54efb3-1949-4806-b35e-e537419c2655",
        "items": [
          {
            "_uid": "6d7389fe-bed8-408b-99f5-845e44c9862a",
            "text": "Security: Funds deposited into any of the products accessible through SaveBetter are held by federally insured institutions. We use a host of cybersecurity measures to protect your funds and sensitive information. ",
            "component": "ListIcon2Item"
          },
          {
            "_uid": "3abae37c-c729-4892-a302-d9a5c03909ef",
            "text": " Choice: Savings products from our network of financial institutions offer flexible terms and some of the most competitive interest rates. You can easily find the right product or mix of products for you.",
            "component": "ListIcon2Item"
          },
          {
            "_uid": "37849564-3b6b-48c8-9490-aa6bf9dfe5d7",
            "text": "Convenience: One account to hold all your deposit products. Simplified statements. Easy access to manage your funds – all through a streamlined digital platform.",
            "component": "ListIcon2Item"
          },
          {
            "_uid": "0f7bbe83-b3ee-4469-85b6-608b6f75b2b2",
            "text": "Service: A supportive, accessible, responsive customer service team based in New York, NY, sets SaveBetter apart. ",
            "component": "ListIcon2Item"
          },
          {
            "_uid": "002dd2db-0228-4bbe-8e57-861b508b1fbb",
            "text": "Access: Enjoy 24/7 online access to your account and funds.",
            "component": "ListIcon2Item"
          }
        ],
        "title": "",
        "component": "ListIcon2",
        "hasPaddingTop": false,
        "hasPaddingBottom": false
      },
      {
        "_uid": "9e3f428e-b8a7-4a26-b7af-8e40cb6c6ea1",
        "href": "https://app.savebetter.com/auth/register?productId=12D83C14CB9648E0810540A3",
        "kind": "primary",
        "size": "medium",
        "text": "Save Now",
        "target": "_self",
        "justify": "justify-center",
        "rounded": "rounded",
        "disabled": false,
        "component": "button",
        "hasBackground": false,
        "hasPaddingTop": false,
        "backgroundColor": "",
        "hasPaddingBottom": true
      },
      {
        "_uid": "5efead7e-4e2f-4b3a-9622-7e1976d67163",
        "title": "Press",
        "component": "pressRecognition",
        "hasBorder": false,
        "description": "Read what the media is saying about SaveBetter.",
        "hasBackground": true,
        "hasPaddingTop": false,
        "pressReleases": [
          {
            "_uid": "96c2f81e-dcfb-403d-9ba3-f48fa4137c68",
            "link": [
              {
                "url": "https://money.usnews.com/investing/news/articles/2020-09-29/thiel-backed-fintech-deposit-solutions-launches-in-united-states",
                "_uid": "918279e5-3a0b-425b-8e3f-3efe798ea98c",
                "text": "Read article",
                "target": "_blank",
                "component": "link"
              }
            ],
            "text": "Deposit Solutions is launching its savings portal in the United States ",
            "media": [
              {
                "alt": "U.S. News",
                "img": "//a.storyblok.com/f/70134/0x0/4a8aeb0d62/us-news2.svg",
                "_uid": "be6b8d65-f93d-45d4-96dd-ddf668f68cf4",
                "component": "media"
              }
            ],
            "heading": "U.S News",
            "component": "pressRelease"
          },
          {
            "_uid": "cc460b8e-2cca-412a-9ed8-182d48270ab2",
            "link": [
              {
                "url": "https://www.forbes.com/sites/joewalleneurope/2018/11/24/how-can-a-german-open-banking-firm-revolutionize-americas-savings-industry/?sh=7a1c44702e74",
                "_uid": "59e1b6b4-f2c9-4bd5-9a05-172e18ce6881",
                "text": "Read article",
                "target": "_blank",
                "component": "link"
              }
            ],
            "text": "Revolutionary Open Banking pioneer Deposit Solutions has announced that it has …",
            "media": [
              {
                "alt": "",
                "img": "//a.storyblok.com/f/70134/0x0/d347124a8d/forbes2.svg",
                "_uid": "c8a9507b-3de7-4e02-a62b-23e9023f8bc1",
                "component": "media"
              }
            ],
            "heading": "Forbes",
            "component": "pressRelease"
          },
          {
            "_uid": "56e58ba5-447f-4d6f-8d04-8b0560d3f5ba",
            "link": [
              {
                "url": "https://www.reuters.com/article/us-deposit-solutions-usa/thiel-backed-fintech-deposit-solutions-launches-in-united-states-idUSKBN26K2HS",
                "_uid": "92081ff8-5cac-491c-92c9-424e2839245d",
                "text": "Read article",
                "target": "_blank",
                "component": "link"
              }
            ],
            "text": "Thiel-backed fintech Deposit Solutions launches in United States",
            "media": [
              {
                "alt": "Reuters",
                "img": "//a.storyblok.com/f/70134/0x0/a983cc3fed/reuters.svg",
                "_uid": "9bc53f56-ed40-45b6-98d0-13879fcbc3e9",
                "component": "media"
              }
            ],
            "heading": "Reuters",
            "component": "pressRelease"
          },
          {
            "_uid": "d0cbfbac-913c-447b-aa49-03ee1dd20c0c",
            "link": [
              {
                "url": "https://www.gobankingrates.com/retirement/planning/how-to-make-yourself-retirement-millionaire/?utm_campaign=1143100&utm_source=yahoo.com&utm_content=15&utm_medium=rss",
                "_uid": "58cd639a-2bee-4ce6-8cf0-98763a2261c7",
                "text": "Read article",
                "target": "_blank",
                "component": "link"
              }
            ],
            "text": "SaveBetter’s Ben McLaughlin on building up your nest egg",
            "media": [
              {
                "alt": "GOBankingRates",
                "img": "//a.storyblok.com/f/70134/284x36/2622a1aab6/gobankingrates.svg",
                "_uid": "20030240-5836-476f-8189-23b19de3f889",
                "mobile": "",
                "tablet": "",
                "desktop": "",
                "component": "media"
              }
            ],
            "title": "Title",
            "heading": "GOBankingRates",
            "component": "pressRelease",
            "rich_text": {
              "_uid": "102bde82-e999-46b4-a8af-1bb50a780039",
              "type": "doc",
              "content": [
                {
                  "_uid": "cda99c42-f37c-44f4-a825-d38f2f01d78c",
                  "type": "paragraph",
                  "content": [
                    {
                      "_uid": "8c360f8d-9ac5-4892-94f5-069c3ad37ff0",
                      "text": "Finance Yahoo",
                      "type": "text",
                      "marks": [
                        {
                          "_uid": "9822f12c-1160-4d12-bb82-f90845b86727",
                          "type": "bold"
                        }
                      ]
                    }
                  ]
                },
                {
                  "_uid": "7463b4c5-d05e-4b37-b62c-d719a4cbc8fd",
                  "type": "paragraph",
                  "content": [
                    {
                      "_uid": "9241197b-e7e4-4e33-ae1c-4f62143a6dfa",
                      "text": "Thiel-backed fintech Deposit Solutions launches in United States",
                      "type": "text"
                    }
                  ]
                }
              ]
            }
          },
          {
            "_uid": "16947521-4539-4f59-8fd1-d4e931fe94a6",
            "link": [
              {
                "url": "https://www.businessinsider.com/deposit-solutions-will-launch-savings-marketplace-in-us-2020-9",
                "_uid": "a2e630e3-b3c3-46d8-b269-4c1c21d91a8a",
                "text": "Read article",
                "target": "_blank",
                "component": "link"
              }
            ],
            "text": "Deposit Solutions is launching in the US to bring choice and convenience …",
            "media": [
              {
                "alt": "Business Insider",
                "img": "//a.storyblok.com/f/70134/0x0/6e5b606dac/business-insider.svg",
                "_uid": "925ad9cc-18d0-4474-9c19-2711a37c1366",
                "component": "media"
              }
            ],
            "title": "Title",
            "heading": "Business Insider",
            "component": "pressRelease",
            "rich_text": {
              "_uid": "351ed6f9-5b5b-4570-83ed-d4790ed8968e",
              "type": "doc",
              "content": [
                {
                  "_uid": "bf1ae783-e30c-4284-87b2-f3bd6457b3cb",
                  "type": "paragraph",
                  "content": [
                    {
                      "_uid": "4e083b24-03ce-434b-a020-18b6f57f7c32",
                      "text": "Finance Yahoo",
                      "type": "text",
                      "marks": [
                        {
                          "_uid": "6c0fe29c-0ceb-4cb6-8d52-69ea53c4ebe1",
                          "type": "bold"
                        }
                      ]
                    }
                  ]
                },
                {
                  "_uid": "508c57f4-72e2-48ef-9d6c-aa1cfc351422",
                  "type": "paragraph",
                  "content": [
                    {
                      "_uid": "bbaad0ab-b265-4096-80f1-6b406e900146",
                      "text": "Thiel-backed fintech Deposit Solutions launches in United States",
                      "type": "text"
                    }
                  ]
                }
              ]
            }
          },
          {
            "_uid": "e4f71e51-d252-48a0-acf5-6116e5deb21e",
            "link": [
              {
                "url": "https://www.foxbusiness.com/money/how-much-savings-age-40",
                "_uid": "f1ed918f-bff8-4d92-b897-9fd63dbbb1c0",
                "text": "Read article",
                "target": "_blank",
                "component": "link"
              }
            ],
            "text": "SaveBetter President Ben McLaughlin talks about savings",
            "media": [
              {
                "alt": "Fox Business",
                "img": "//a.storyblok.com/f/70134/0x0/ae5695e64d/fox-business-2.svg",
                "_uid": "ab744283-880f-48d9-b78f-71ecabce0735",
                "component": "media"
              }
            ],
            "heading": "Fox Business",
            "component": "pressRelease"
          },
          {
            "_uid": "717dce1a-ab79-48ab-8f8f-b0efc5cb3b47",
            "link": [
              {
                "url": "https://finance.yahoo.com/news/thiel-backed-fintech-deposit-solutions-141039509.html?guccounter=1",
                "_uid": "778b4024-9e59-480b-be5a-29aa4d4710bb",
                "text": "Read article",
                "target": "_blank",
                "component": "link"
              }
            ],
            "text": "Thiel-backed fintech Deposit Solutions launches in United States",
            "media": [
              {
                "alt": "Yahoo Finance",
                "img": "//a.storyblok.com/f/70134/0x0/3b4667baf0/yahoofinance2.svg",
                "_uid": "8eeaee42-1ece-4eda-be66-230ab37ccb53",
                "component": "media"
              }
            ],
            "title": "Title",
            "heading": "Yahoo Finance",
            "component": "pressRelease",
            "rich_text": {
              "_uid": "ab5a173c-7b3e-4b3b-a344-62660c5c2457",
              "type": "doc",
              "content": [
                {
                  "_uid": "276bdaa7-81a8-4d63-8813-ca1366ca0d79",
                  "type": "paragraph",
                  "content": [
                    {
                      "_uid": "2af0e7e0-04a6-42c1-8a4f-4602109f1005",
                      "text": "Finance Yahoo",
                      "type": "text",
                      "marks": [
                        {
                          "_uid": "d2db8a09-1f75-4d7b-94ce-117f8687169e",
                          "type": "bold"
                        }
                      ]
                    }
                  ]
                },
                {
                  "_uid": "2cfb19a4-01ac-4de9-8d0b-c492b4c49967",
                  "type": "paragraph",
                  "content": [
                    {
                      "_uid": "625e4239-1cbb-44a6-9ed7-0f2424992c30",
                      "text": "Thiel-backed fintech Deposit Solutions launches in United States",
                      "type": "text"
                    }
                  ]
                }
              ]
            }
          }
        ],
        "hasPaddingBottom": false
      },
      {
        "_uid": "2d238c72-1cde-4da5-aadb-3b3b3723bed9",
        "link": [
          {
            "url": "/faq",
            "_uid": "fb0f754d-939c-41e6-8c3c-12c95d351313",
            "text": "Read more FAQs",
            "target": "_self",
            "component": "link"
          }
        ],
        "title": "FAQs",
        "component": "faq",
        "hasBorder": false,
        "questions": [
          {
            "_uid": "b4891812-c28b-457c-b30f-681c9f7bd3de",
            "answer": {
              "type": "doc",
              "content": [
                {
                  "type": "paragraph",
                  "content": [
                    {
                      "text": "SaveBetter is a digital platform that gives savers unparalleled access to a variety of deposit products through the convenience of a single account, helping you unlock the growth potential of your cash savings.",
                      "type": "text"
                    }
                  ]
                },
                {
                  "type": "paragraph",
                  "content": [
                    {
                      "text": "SaveBetter customers use the platform to fund federally insured deposit products offered by numerous U.S. banks and credit unions with a wide range of maturities and APYs (annual percentage yield), allowing you to build a savings strategy to suit your earning and liquidity needs.",
                      "type": "text"
                    }
                  ]
                },
                {
                  "type": "paragraph",
                  "content": [
                    {
                      "text": "SaveBetter is not a bank. It provides the digital “storefront” where banks and credit unions can promote their deposit products.",
                      "type": "text"
                    }
                  ]
                },
                {
                  "type": "paragraph",
                  "content": [
                    {
                      "text": "SaveBetter is operated by Raisin US LLC. Raisin US helps banks and credit unions improve their deposit funding by offering national reach for their retail deposit products, and provides savers with better access, more choice and higher convenience when evaluating savings products from FDIC insured banks and NCUA insured credit unions.",
                      "type": "text"
                    }
                  ]
                },
                {
                  "type": "paragraph",
                  "content": [
                    {
                      "text": "Raisin US is a 100% subsidiary of Raisin GmbH, a trailblazer for open banking in the deposits and investments space.",
                      "type": "text"
                    }
                  ]
                }
              ]
            },
            "question": "What is SaveBetter?",
            "component": "faqItem",
            "hasPaddingTop": false,
            "hasPaddingBottom": false
          },
          {
            "_uid": "1b487503-8195-4208-81aa-f04128df9021",
            "answer": {
              "type": "doc",
              "content": [
                {
                  "type": "paragraph",
                  "content": [
                    {
                      "text": "Your SaveBetter account gives you access to savings accounts and certificates of deposit offered by a variety of banks and credit unions with the security of federal deposit insurance. These products include:",
                      "type": "text"
                    }
                  ]
                },
                {
                  "type": "paragraph",
                  "content": [
                    {
                      "text": "High-yield Savings Account (HYSA).",
                      "type": "text",
                      "marks": [{ "type": "bold" }]
                    },
                    {
                      "text": " As its name indicates, this account type functions like a traditional savings account — with typically no restrictions on depositing and withdrawing funds — but earns interest (or dividends in the case of credit union savings products) at rates that are higher than the national average for standard savings accounts.",
                      "type": "text"
                    }
                  ]
                },
                {
                  "type": "bullet_list",
                  "content": [
                    {
                      "type": "list_item",
                      "content": [
                        {
                          "type": "paragraph",
                          "content": [
                            {
                              "text": "Money Market Deposit Account (MMDA). ",
                              "type": "text",
                              "marks": [{ "type": "bold" }]
                            },
                            {
                              "text": "Also known as a money market account or MMA, this type of savings account offers a varying rate that allows you to earn interest (or dividends) on your funds with maximum flexibility for withdrawals. Like a HYSA, an MMDA offers features of a traditional savings account with typically higher returns.",
                              "type": "text"
                            }
                          ]
                        }
                      ]
                    },
                    {
                      "type": "list_item",
                      "content": [
                        {
                          "type": "paragraph",
                          "content": [
                            {
                              "text": "No Penalty CD.",
                              "type": "text",
                              "marks": [{ "type": "bold" }]
                            },
                            {
                              "text": " Through the flexibility of a No Penalty CD, you can lock in a competitive rate for a fixed term with the option to make a full withdrawal at any time beginning seven (7) calendar days after funding without having to pay a penalty for the early termination.",
                              "type": "text"
                            }
                          ]
                        }
                      ]
                    },
                    {
                      "type": "list_item",
                      "content": [
                        {
                          "type": "paragraph",
                          "content": [
                            {
                              "text": "Fixed Term CD.",
                              "type": "text",
                              "marks": [{ "type": "bold" }]
                            },
                            {
                              "text": " With this longstanding savings vehicle, funds are held for a fixed term, and a competitive APY (annual percentage yield) provides safe, predictable earnings. In contrast to No Penalty CDs, typically you are charged a fee if you do not complete the full term of the Fixed Term CD.",
                              "type": "text"
                            }
                          ]
                        }
                      ]
                    }
                  ]
                }
              ]
            },
            "question": "What types of products are available through SaveBetter?",
            "component": "faqItem",
            "hasPaddingTop": false,
            "hasPaddingBottom": false
          },
          {
            "_uid": "d8e9f370-8467-4bce-adfa-73e999819082",
            "answer": {
              "type": "doc",
              "content": [
                {
                  "type": "paragraph",
                  "content": [
                    {
                      "text": "Interest (or dividend in the case of credit union savings products) is compounded daily and posted to your account monthly",
                      "type": "text"
                    }
                  ]
                }
              ]
            },
            "question": "How often is interest compounded?",
            "component": "faqItem",
            "hasPaddingTop": false,
            "hasPaddingBottom": false
          },
          {
            "_uid": "3d97995f-ad14-44e3-bdfc-028bd91e2941",
            "answer": {
              "type": "doc",
              "content": [
                {
                  "type": "paragraph",
                  "content": [
                    { "text": "The short answer is yes! ", "type": "text" }
                  ]
                },
                {
                  "type": "paragraph",
                  "content": [
                    {
                      "text": "For SaveBetter customers who hold savings products offered by one of our partner banks, funds are insured by the FDIC up to the maximum amount in accordance with and as permitted by law at each bank holding their funds. The standard deposit insurance coverage limit is $250,000 per depositor, per FDIC-insured bank, per account ownership category. Ownership categories as defined by the FDIC include single bank accounts (owned by one person/depositor) and joint bank accounts (owned by two or more persons/depositors). Revocable trust accounts and some types of retirement accounts (e.g., IRAs) are among the other ownership categories covered by FDIC insurance. All deposits you have at a bank — whether facilitated through SaveBetter or otherwise — count toward the deposit insurance limit. If funds held at a bank in a certain ownership category exceed the coverage limit, then the amount in excess of the limit will not be insured.",
                      "type": "text"
                    }
                  ]
                },
                {
                  "type": "paragraph",
                  "content": [
                    {
                      "text": "If you hold a savings product offered by one of our partner credit unions — making you a member of the institution — funds are insured by the NCUA through its Share Insurance Fund. According to the NCUA, each credit union member has at least $250,000 in total coverage. The Share Insurance Fund insures individual accounts up to $250,000. Additionally, a member’s interest in all joint accounts combined is insured up to $250,000.",
                      "type": "text"
                    }
                  ]
                }
              ]
            },
            "question": "Does my SaveBetter account have deposit insurance?",
            "component": "faqItem",
            "hasPaddingTop": false,
            "hasPaddingBottom": false
          },
          {
            "_uid": "a0b776a4-5759-4490-b806-ca35b9ebff10",
            "answer": {
              "type": "doc",
              "content": [
                {
                  "type": "paragraph",
                  "content": [
                    {
                      "text": "At SaveBetter, cybersecurity is our priority. SaveBetter is a SOC 2 certified platform, meaning it has been validated by outside auditors across five (5) key information security principles. We also use a variety of measures to protect our customers' data, privacy and transactions, including:",
                      "type": "text"
                    }
                  ]
                },
                {
                  "type": "paragraph",
                  "content": [
                    {
                      "text": "•\tUser authentication.",
                      "type": "text",
                      "marks": [{ "type": "bold" }]
                    },
                    {
                      "text": " The SaveBetter platform uses multi-factor authentication combined with leading authentication technology to validate our customers’ identities.",
                      "type": "text"
                    }
                  ]
                },
                {
                  "type": "paragraph",
                  "content": [
                    {
                      "text": "•\tData encryption.",
                      "type": "text",
                      "marks": [{ "type": "bold" }]
                    },
                    {
                      "text": " Your personal information is encrypted in-transit and at rest using advanced cryptographic security algorithms.",
                      "type": "text"
                    }
                  ]
                },
                {
                  "type": "paragraph",
                  "content": [
                    {
                      "text": "•\tSite protection.",
                      "type": "text",
                      "marks": [{ "type": "bold" }]
                    },
                    {
                      "text": " Cloudflare™ advanced internet protection technologies are implemented to protect SaveBetter.com from malicious actors, botnets and denial of service attacks (DDOS).",
                      "type": "text"
                    }
                  ]
                },
                {
                  "type": "paragraph",
                  "content": [
                    {
                      "text": "•\tMonitoring.",
                      "type": "text",
                      "marks": [{ "type": "bold" }]
                    },
                    {
                      "text": " An always-on information security monitoring platform detects and alerts us to information security events.",
                      "type": "text"
                    }
                  ]
                },
                {
                  "type": "paragraph",
                  "content": [
                    {
                      "text": "•\tAssessments.",
                      "type": "text",
                      "marks": [{ "type": "bold" }]
                    },
                    {
                      "text": " Our platform undergoes vigorous security assessments and testing throughout the lifecycle of application development, from architecture planning to production phases.",
                      "type": "text"
                    }
                  ]
                },
                {
                  "type": "paragraph",
                  "content": [
                    {
                      "text": "Cloudflare™ is a registered trademark of Cloudflare, Inc.",
                      "type": "text"
                    }
                  ]
                }
              ]
            },
            "question": "How does SaveBetter protect my data, privacy, and finances?",
            "component": "faqItem",
            "hasPaddingTop": false,
            "hasPaddingBottom": false
          },
          {
            "_uid": "d8f67c05-4d05-463c-954d-72423e103eff",
            "answer": {
              "type": "doc",
              "content": [
                {
                  "type": "paragraph",
                  "content": [
                    {
                      "text": "A. Check out our savings marketplace and choose a product in which you would like to deposit money. ",
                      "type": "text"
                    }
                  ]
                },
                {
                  "type": "paragraph",
                  "content": [
                    {
                      "text": "B. Create your username and password.",
                      "type": "text"
                    }
                  ]
                },
                {
                  "type": "paragraph",
                  "content": [
                    {
                      "text": "C. Complete an application and, after successful identity verification, link a bank account from which to fund your first savings product.",
                      "type": "text"
                    }
                  ]
                },
                {
                  "type": "paragraph",
                  "content": [
                    {
                      "text": "D. Start earning interest as soon as your money is received by the bank or credit union offering the savings product you selected.",
                      "type": "text"
                    }
                  ]
                },
                {
                  "type": "paragraph",
                  "content": [
                    {
                      "text": "Any questions or concerns? Email us at service@SaveBetter.com.\"",
                      "type": "text"
                    }
                  ]
                }
              ]
            },
            "question": "How do I open a SaveBetter account?",
            "component": "faqItem",
            "hasPaddingTop": false,
            "hasPaddingBottom": false
          },
          {
            "_uid": "d0b0172b-6406-4269-80ed-dbac790a3602",
            "answer": {
              "type": "doc",
              "content": [
                {
                  "type": "paragraph",
                  "content": [
                    {
                      "text": "All deposits and withdrawals are completed within one to three (1-3) business days. After the initial deposit a withdrawals limitation for the first few business days may exist.",
                      "type": "text"
                    }
                  ]
                },
                {
                  "type": "paragraph",
                  "content": [
                    {
                      "text": "Business days are Monday through Friday excluding U.S. bank holidays.",
                      "type": "text"
                    }
                  ]
                }
              ]
            },
            "question": "How long does it take to deposit my money? What about withdrawals?",
            "component": "faqItem",
            "hasPaddingTop": false,
            "hasPaddingBottom": false
          },
          {
            "_uid": "c5014185-9348-4fa7-9ebd-9df922b0b3fe",
            "answer": {
              "type": "doc",
              "content": [
                {
                  "type": "paragraph",
                  "content": [
                    {
                      "text": "For products offered by banks, all necessary registration is handled when you become a SaveBetter customer. One of the many benefits of our platform is that you can open a single account and earn competitive interest rates from banks in the SaveBetter network. When you select and fund a savings product offered by a credit union, there is an additional step of becoming a member. SaveBetter makes that process quick, easy and free. You still have one SaveBetter login and can view all your savings products in one convenient dashboard.",
                      "type": "text"
                    }
                  ]
                }
              ]
            },
            "question": "Will I need to register for accounts at the financial institutions where I've chosen to deposit my money? Am I a customer of those banks or a member of those credit unions?",
            "component": "faqItem",
            "hasPaddingTop": false,
            "hasPaddingBottom": false
          },
          {
            "_uid": "be5e1fa3-f1dd-41c1-90b3-614f5213aeeb",
            "answer": {
              "type": "doc",
              "content": [
                {
                  "type": "paragraph",
                  "content": [
                    {
                      "text": "The current APY for your savings products can always be viewed on the Account Overview page when you are logged in to SaveBetter. This information also appears on monthly statements.",
                      "type": "text"
                    }
                  ]
                }
              ]
            },
            "question": "Where can I view my savings products’ Annual Percentage Yield (APY)?",
            "component": "faqItem",
            "hasPaddingTop": false,
            "hasPaddingBottom": false
          },
          {
            "_uid": "97a6da2d-56cb-46b2-95bc-8002289d4969",
            "answer": {
              "type": "doc",
              "content": [
                {
                  "type": "paragraph",
                  "content": [
                    {
                      "text": "You cannot currently link your SaveBetter account to a third-party app, but we may offer this feature in the future.  For now, you will not be able to link your selected savings product to a third-party app even if the bank offering that product does so outside of the SaveBetter platform.",
                      "type": "text"
                    }
                  ]
                }
              ]
            },
            "question": "Can I link my SaveBetter account or selected savings product to a third-party app? ",
            "component": "faqItem",
            "hasPaddingTop": false,
            "hasPaddingBottom": false
          }
        ],
        "hasBackground": true,
        "hasPaddingTop": false,
        "hasPaddingBottom": true
      }
    ],
    "logo": [
      {
        "alt": "Blue FCU logo",
        "img": "//a.storyblok.com/f/70134/300x103/a6f999f301/bfcu_logo_horizontal_white.svg",
        "_uid": "d68b366b-d683-4b17-8e4c-7e2758202185",
        "mobile": "",
        "tablet": "",
        "desktop": "",
        "component": "media"
      }
    ],
    "title": "9 Month Share Certificate",
    "layout": {
      "id": "a7887b35-4fec-4639-a28f-c4afd03fa845",
      "url": "",
      "anchor": "",
      "linktype": "story",
      "fieldtype": "multilink",
      "cached_url": "layouts/explore-product-no-nav-layout"
    },
    "metadata": {
      "_uid": "2e4f923e-6152-4fb4-89e3-733bc207561b",
      "title": "Blue Federal Credit Union: 9 Month Certificate | SaveBetter",
      "plugin": "meta-fields",
      "description": "View 9 Month Certificate details from Blue Federal Credit Union."
    },
    "component": "page",
    "isTextWhite": true,
    "headerOutline": [
      {
        "_uid": "ed9fc044-7de5-4e86-800d-8735f0d6b5c8",
        "title": "Blue Federal Credit Union 9 Month Share Certificate",
        "bankCode": "",
        "component": "productOfferTable",
        "hasBorder": false,
        "productId": "12D83C14CB9648E0810540A3",
        "hasBackground": false,
        "hasPaddingTop": false,
        "featuredProducts": [],
        "hasPaddingBottom": false,
        "showSelectedProductTypes": ["HIGH_YIELD_CD"],
        "hasFinancialInstitutionsDropdown": false
      }
    ],
    "disableIndexing": false,
    "showBreadcrumbs": false,
    "headerBackground": [
      {
        "alt": "Couple on beach",
        "img": "//a.storyblok.com/f/180759/2560x800/12a9a697a2/bluefcu.webp",
        "_uid": "0b4f90f3-de49-4fcf-8978-e9142100e13b",
        "mobile": "",
        "tablet": "",
        "desktop": "",
        "component": "media"
      }
    ],
    "introductionLink": [
      {
        "url": "https://app.savebetter.com/auth/register?productId=12D83C14CB9648E0810540A3",
        "_uid": "c85d6169-3722-4ecb-b1b8-44835367796e",
        "text": "Save now",
        "target": "_self",
        "component": "link"
      }
    ],
    "introductionList": [
      {
        "_uid": "52b869f2-731a-4c04-8878-acc0d38838e0",
        "text": "Federally insured by NCUA. No fees. $1 minimum to open.",
        "component": "introductionListItem"
      },
      {
        "_uid": "f5de6127-ea69-4fc5-b775-3559eb9812d9",
        "text": "24/7 online access to funds.",
        "component": "introductionListItem"
      },
      {
        "_uid": "fb161d16-7244-417c-bb9f-44dac1950f57",
        "text": "{12D83C14CB9648E0810540A3-APY} APY 9 month share certificate, {12D83C14CB9648E0810540A3-APY}{NCUA-9M-CD-10K} higher than national average. ",
        "component": "introductionListItem"
      }
    ],
    "isLinkSecondaryColor": true,
    "introductionDescription": ""
  },
  "slug": "9-month-share-certificate",
  "full_slug": "credit-unions/blue-federal-credit-union/9-month-share-certificate",
  "sort_by_date": null,
  "position": 0,
  "tag_list": [],
  "is_startpage": false,
  "parent_id": 290605101,
  "meta_data": null,
  "group_id": "c86f8b18-c15f-414a-83c6-4960886c98df",
  "first_published_at": "2022-10-20T15:23:37.822Z",
  "release_id": null,
  "lang": "default",
  "path": null,
  "alternates": [],
  "default_full_slug": null,
  "translated_slugs": null
}
