{
  "name": "Base layout credit union",
  "created_at": "2023-04-12T09:56:25.375Z",
  "published_at": "2023-01-03T15:13:23.653Z",
  "id": 290604965,
  "uuid": "71fd8da6-393c-478b-8c57-b9e24a7412b2",
  "content": {
    "_uid": "6005f6fb-409f-48ab-916b-ed233a53557e",
    "footer": [
      {
        "_uid": "b6818a61-a541-4bd2-8bb1-d900a9ee8b95",
        "text": {
          "type": "doc",
          "content": [
            {
              "type": "paragraph",
              "content": [
                {
                  "text": "The SaveBetter name and logo are trademarks of Raisin US LLC.  The Raisin Solutions US name and logo are trademarks of Raisin GmbH, used with permission.  ",
                  "type": "text"
                }
              ]
            },
            {
              "type": "paragraph",
              "content": [
                {
                  "text": "© 2023 Raisin US LLC.  All rights reserved.",
                  "type": "text"
                }
              ]
            },
            {
              "type": "paragraph",
              "content": [
                {
                  "text": "APY means Annual Percentage Yield. APY is accurate as of May 3, 2022. Interest rate may change after initial deposit. Minimum opening deposit is $1.00.",
                  "type": "text"
                }
              ]
            },
            {
              "type": "paragraph",
              "content": [
                {
                  "text": "Customer funds are held in various custodial deposit accounts.  Each customer authorizes the Custodian Bank to hold the customer’s funds in such accounts, in a custodial capacity, in order to facilitate the customer’s deposits to and withdrawals from the various bank and credit union products that the customer requests through SaveBetter.com. The Custodian Bank does not establish the terms of the bank or credit union products and provides no advice to customers about bank or credit union products offered through SaveBetter.com. Central Bank of Kansas City, Member FDIC, d.b.a. Central Payments is the Service Bank. Lewis and Clark Bank is the Custodian Bank.",
                  "type": "text"
                }
              ]
            }
          ]
        },
        "links": [
          {
            "url": "/about-us",
            "_uid": "a6a0c558-b6c2-4b55-a8e7-61b8851c0ea7",
            "text": "About us",
            "target": "_self",
            "component": "link"
          },
          {
            "url": "/explore-products",
            "_uid": "e4bc083d-5b53-463f-8496-c3ac88f5dc61",
            "text": "Explore products",
            "target": "_self",
            "component": "link"
          },
          {
            "url": "/faq",
            "_uid": "184e2eac-7cd9-4bda-9926-d52cb0dd0ff8",
            "text": "Help",
            "target": "_self",
            "component": "link"
          },
          {
            "url": "https://dsusprd01pubassets.blob.core.windows.net/ds-us/privacy_policy.pdf",
            "_uid": "bb471518-f37e-4bcb-abf9-ea890f5544b7",
            "text": "Privacy policy",
            "target": "_blank",
            "component": "link"
          },
          {
            "url": "https://dsusprd01pubassets.blob.core.windows.net/ds-us/cookie_policy.pdf",
            "_uid": "e356ee8e-0b48-4690-a110-1a4e0f66b851",
            "text": "Cookie policy",
            "target": "_blank",
            "component": "link"
          },
          {
            "url": "https://dsusprd01pubassets.blob.core.windows.net/ds-us/terms_and_conditions.pdf",
            "_uid": "ad6e4217-e26b-48a1-98fa-3daff79dd6e0",
            "text": "Terms and conditions",
            "target": "_blank",
            "component": "link"
          },
          {
            "url": "https://dsusprd01pubassets.blob.core.windows.net/ds-us/savebetter_terms_of_service_combined.pdf",
            "_uid": "5b96ca2b-482c-4807-a71c-7bc3c9a63e2c",
            "text": "Terms of Service",
            "target": "_blank",
            "component": "link"
          }
        ],
        "component": "footerv2",
        "socialBox": [
          {
            "_uid": "ef8edebb-79c9-44eb-bf99-2d74bedffa65",
            "links": [
              {
                "url": "https://www.facebook.com/savebetterus",
                "_uid": "41a3c052-1317-4b7d-9d85-7c3d6f38bccc",
                "icon": ["Facebook"],
                "target": "_blank",
                "component": "socialBoxLink"
              },
              {
                "url": "https://www.linkedin.com/showcase/savebetter",
                "_uid": "4d7e3a15-268a-4af3-a11a-0c3065abeae7",
                "icon": ["LinkedIn"],
                "target": "_blank",
                "component": "socialBoxLink"
              }
            ],
            "title": "Let's connect",
            "component": "socialBox"
          }
        ],
        "contactBar": [
          {
            "_uid": "12e7de9e-b9c1-4b74-85d2-40d7677ff434",
            "email": "service@savebetter.com",
            "component": "contactBar",
            "phoneNumber": "844-994-EARN (3276)",
            "workingHours": "Monday to Friday from 9:00 a.m. - 4:00 p.m. ET"
          }
        ]
      }
    ],
    "header": [
      {
        "_uid": "a9e465d5-03bd-4697-9522-96c12ac60bc5",
        "logoLink": {
          "id": "72616cf5-3250-4616-8bef-a8229635658b",
          "url": "",
          "linktype": "story",
          "fieldtype": "multilink",
          "cached_url": "home"
        },
        "component": "navigationV1",
        "logoImage": [
          {
            "alt": "SaveBetter by Raisin",
            "img": "//a.storyblok.com/f/70134/854x194/031147ffb0/savebetter_by_raisin.png",
            "_uid": "979cf48a-8f6a-49c4-afa1-d1a1a01a52c6",
            "mobile": "",
            "tablet": "",
            "desktop": "",
            "component": "media"
          }
        ],
        "primaryButton": [
          {
            "url": "https://app.savebetter.com/auth/login",
            "_uid": "d387810d-32bc-4048-8095-0dc9bcda7322",
            "text": "Log In",
            "target": "_blank",
            "component": "link"
          }
        ],
        "secondaryButton": [],
        "navigationElements": [
          {
            "_uid": "4ea523e6-9699-4cf7-a235-506d353851ae",
            "link": {
              "id": "89c66cdc-a0f7-49ab-869e-54d100b0ebf7",
              "url": "",
              "linktype": "story",
              "fieldtype": "multilink",
              "cached_url": "how-it-works"
            },
            "label": "How it works",
            "component": "navigationElement",
            "navigationElements": []
          },
          {
            "_uid": "b3a57df3-23db-41f1-abf9-20dc2387931d",
            "link": {
              "id": "b8f225b9-fe65-4fbf-b968-64e27f9ba665",
              "url": "",
              "linktype": "story",
              "fieldtype": "multilink",
              "cached_url": "explore-products"
            },
            "label": "Products",
            "component": "navigationElement",
            "navigationElements": [
              {
                "_uid": "7eaa8271-bf7d-44fb-8f79-95db162725af",
                "link": {
                  "id": "87acc204-a6bd-4f75-9766-5685ef4d142f",
                  "url": "",
                  "linktype": "story",
                  "fieldtype": "multilink",
                  "cached_url": "savings-accounts/"
                },
                "label": "Savings Accounts",
                "component": "navigationElement",
                "navigationElements": []
              },
              {
                "_uid": "380fc79b-6804-4db6-8be6-4bf74a8449fc",
                "link": {
                  "id": "95da40bd-8057-4ab6-aa57-5f547bd07ae8",
                  "url": "",
                  "linktype": "story",
                  "fieldtype": "multilink",
                  "cached_url": "money-market-accounts/"
                },
                "label": "Money Market Accounts",
                "component": "navigationElement",
                "navigationElements": []
              },
              {
                "_uid": "75715439-ac06-4b6b-b3e2-36adc7bfd2d5",
                "link": {
                  "id": "1b1ffcd1-4972-48ca-84bc-87c614320605",
                  "url": "",
                  "linktype": "story",
                  "fieldtype": "multilink",
                  "cached_url": "cd-accounts/"
                },
                "label": "CD Accounts",
                "component": "navigationElement",
                "navigationElements": []
              },
              {
                "_uid": "b56b9cf0-5834-4667-a347-264c2f63f366",
                "link": {
                  "id": "b8f225b9-fe65-4fbf-b968-64e27f9ba665",
                  "url": "",
                  "linktype": "story",
                  "fieldtype": "multilink",
                  "cached_url": "explore-products"
                },
                "label": "All Products",
                "component": "navigationElement",
                "navigationElements": []
              }
            ]
          },
          {
            "_uid": "28591762-bf0b-4a0c-a9a6-d9f70005729d",
            "link": {
              "id": "5aa34857-d332-4e0a-855e-d452fdd838f0",
              "url": "",
              "linktype": "story",
              "fieldtype": "multilink",
              "cached_url": "about-us"
            },
            "label": "About",
            "component": "navigationElement",
            "navigationElements": [
              {
                "_uid": "d414f80d-e14a-45ee-9da4-4f430357d27c",
                "link": {
                  "id": "5aa34857-d332-4e0a-855e-d452fdd838f0",
                  "url": "",
                  "linktype": "story",
                  "fieldtype": "multilink",
                  "cached_url": "about-us"
                },
                "label": "About SaveBetter",
                "component": "navigationElement",
                "navigationElements": []
              },
              {
                "_uid": "103f36a4-4134-424f-be6e-0755e6c5f4e2",
                "link": {
                  "id": "41bc48fc-0820-4d3c-b426-2c9047ff8b7d",
                  "url": "",
                  "linktype": "story",
                  "fieldtype": "multilink",
                  "cached_url": "banks/"
                },
                "label": "Our Partner Banks",
                "component": "navigationElement",
                "navigationElements": []
              },
              {
                "_uid": "f341520e-dbc8-4e60-a8f4-237f949d9b0d",
                "link": {
                  "id": "626aaf5d-c47b-4cc2-bbdd-6241596b0145",
                  "url": "",
                  "linktype": "story",
                  "fieldtype": "multilink",
                  "cached_url": "credit-unions/"
                },
                "label": "Our Partner Credit Unions",
                "component": "navigationElement",
                "navigationElements": []
              },
              {
                "_uid": "3cba1e17-4aa7-48c5-a7b3-a9c15ec63f41",
                "link": {
                  "id": "",
                  "url": "credit-unions/credit-unions-vs-banks",
                  "linktype": "url",
                  "fieldtype": "multilink",
                  "cached_url": "credit-unions/credit-unions-vs-banks"
                },
                "label": "Banks vs. Credit Unions",
                "component": "navigationElement",
                "navigationElements": []
              },
              {
                "_uid": "7c1a978d-25e2-4583-a10e-8b1f41336153",
                "link": {
                  "id": "",
                  "url": "deposit-insurance",
                  "linktype": "url",
                  "fieldtype": "multilink",
                  "cached_url": "deposit-insurance"
                },
                "label": "Deposit Insurance",
                "component": "navigationElement",
                "navigationElements": []
              }
            ]
          },
          {
            "_uid": "35496dd6-60fd-4c4b-b697-9cbdf036f71a",
            "link": {
              "id": "26103454-48c6-4c87-a2c6-e1f1d6eff911",
              "url": "",
              "linktype": "story",
              "fieldtype": "multilink",
              "cached_url": "faq"
            },
            "label": "FAQ",
            "component": "navigationElement",
            "navigationElements": []
          },
          {
            "_uid": "44a0d962-9f2a-406d-838c-6ee93cd1c688",
            "link": {
              "id": "",
              "url": "education-center",
              "linktype": "url",
              "fieldtype": "multilink",
              "cached_url": "education-center"
            },
            "label": "Education center",
            "component": "navigationElement",
            "navigationElements": []
          }
        ]
      }
    ],
    "component": "global",
    "hasNavigation": true
  },
  "slug": "base-layout-credit-union",
  "full_slug": "layouts/base-layout-credit-union",
  "sort_by_date": null,
  "position": 10,
  "tag_list": [],
  "is_startpage": false,
  "parent_id": 290604865,
  "meta_data": null,
  "group_id": "c8166698-87db-4738-83c6-91882a5d081c",
  "first_published_at": "2020-02-18T16:21:36.000Z",
  "release_id": null,
  "lang": "default",
  "path": null,
  "alternates": [],
  "default_full_slug": null,
  "translated_slugs": null
}
