{
  "name": "explore product no nav layout",
  "created_at": "2023-04-12T09:56:25.375Z",
  "published_at": "2023-02-23T17:56:38.766Z",
  "id": 290604969,
  "uuid": "a7887b35-4fec-4639-a28f-c4afd03fa845",
  "content": {
    "_uid": "6005f6fb-409f-48ab-916b-ed233a53557e",
    "text": { "type": "doc", "content": [{ "type": "paragraph" }] },
    "links": [],
    "footer": [
      {
        "_uid": "b6818a61-a541-4bd2-8bb1-d900a9ee8b95",
        "text": {
          "type": "doc",
          "content": [
            {
              "type": "paragraph",
              "content": [
                {
                  "text": "The SaveBetter name and logo are trademarks of Raisin US LLC. The Raisin Solutions US name and logo are trademarks of Raisin GmbH, used with permission. All other trademarks, logos,  marks, and brand names are the property of their respective owners - used with permission",
                  "type": "text"
                }
              ]
            },
            {
              "type": "paragraph",
              "content": [
                {
                  "text": "© 2023 Raisin US LLC.  All rights reserved.",
                  "type": "text"
                }
              ]
            },
            {
              "type": "paragraph",
              "content": [
                {
                  "text": "APY means Annual Percentage Yield. APY is accurate as of {todayDate}. Interest rate may change after initial deposit. Minimum opening deposit is $1.00.",
                  "type": "text"
                }
              ]
            },
            {
              "type": "paragraph",
              "content": [
                {
                  "text": "Customer funds are held in various custodial deposit accounts.  Each customer authorizes the Custodian Bank to hold the customer’s funds in such accounts, in a custodial capacity, in order to facilitate the customer’s deposits to and withdrawals from the various bank and credit union products that the customer requests through SaveBetter.com. The Custodian Bank does not establish the terms of the bank or credit union products and provides no advice to customers about bank or credit union products offered through SaveBetter.com. Central Bank of Kansas City, Member FDIC, d.b.a. Central Payments is the Service Bank. Lewis and Clark Bank is the Custodian Bank.",
                  "type": "text"
                }
              ]
            }
          ]
        },
        "links": [
          {
            "url": "/about-us",
            "_uid": "a6a0c558-b6c2-4b55-a8e7-61b8851c0ea7",
            "text": "About us",
            "target": "_self",
            "component": "link"
          },
          {
            "url": "/explore-products",
            "_uid": "e4bc083d-5b53-463f-8496-c3ac88f5dc61",
            "text": "Explore products",
            "target": "_self",
            "component": "link"
          },
          {
            "url": "/faq",
            "_uid": "184e2eac-7cd9-4bda-9926-d52cb0dd0ff8",
            "text": "Help",
            "target": "_self",
            "component": "link"
          },
          {
            "url": "https://assets-development.savebetter.com/raisin-us/privacy_policy.pdf",
            "_uid": "bb471518-f37e-4bcb-abf9-ea890f5544b7",
            "text": "Privacy policy",
            "target": "_blank",
            "component": "link"
          },
          {
            "url": "https://assets-development.savebetter.com/raisin-us/cookie_policy.pdf",
            "_uid": "e356ee8e-0b48-4690-a110-1a4e0f66b851",
            "text": "Cookie policy",
            "target": "_blank",
            "component": "link"
          },
          {
            "url": "https://assets-development.savebetter.com/raisin-us/terms_and_conditions.pdf",
            "_uid": "ad6e4217-e26b-48a1-98fa-3daff79dd6e0",
            "text": "Terms and conditions",
            "target": "_blank",
            "component": "link"
          },
          {
            "url": "https://assets-development.savebetter.com/raisin-us/savebetter_terms_of_service_combined.pdf",
            "_uid": "e5bd3949-c7ff-431d-bdce-c9baab59f6b0",
            "text": "Terms of Service",
            "target": "_blank",
            "component": "link"
          }
        ],
        "component": "footerv2",
        "socialBox": [
          {
            "_uid": "ef8edebb-79c9-44eb-bf99-2d74bedffa65",
            "links": [
              {
                "url": "https://www.facebook.com/savebetterus",
                "_uid": "41a3c052-1317-4b7d-9d85-7c3d6f38bccc",
                "icon": ["Facebook"],
                "target": "_blank",
                "component": "socialBoxLink"
              },
              {
                "url": "https://www.linkedin.com/showcase/savebetter",
                "_uid": "4d7e3a15-268a-4af3-a11a-0c3065abeae7",
                "icon": ["LinkedIn"],
                "target": "_blank",
                "component": "socialBoxLink"
              }
            ],
            "title": "Let's connect",
            "component": "socialBox"
          }
        ],
        "contactBar": [
          {
            "_uid": "12e7de9e-b9c1-4b74-85d2-40d7677ff434",
            "email": "service@savebetter.com",
            "component": "contactBar",
            "phoneNumber": "844-994-EARN (3276)",
            "workingHours": "Monday to Friday from 9:00 a.m. - 4:00 p.m. ET"
          }
        ]
      }
    ],
    "header": [
      {
        "_uid": "54db0fb6-f695-4184-a716-802cf5f84d7b",
        "logoLink": {
          "id": "",
          "url": "",
          "linktype": "story",
          "fieldtype": "multilink",
          "cached_url": ""
        },
        "component": "navigationV1",
        "logoImage": [
          {
            "alt": "SaveBetter by Raisin",
            "img": "//a.storyblok.com/f/70134/854x194/031147ffb0/savebetter_by_raisin.png",
            "_uid": "fcf2ef35-ccf8-4131-9b84-e1fdb302be15",
            "mobile": "",
            "tablet": "",
            "desktop": "",
            "component": "media"
          }
        ],
        "primaryButton": [],
        "secondaryButton": [],
        "navigationElements": []
      }
    ],
    "logoLink": {
      "id": "",
      "url": "",
      "linktype": "story",
      "fieldtype": "multilink",
      "cached_url": ""
    },
    "component": "global",
    "logoImage": [],
    "socialBox": [],
    "contactBar": [],
    "hasNavigation": false,
    "primaryButton": [],
    "secondaryButton": [],
    "navigationElements": []
  },
  "slug": "explore-product-no-nav-layout",
  "full_slug": "layouts/explore-product-no-nav-layout",
  "sort_by_date": null,
  "position": 10,
  "tag_list": [],
  "is_startpage": false,
  "parent_id": 290604865,
  "meta_data": null,
  "group_id": "972af80d-c52e-4b43-906e-54a6bc1d2ce7",
  "first_published_at": "2020-02-18T16:21:36.000Z",
  "release_id": null,
  "lang": "default",
  "path": null,
  "alternates": [],
  "default_full_slug": null,
  "translated_slugs": null
}
