{
  "name": "Liberty Savings Bank High-yield Savings Account",
  "created_at": "2023-04-12T09:56:30.401Z",
  "published_at": "2023-02-23T18:21:49.137Z",
  "id": 290605092,
  "uuid": "29a419d9-8934-4673-b3a2-0b694c6cfe68",
  "content": {
    "_uid": "1cdd7225-a154-4483-9fd5-13858a152f8b",
    "body": [
      {
        "_uid": "51d20221-7fc1-4c60-8a05-fbb2c4807ec7",
        "title": "Earn {61f19679dd17cd00017743be-APY}{FDIC-S} times the national average APY",
        "component": "productComparison",
        "buttonLink": "https://app.savebetter.com/auth/register?productId=61f19679dd17cd00017743be",
        "layoutType": "col",
        "productVar": "{61f19679dd17cd00017743be-product}",
        "bankHexColor": "#d8393d",
        "apyTitleColor": "text-white",
        "hasBackground": false,
        "hasPaddingTop": false,
        "comparisonTitle": "Don't settle for average rates",
        "hasPaddingBottom": false,
        "nationalAverageVar": "{FDIC-S}",
        "comparisonDescription": "Receive a competitive rate with the ability to withdraw or add funds whenever you like. Flexibility to withdraw as much as you want, whenever you want; there are no restrictions.",
        "nationalAverageDisclaimer": "Non-jumbo deposits under $100,000",
        "nationalAverageDescription": "Savings Accounts"
      },
      {
        "_uid": "fba42cd5-694e-46a4-8409-f708ffa62de1",
        "link": [
          {
            "url": "https://app.savebetter.com/auth/register?productId=61f19679dd17cd00017743be",
            "_uid": "5c5c1097-12ce-4480-9013-a91d2bba7c72",
            "text": "Start Saving",
            "target": "_self",
            "component": "link"
          }
        ],
        "media": [
          {
            "alt": "Mother and baby girl having fun",
            "img": "//a.storyblok.com/f/70134/585x364/04c4ea51a9/liberty-savings-bank-about.jpg",
            "_uid": "247a388d-12d6-4447-81fd-c6b612176517",
            "mobile": "",
            "tablet": "",
            "desktop": "",
            "component": "media"
          }
        ],
        "title": "This deposit product is offered through SaveBetter by Liberty Savings Bank",
        "content": [
          {
            "_uid": "126201de-e351-4366-93db-62ff23602e5d",
            "content": {
              "type": "doc",
              "content": [
                {
                  "type": "paragraph",
                  "content": [
                    {
                      "text": "Founded in 1889, Liberty Savings Bank is a family-owned community bank headquartered in Ohio with branches in the Sarasota-Manatee County area of Florida. ",
                      "type": "text"
                    }
                  ]
                },
                {
                  "type": "paragraph",
                  "content": [
                    {
                      "text": "Liberty is solid. It is an FDIC member bank and “Excellent and Recommended” by Bauer Financial. Loved by its customers, Liberty has received hundreds of Google My Business five-star reviews for outstanding service and products, including saving accounts, and CDs.",
                      "type": "text"
                    }
                  ]
                },
                {
                  "type": "paragraph",
                  "content": [
                    {
                      "text": "Community minded, Liberty supports Habitat for Humanity and its mission of building homes for people in need.",
                      "type": "text"
                    }
                  ]
                }
              ]
            },
            "heading": "About Liberty Savings Bank",
            "component": "mediaBlockContent"
          }
        ],
        "component": "mediaSection2",
        "hasBorder": false,
        "hasBackground": false,
        "hasPaddingTop": true,
        "hasPaddingBottom": true
      },
      {
        "_uid": "6342f5ea-570e-4a95-a361-a49a6378b9e5",
        "cards": [
          {
            "_uid": "2df2b687-90fa-4d58-92a9-9a06426e5aac",
            "link": [
              {
                "url": "https://www.fdic.gov/resources/deposit-insurance/understanding-deposit-insurance/",
                "_uid": "5349f904-226f-410b-8622-8ec4ab67465e",
                "text": "Click to learn more about FDIC insurance",
                "target": "_blank",
                "component": "link"
              }
            ],
            "media": [
              {
                "alt": "FDIC logo",
                "img": "//a.storyblok.com/f/70134/720x285/5e201cdf81/us-fdic-logo.svg",
                "_uid": "8ca8f5a6-4fce-4aee-85ef-c8a888add8d0",
                "mobile": "",
                "tablet": "",
                "desktop": "",
                "component": "media"
              }
            ],
            "title": "FDIC",
            "component": "card",
            "paragraph": "Liberty Savings Bank is a member of the FDIC. Deposits in Liberty Savings Bank are insured by the FDIC up to the limits of federal law. The standard insurance amount is $250,000 per depositor, per insured bank, for each deposit account ownership category."
          },
          {
            "_uid": "0c6bf3f2-04b7-4782-b161-3dbeeb94d94d",
            "link": [
              {
                "url": "https://www.savebetter.com/blogs/savebetter-data-protection",
                "_uid": "2fe88d3a-6615-45c4-9926-64e4267b071a",
                "text": "Click to learn more about SOC 2 certification",
                "target": "_blank",
                "component": "link"
              }
            ],
            "media": [
              {
                "alt": "SOC2 logo",
                "img": "//a.storyblok.com/f/70134/250x250/177e6a0e23/soc-service-certifications.png",
                "_uid": "0e98c352-7d84-436a-9c8d-e861eea062d6",
                "mobile": "",
                "tablet": "",
                "desktop": "",
                "component": "media"
              }
            ],
            "title": "Cybersecurity is a top priority at SaveBetter",
            "component": "card",
            "paragraph": "We invest in a variety of technologies to protect our customer’s data, privacy and transactions. These include Multi-Factor authentication, encryption, and Cloudflare advanced internet protection and monitoring.  We are a SOC 2 certified organization, which means we have met the requirements outlined by the American Institute of Certified Public Accountants (AICPA) to ensure that we have the controls in place to keep customers' data secure and private. "
          }
        ],
        "title": "Security Is Our Top Priority",
        "component": "cardList1",
        "hasBorder": false,
        "description": "",
        "hasBackground": true,
        "hasPaddingTop": true,
        "hasPaddingBottom": true
      },
      {
        "_uid": "1d75f981-8af1-43c0-add8-0196e91f35d2",
        "media": [
          {
            "alt": "Family enjoying outdoor time",
            "img": "//a.storyblok.com/f/70134/720x381/966c1d5c5f/family-ourdoor.jpg",
            "_uid": "527f15d9-062b-40f9-90bb-984024ed5a4e",
            "mobile": "",
            "tablet": "",
            "desktop": "",
            "component": "media"
          }
        ],
        "title": "Liberty Savings Bank, Powered by SaveBetter",
        "button": [],
        "component": "mediaSection4",
        "hasBorder": false,
        "description": "Liberty Savings Bank uses the secure SaveBetter platform to offer savings products to savers nationwide. Customers open accounts at SaveBetter.com, and the platform manages all aspects of the products offered by Liberty Savings Bank, including a customer's deposits and withdrawals, statements and any customer service needs. In simple terms, SaveBetter provides you exclusive access to a special selection of Liberty Savings Bank products. Best of all, SaveBetter is completely free!",
        "hasBackground": false,
        "hasPaddingTop": true,
        "hasPaddingBottom": false
      },
      {
        "_uid": "a13c046d-58d3-48ae-8062-2f819ace81d6",
        "items": [
          {
            "_uid": "cf515b85-7688-46de-8f6b-4e08f2ef81e2",
            "text": "Security: Funds deposited into any of the products accessible through SaveBetter are held by federally insured institutions. We use a host of cybersecurity measures to protect your funds and sensitive information. ",
            "component": "ListIcon2Item"
          },
          {
            "_uid": "4fd9d879-91e3-446b-a75a-f83286e6252f",
            "text": "Choice: Savings products from our network of financial institutions offer flexible terms and some of the most competitive interest rates. You can easily find the right product or mix of products for you.",
            "component": "ListIcon2Item"
          },
          {
            "_uid": "08e736c6-35a9-4ba4-bdc7-b35c410a2471",
            "text": "Convenience: One account to hold all your deposit products. Simplified statements. Easy access to manage your funds – all through a streamlined digital platform.",
            "component": "ListIcon2Item"
          },
          {
            "_uid": "71f21e47-91bb-4fd0-8187-40c9cd4275e8",
            "text": "Service: A supportive, accessible, responsive customer service team based in New York, NY, sets SaveBetter apart. ",
            "component": "ListIcon2Item"
          },
          {
            "_uid": "8a263924-47a1-4084-836c-3a38779f2795",
            "text": "Access: Enjoy 24/7 online access to your account and funds.   ",
            "component": "ListIcon2Item"
          }
        ],
        "title": "",
        "component": "ListIcon2",
        "hasPaddingTop": false,
        "hasPaddingBottom": false
      },
      {
        "_uid": "65eb7e8f-d426-4a30-b2b2-41af49fd1a25",
        "href": "https://app.savebetter.com/auth/register?productId=61f19679dd17cd00017743be",
        "kind": "primary",
        "size": "medium",
        "text": "Start saving",
        "target": "_self",
        "justify": "justify-center",
        "rounded": "rounded",
        "disabled": false,
        "component": "button",
        "hasBackground": false,
        "hasPaddingTop": false,
        "hasPaddingBottom": true
      },
      {
        "_uid": "74783f81-e9de-40d7-bc38-706a02395be9",
        "kind": "2",
        "text": "Open an Account in 3-5 Minutes",
        "block": "",
        "color": "text-black",
        "level": "1",
        "component": "heading",
        "hasPaddingTop": true,
        "hasPaddingBottom": false
      },
      {
        "_uid": "5b19c4b4-4b0a-4e24-88a5-f1d555d2f9f2",
        "component": "mediaSection5",
        "hasBorder": false,
        "contentBlocks": [
          {
            "_uid": "31d301b3-338f-4ec3-a1f6-a118685000b5",
            "text": "the right product for your savings goals.",
            "media": [
              {
                "alt": "Select a product",
                "img": "//a.storyblok.com/f/180759/x/cfc185abac/step-1.svg",
                "_uid": "0568ea0f-cb0c-4fd5-a370-bea5a5da7b45",
                "component": "mediav2"
              }
            ],
            "title": "Select",
            "component": "contentWithMediaBlockv2"
          },
          {
            "_uid": "9205944e-29cd-4af5-aa61-ec3f9b63ebf6",
            "text": "with an email address and password, then verify your identity and bank information.",
            "media": [
              {
                "alt": "Register for a SaveBetter account",
                "img": "//a.storyblok.com/f/180759/x/c31edded4a/step-3-2.svg",
                "_uid": "4d4e411c-575a-4889-a11d-d86f8db2a41f",
                "component": "mediav2"
              }
            ],
            "title": "Register",
            "component": "contentWithMediaBlockv2"
          },
          {
            "_uid": "93dca841-c574-4a15-8a8f-0a6fca67198f",
            "text": "the savings products you add to your new SaveBetter account.",
            "media": [
              {
                "alt": "Add funds",
                "img": "//a.storyblok.com/f/180759/x/f474b8dadf/step-4-3.svg",
                "_uid": "9311ef60-6b49-4f1e-8e54-f54a49ee66d4",
                "component": "mediav2"
              }
            ],
            "title": "Fund",
            "component": "contentWithMediaBlockv2"
          }
        ],
        "hasBackground": false,
        "hasPaddingTop": false,
        "hasPaddingBottom": false
      },
      {
        "_uid": "b5ca21d8-0574-4341-9dbf-2ffe9441e7b0",
        "href": "https://app.savebetter.com/auth/register?productId=61f19679dd17cd00017743be",
        "kind": "primary",
        "size": "medium",
        "text": "Start saving",
        "target": "_self",
        "justify": "justify-center",
        "rounded": "rounded",
        "disabled": false,
        "component": "button",
        "hasBackground": false,
        "hasPaddingTop": false,
        "hasPaddingBottom": true
      },
      {
        "_uid": "24cd3e6e-2ff7-4544-adef-99e31d8e903b",
        "link": [
          {
            "url": "/faq",
            "_uid": "1e4e44ce-88bc-4c85-83f9-6dc5e2d1b410",
            "text": "Read more FAQs",
            "target": "_self",
            "component": "link"
          }
        ],
        "title": "FAQs",
        "component": "faq",
        "hasBorder": false,
        "questions": [
          {
            "_uid": "76f56a6b-7f52-4190-98d2-4e15f7257c9a",
            "answer": {
              "type": "doc",
              "content": [
                {
                  "type": "paragraph",
                  "content": [
                    {
                      "text": "SaveBetter is a digital platform that gives savers unparalleled access to a variety of deposit products through the convenience of a single account, helping you unlock the growth potential of your cash savings.",
                      "type": "text"
                    }
                  ]
                },
                {
                  "type": "paragraph",
                  "content": [
                    {
                      "text": "SaveBetter customers use the platform to fund federally insured deposit products offered by numerous U.S. banks and credit unions with a wide range of maturities and APYs (annual percentage yield), allowing you to build a savings strategy to suit your earning and liquidity needs.",
                      "type": "text"
                    }
                  ]
                },
                {
                  "type": "paragraph",
                  "content": [
                    {
                      "text": "SaveBetter is not a bank. It provides the digital “storefront” where banks and credit unions can promote their deposit products.",
                      "type": "text"
                    }
                  ]
                },
                {
                  "type": "paragraph",
                  "content": [
                    {
                      "text": "SaveBetter is operated by SaveBetter LLC, a 100% subsidiary of Raisin GmbH, a trailblazer for open banking in the deposits and investments space. In the U.S., Raisin helps banks and credit unions improve their deposit funding by offering national reach for their retail deposit products, and provides savers with better access, more choice and higher convenience when evaluating savings products from FDIC insured banks and NCUA insured credit unions.",
                      "type": "text"
                    }
                  ]
                }
              ]
            },
            "question": "What is SaveBetter?",
            "component": "faqItem",
            "hasPaddingTop": false,
            "hasPaddingBottom": false
          },
          {
            "_uid": "b2ffb093-73e7-4c4b-8eda-12228f295d97",
            "answer": {
              "type": "doc",
              "content": [
                {
                  "type": "paragraph",
                  "content": [
                    {
                      "text": "Your SaveBetter account gives you access to savings accounts and Certificates of Deposit (CDs) offered by a variety of banks and credit unions with the security of FDIC and NCUA insurance, respectively. These products include:",
                      "type": "text"
                    }
                  ]
                },
                { "type": "paragraph" },
                {
                  "type": "bullet_list",
                  "content": [
                    {
                      "type": "list_item",
                      "content": [
                        {
                          "type": "paragraph",
                          "content": [
                            {
                              "text": "High-yield Savings Account (HYSA).",
                              "type": "text",
                              "marks": [{ "type": "bold" }]
                            },
                            {
                              "text": " As its name indicates, this account type functions like a traditional savings account—with typically no restrictions on depositing and withdrawing funds—but earns interest at rates that are higher than the national average for standard savings accounts. ",
                              "type": "text"
                            }
                          ]
                        },
                        { "type": "paragraph" }
                      ]
                    },
                    {
                      "type": "list_item",
                      "content": [
                        {
                          "type": "paragraph",
                          "content": [
                            {
                              "text": "Money Market Deposit Account (MMDA).",
                              "type": "text",
                              "marks": [{ "type": "bold" }]
                            },
                            {
                              "text": " Also known as a money market account or MMA, this type of savings account offers a varying rate that allows you to earn interest on your funds with maximum flexibility for withdrawals. Like a HYSA, an MMDA offers features of a traditional savings account with typically higher returns. ",
                              "type": "text"
                            }
                          ]
                        },
                        { "type": "paragraph" }
                      ]
                    },
                    {
                      "type": "list_item",
                      "content": [
                        {
                          "type": "paragraph",
                          "content": [
                            {
                              "text": "No Penalty CD.",
                              "type": "text",
                              "marks": [{ "type": "bold" }]
                            },
                            {
                              "text": " Through the flexibility of a No Penalty CD, you can lock in a competitive rate for a fixed term with the option to make a full withdrawal at any time beginning seven (7) calendar days after funding without having to pay a penalty for the early termination.",
                              "type": "text"
                            }
                          ]
                        },
                        { "type": "paragraph" }
                      ]
                    },
                    {
                      "type": "list_item",
                      "content": [
                        {
                          "type": "paragraph",
                          "content": [
                            {
                              "text": "Fixed Term CD.",
                              "type": "text",
                              "marks": [{ "type": "bold" }]
                            },
                            {
                              "text": " With this longstanding savings vehicle, funds are held for a fixed term, and a competitive interest rate provides safe, predictable earnings. In contrast to No Penalty CDs, typically you are charged a fee if you do not complete the full term of the Fixed Term CD.",
                              "type": "text"
                            }
                          ]
                        }
                      ]
                    }
                  ]
                }
              ]
            },
            "question": "What types of products are available through SaveBetter?",
            "component": "faqItem",
            "hasPaddingTop": false,
            "hasPaddingBottom": false
          },
          {
            "_uid": "ac6787f9-9bf8-4b1d-a218-76536152a928",
            "answer": {
              "type": "doc",
              "content": [
                {
                  "type": "paragraph",
                  "content": [
                    {
                      "text": "Interest (or dividend in the case of credit union savings products) is compounded daily and posted to your account monthly. ",
                      "type": "text"
                    }
                  ]
                }
              ]
            },
            "question": "How often is interest compounded?",
            "component": "faqItem",
            "hasPaddingTop": false,
            "hasPaddingBottom": false
          },
          {
            "_uid": "897fdcb4-54f0-4cf5-8583-9db415e1c8e6",
            "answer": {
              "type": "doc",
              "content": [
                {
                  "type": "paragraph",
                  "content": [
                    { "text": "The short answer is yes! ", "type": "text" }
                  ]
                },
                {
                  "type": "paragraph",
                  "content": [
                    {
                      "text": "For SaveBetter customers who hold savings products offered by one of our partner banks, funds are ",
                      "type": "text"
                    },
                    {
                      "text": "insured by the FDIC",
                      "type": "text",
                      "marks": [
                        {
                          "type": "link",
                          "attrs": {
                            "href": "https://www.fdic.gov/resources/deposit-insurance/",
                            "uuid": null,
                            "anchor": null,
                            "target": "_blank",
                            "linktype": "url"
                          }
                        }
                      ]
                    },
                    {
                      "text": " up to the maximum amount in accordance with and as permitted by law at each bank holding their funds. The standard deposit insurance coverage limit is $250,000 per depositor, per FDIC-insured bank, per account ownership category. Ownership categories as defined by the FDIC include single bank accounts (owned by one person/depositor) and joint bank accounts (owned by two or more persons/depositors). Revocable trust accounts and some types of retirement accounts (e.g., IRAs) are among the other ownership categories covered by FDIC insurance. All deposits you have at a bank — whether facilitated through SaveBetter or otherwise — count toward the deposit insurance limit. If funds held at a bank in a certain ownership category exceed the coverage limit, then the amount in excess of the limit will not be insured.",
                      "type": "text"
                    }
                  ]
                },
                {
                  "type": "paragraph",
                  "content": [
                    {
                      "text": "If you hold a savings product offered by one of our partner credit unions — making you a member of the institution — funds are ",
                      "type": "text"
                    },
                    {
                      "text": "insured by the NCUA",
                      "type": "text",
                      "marks": [
                        {
                          "type": "link",
                          "attrs": {
                            "href": "https://www.ncua.gov/support-services/share-insurance-fund",
                            "uuid": null,
                            "anchor": null,
                            "target": "_blank",
                            "linktype": "url"
                          }
                        }
                      ]
                    },
                    {
                      "text": " through its Share Insurance Fund. According to the NCUA, each credit union member has at least $250,000 in total coverage. The Share Insurance Fund insures individual accounts up to $250,000. Additionally, a member’s interest in all joint accounts combined is insured up to $250,000.",
                      "type": "text"
                    }
                  ]
                }
              ]
            },
            "question": "Does my SaveBetter account have deposit insurance?",
            "component": "faqItem",
            "hasPaddingTop": false,
            "hasPaddingBottom": false
          },
          {
            "_uid": "49c53f49-0d7d-415f-ba53-685b28df6d89",
            "answer": {
              "type": "doc",
              "content": [
                {
                  "type": "paragraph",
                  "content": [
                    {
                      "text": "At SaveBetter, cybersecurity is our priority. SaveBetter is a SOC 2 certified platform, meaning it has been validated by outside auditors across five (5) key information security principles. We also use a variety of measures to protect our customers' data, privacy and transactions, including:",
                      "type": "text"
                    }
                  ]
                },
                {
                  "type": "paragraph",
                  "content": [
                    {
                      "text": "•\tUser authentication.",
                      "type": "text",
                      "marks": [{ "type": "bold" }]
                    },
                    {
                      "text": " The SaveBetter platform uses multi-factor authentication combined with leading authentication technology to validate our customers’ identities.",
                      "type": "text"
                    }
                  ]
                },
                {
                  "type": "paragraph",
                  "content": [
                    {
                      "text": "•\tData encryption.",
                      "type": "text",
                      "marks": [{ "type": "bold" }]
                    },
                    {
                      "text": " Your personal information is encrypted in-transit and at rest using advanced cryptographic security algorithms.",
                      "type": "text"
                    }
                  ]
                },
                {
                  "type": "paragraph",
                  "content": [
                    {
                      "text": "•\tSite protection.",
                      "type": "text",
                      "marks": [{ "type": "bold" }]
                    },
                    {
                      "text": " Cloudflare™ advanced internet protection technologies are implemented to protect SaveBetter.com from malicious actors, botnets and denial of service attacks (DDOS).",
                      "type": "text"
                    }
                  ]
                },
                {
                  "type": "paragraph",
                  "content": [
                    {
                      "text": "•\tMonitoring.",
                      "type": "text",
                      "marks": [{ "type": "bold" }]
                    },
                    {
                      "text": " An always-on information security monitoring platform detects and alerts us to information security events.",
                      "type": "text"
                    }
                  ]
                },
                {
                  "type": "paragraph",
                  "content": [
                    {
                      "text": "•\tAssessments.",
                      "type": "text",
                      "marks": [{ "type": "bold" }]
                    },
                    {
                      "text": " Our platform undergoes vigorous security assessments and testing throughout the lifecycle of application development, from architecture planning to production phases.",
                      "type": "text"
                    }
                  ]
                },
                {
                  "type": "paragraph",
                  "content": [
                    {
                      "text": "Cloudflare™ is a registered trademark of Cloudflare, Inc.",
                      "type": "text"
                    }
                  ]
                }
              ]
            },
            "question": "How does SaveBetter protect my data, privacy, and finances?",
            "component": "faqItem",
            "hasPaddingTop": false,
            "hasPaddingBottom": false
          },
          {
            "_uid": "c5ba9f41-0cca-4412-954d-d2fdd466a689",
            "answer": {
              "type": "doc",
              "content": [
                {
                  "type": "paragraph",
                  "content": [
                    {
                      "text": "A. Check out our savings marketplace and choose a product in which you would like to deposit money. ",
                      "type": "text"
                    }
                  ]
                },
                {
                  "type": "paragraph",
                  "content": [
                    {
                      "text": "B. Create your username and password.",
                      "type": "text"
                    }
                  ]
                },
                {
                  "type": "paragraph",
                  "content": [
                    {
                      "text": "C. Complete an application and, after successful identity verification, link a bank account from which to fund your first savings product.",
                      "type": "text"
                    }
                  ]
                },
                {
                  "type": "paragraph",
                  "content": [
                    {
                      "text": "D. Start earning interest as soon as your money is received by the bank or credit union offering the savings product you selected.",
                      "type": "text"
                    }
                  ]
                },
                {
                  "type": "paragraph",
                  "content": [
                    {
                      "text": "Any questions or concerns? Email us at ",
                      "type": "text"
                    },
                    {
                      "text": "service@SaveBetter.com",
                      "type": "text",
                      "marks": [
                        {
                          "type": "link",
                          "attrs": {
                            "href": "service@SaveBetter.com",
                            "uuid": null,
                            "anchor": null,
                            "target": "_blank",
                            "linktype": "email"
                          }
                        }
                      ]
                    },
                    { "text": ".", "type": "text" }
                  ]
                }
              ]
            },
            "question": "How do I open a SaveBetter account?",
            "component": "faqItem",
            "hasPaddingTop": false,
            "hasPaddingBottom": false
          },
          {
            "_uid": "e4d711ac-0401-4ca9-b458-55cb66eaba4c",
            "answer": {
              "type": "doc",
              "content": [
                {
                  "type": "paragraph",
                  "content": [
                    {
                      "text": "All deposits and withdrawals are completed within one to three (1-3) business days. After the initial deposit a withdrawals limitation for the first few business days may exist.",
                      "type": "text"
                    }
                  ]
                },
                {
                  "type": "paragraph",
                  "content": [
                    {
                      "text": "Business days are Monday through Friday excluding U.S. bank holidays.",
                      "type": "text"
                    }
                  ]
                }
              ]
            },
            "question": "How long does it take to deposit my money? What about withdrawals?",
            "component": "faqItem",
            "hasPaddingTop": false,
            "hasPaddingBottom": false
          },
          {
            "_uid": "8ee6756b-ceea-4600-976a-fdf92274f0fc",
            "answer": {
              "type": "doc",
              "content": [
                {
                  "type": "paragraph",
                  "content": [
                    {
                      "text": "For products offered by banks, all necessary registration is handled when you become a SaveBetter customer. One of the many benefits of our platform is that you can open a single account and earn competitive interest rates from banks in the SaveBetter network. When you select and fund a savings product offered by a credit union, there is an additional step of becoming a member. SaveBetter makes that process quick, easy and free. You still have one SaveBetter login and can view all your savings products in one convenient dashboard.",
                      "type": "text"
                    }
                  ]
                }
              ]
            },
            "question": "Will I need to register for accounts at the financial institutions where I've chosen to deposit my money? Am I a customer of those banks or a member of those credit unions?",
            "component": "faqItem",
            "hasPaddingTop": false,
            "hasPaddingBottom": false
          },
          {
            "_uid": "889db37a-7048-427e-a2ea-ae455c18d8bf",
            "answer": {
              "type": "doc",
              "content": [
                {
                  "type": "paragraph",
                  "content": [
                    {
                      "text": "The current APY for your savings products can always be viewed on the Account Overview page when you are logged in to SaveBetter. This information also appears on monthly statements.",
                      "type": "text"
                    }
                  ]
                }
              ]
            },
            "question": "Where can I view my savings products’ Annual Percentage Yield (APY)?",
            "component": "faqItem",
            "hasPaddingTop": false,
            "hasPaddingBottom": false
          },
          {
            "_uid": "f7a498aa-57e6-4a10-9fba-43b75a34e7f6",
            "answer": {
              "type": "doc",
              "content": [
                {
                  "type": "paragraph",
                  "content": [
                    {
                      "text": "You cannot currently link your SaveBetter account to a third-party app, but we may offer this feature in the future.  For now, you will not be able to link your selected savings product to a third-party app even if the bank or credit union offering that product does so outside of the SaveBetter platform.",
                      "type": "text"
                    }
                  ]
                }
              ]
            },
            "question": "Can I link my SaveBetter account or selected savings product to a third-party app? ",
            "component": "faqItem",
            "hasPaddingTop": false,
            "hasPaddingBottom": false
          }
        ],
        "hasBackground": false,
        "hasPaddingTop": false,
        "hasPaddingBottom": true
      }
    ],
    "logo": [
      {
        "alt": "Liberty Savings Bank logo",
        "img": "//a.storyblok.com/f/70134/400x100/a0faae5f93/liberty-savings-bank-logo-white-w2.png",
        "_uid": "2b855fae-df94-4d86-9b9b-54f49f549d8f",
        "mobile": "xs",
        "tablet": "xs",
        "desktop": "xs",
        "component": "media"
      }
    ],
    "test": "",
    "title": "High-Yield Savings Account",
    "layout": {
      "id": "a7887b35-4fec-4639-a28f-c4afd03fa845",
      "url": "savedo.ch",
      "linktype": "story",
      "fieldtype": "multilink",
      "cached_url": "layouts/explore-product-no-nav-layout"
    },
    "metadata": {
      "_uid": "3724defc-38a4-4567-a304-1085c4999972",
      "title": "Liberty Savings Bank: High-yield Savings Account | SaveBetter",
      "plugin": "meta-fields",
      "description": "View high-yield Savings Account details from Liberty Savings Bank."
    },
    "component": "page",
    "isTextWhite": true,
    "headerOutline": [
      {
        "_uid": "90062178-94da-4c52-91fa-58d1e0dbe204",
        "title": "Liberty Savings Bank High-Yield Savings Account",
        "bankCode": "",
        "component": "productOfferTable",
        "hasBorder": false,
        "productId": "61f19679dd17cd00017743be",
        "hasBackground": false,
        "hasPaddingTop": false,
        "featuredProducts": [],
        "hasPaddingBottom": false,
        "showSelectedProductTypes": ["SAVINGS_ACCOUNT"],
        "hasFinancialInstitutionsDropdown": false
      }
    ],
    "disableIndexing": true,
    "showBreadcrumbs": false,
    "headerBackground": [
      {
        "alt": "Happy family",
        "img": "//a.storyblok.com/f/180759/2560x800/9ff7154460/liberty-2.webp",
        "_uid": "4768358c-8f1d-4891-9949-edc1c1f49e0b",
        "mobile": "",
        "tablet": "",
        "desktop": "",
        "component": "media"
      }
    ],
    "introductionLink": [
      {
        "url": "https://app.savebetter.com/auth/register?productId=61f19679dd17cd00017743be",
        "_uid": "6d51aec1-8c66-4517-acc3-caca0c77a123",
        "text": "Start Saving",
        "target": "_self",
        "component": "link"
      }
    ],
    "introductionList": [
      {
        "_uid": "f8a222e1-6ee9-40c0-b8a9-6371367c8d52",
        "text": "{61f19679dd17cd00017743be-APY} APY* high-yield savings account, {61f19679dd17cd00017743be-APY}{FDIC-S} higher than national average.",
        "component": "introductionListItem"
      },
      {
        "_uid": "0d55b9cb-e7df-447d-8880-2d8ce2cb0cf7",
        "text": "FDIC insured. No fees.",
        "component": "introductionListItem"
      },
      {
        "_uid": "87f8f778-cdf9-4d5c-9a48-2402117e1d92",
        "text": "A history of serving communities across America.",
        "component": "introductionListItem"
      }
    ],
    "isLinkSecondaryColor": true,
    "introductionDescription": ""
  },
  "slug": "liberty-savings-bank-high-yield-savings-account",
  "full_slug": "bank/liberty-savings-bank/liberty-savings-bank-high-yield-savings-account",
  "sort_by_date": null,
  "position": 10,
  "tag_list": [],
  "is_startpage": false,
  "parent_id": 290605081,
  "meta_data": null,
  "group_id": "636bd411-a7b9-44d4-a1b9-eb783fdf3a82",
  "first_published_at": "2020-01-06T15:09:15.000Z",
  "release_id": null,
  "lang": "default",
  "path": null,
  "alternates": [],
  "default_full_slug": null,
  "translated_slugs": null
}
