a) x = 7 + 3 * 6 / 2 - 1
   x = 7 + 18 / 2 - 1
   x = 7 + 9 - 1
   x = 16 - 1
   x = 15

b) x = 2 % 2 + 2 * 2 - 2 / 2
   x = 0 + 2 * 2 - 2 / 2
   x = 0 + 4 - 2  / 2
   x = 0 + 4 - 1
   x = 4 - 1
   x = 3

c) x = ( 3 * 9 *( 3 + ( 9 * 3 / 3 ) ) )
   x = ( 3 * 9 *( 3 + ( 27 / 3 ) ) )
   x = ( 3 * 9 *( 3 +  9  ) )
   x = ( 3 * 9 * 12)
   x = 27 * 12
   x = 324

