<?xml version="1.0" encoding="UTF-8"?>
<!DOCTYPE svg PUBLIC "-//W3C//DTD SVG 1.1//EN" "http://www.w3.org/Graphics/SVG/1.1/DTD/svg11.dtd">
<!-- Creator: CorelDRAW X8 -->
<svg xmlns="http://www.w3.org/2000/svg" xml:space="preserve" width="0.159992in" height="0.159992in" version="1.1" shape-rendering="geometricPrecision" text-rendering="geometricPrecision" image-rendering="optimizeQuality" fill-rule="evenodd" clip-rule="evenodd"
viewBox="0 0 160 160"
 xmlns:xlink="http://www.w3.org/1999/xlink">
 <g id="Layer_x0020_1">
  <metadata id="CorelCorpID_0Corel-Layer"/>
  <rect fill="none" width="160" height="160"/>
  <g id="_947396368">
   <path fill="none" stroke="#201E1E" stroke-width="6.66535" d="M107 40c4,7 6,15 6,23 0,28 -23,51 -51,51 -28,0 -51,-23 -51,-51 0,-28 23,-51 51,-51 12,0 24,4 33,12"/>
   <circle fill="#201E1E" cx="62" cy="63" r="6"/>
   <polygon fill="#201E1E" points="62,60 91,31 91,23 102,12 102,22 112,22 101,33 93,33 63,64 "/>
   <path fill="none" stroke="#201E1E" stroke-width="6.66535" d="M81 54c1,2 2,6 2,9 0,11 -9,21 -21,21 -11,0 -21,-10 -21,-21 0,-12 10,-21 21,-21 5,0 10,2 14,6"/>
   <path fill="none" stroke="#201E1E" stroke-width="6.66535" d="M93 47c3,5 4,10 4,16 0,19 -16,35 -35,35 -19,0 -35,-16 -35,-35 0,-19 16,-35 35,-35 9,0 17,3 24,10"/>
   <path fill="#FEFEFE" d="M121 76l-7 0 7 0zm-21 58c-3,0 -6,3 -6,7 0,4 3,7 6,7 4,0 7,-3 7,-7 0,-4 -3,-7 -7,-7zm35 0c-4,0 -7,3 -7,7 0,4 3,7 7,7 3,0 6,-3 6,-7 0,-4 -3,-7 -6,-7zm-34 -11c0,0 0,0 0,0l3 -6 26 0c2,0 4,-1 6,-3l13 -24 -6 -4 0 0 -4 7 -9 17 -24 0 -1 -1 -7 -16 -4 -7 -3 -6 -11 0 0 6 7 0 12 26 -5 9c0,1 0,2 0,3 0,4 3,7 6,7l41 0 0 -7 -39 0c-1,0 -1,0 -1,-1z"/>
  </g>
 </g>
</svg>
