<?xml version="1.0" encoding="UTF-8"?>
<!DOCTYPE svg PUBLIC "-//W3C//DTD SVG 1.1//EN" "http://www.w3.org/Graphics/SVG/1.1/DTD/svg11.dtd">
<!-- Creator: CorelDRAW X8 -->
<svg xmlns="http://www.w3.org/2000/svg" xml:space="preserve" width="0.159992in" height="0.159992in" version="1.1" shape-rendering="geometricPrecision" text-rendering="geometricPrecision" image-rendering="optimizeQuality" fill-rule="evenodd" clip-rule="evenodd"
viewBox="0 0 160 160"
 xmlns:xlink="http://www.w3.org/1999/xlink">
 <g id="Layer_x0020_1">
  <metadata id="CorelCorpID_0Corel-Layer"/>
  <rect fill="none" width="160" height="160"/>
  <g id="_938685344">
   <rect fill="#CFD8DC" x="18" y="49" width="104.501" height="69.5925"/>
   <rect fill="#B0BEC5" x="18" y="108" width="104.501" height="10.6205"/>
   <rect fill="#E3F2FD" x="37" y="70" width="65.8499" height="48.594"/>
   <rect fill="none" x="40" y="73" width="59.8969" height="46.0911"/>
   <polygon fill="#1E88E5" points="40,101 100,73 40,73 "/>
   <polygon fill="#64B5F6" points="40,101 40,119 100,119 100,73 80,82 "/>
   <rect fill="#1E88E5" x="68" y="73" width="5.31104" height="46.0911"/>
   <circle fill="#1E88E5" cx="59" cy="97" r="3"/>
   <circle fill="#1E88E5" cx="82" cy="97" r="3"/>
   <path fill="#FF5722" d="M20 45l101 0 0 -18c0,-4 -3,-7 -7,-7l-87 0c-4,0 -7,3 -7,7l0 18z"/>
   <circle fill="#FFA000" cx="22" cy="57" r="8"/>
   <circle fill="#FF5722" cx="38" cy="57" r="8"/>
   <circle fill="#FFA000" cx="54" cy="57" r="8"/>
   <rect fill="#FFC107" transform="matrix(0.4078 -0 0.000409132 0.4078 46.1527 33.7846)" width="39.9921" height="56.7795"/>
   <circle fill="#FF5722" cx="71" cy="57" r="8"/>
   <circle fill="#FFA000" cx="87" cy="57" r="8"/>
   <circle fill="#FF5722" cx="103" cy="57" r="8"/>
   <circle fill="#FFA000" cx="120" cy="57" r="8"/>
   <rect fill="#FF5722" transform="matrix(0.4078 2.26375E-17 -0.03224 0.4078 31.6993 33.7846)" width="39.9921" height="56.7795"/>
   <rect fill="#FFC107" transform="matrix(0.4078 2.26375E-17 -0.116631 0.4078 20.1822 33.7846)" width="39.9921" height="56.7795"/>
   <rect fill="#FF5722" transform="matrix(0.4078 -0 0.000409132 0.4078 62.4599 33.7846)" width="39.9921" height="56.7795"/>
   <rect fill="#FFC107" transform="matrix(-0.4078 -0 -0.000409132 0.4078 95.124 33.7846)" width="39.9921" height="56.7795"/>
   <rect fill="#FF5722" transform="matrix(-0.4078 2.26375E-17 0.03224 0.4078 109.577 33.7846)" width="39.9921" height="56.7795"/>
   <rect fill="#FFC107" transform="matrix(-0.4078 2.26375E-17 0.116631 0.4078 121.094 33.7846)" width="39.9921" height="56.7795"/>
   <circle fill="#00A859" stroke="white" stroke-width="6.94094" cx="128" cy="122" r="18"/>
  </g>
 </g>
</svg>
