<?xml version="1.0" encoding="UTF-8"?>
<!DOCTYPE svg PUBLIC "-//W3C//DTD SVG 1.1//EN" "http://www.w3.org/Graphics/SVG/1.1/DTD/svg11.dtd">
<!-- Creator: CorelDRAW X8 -->
<svg xmlns="http://www.w3.org/2000/svg" xml:space="preserve" width="0.159992in" height="0.159992in" version="1.1" shape-rendering="geometricPrecision" text-rendering="geometricPrecision" image-rendering="optimizeQuality" fill-rule="evenodd" clip-rule="evenodd"
viewBox="0 0 160 160"
 xmlns:xlink="http://www.w3.org/1999/xlink">
 <g id="Layer_x0020_1">
  <metadata id="CorelCorpID_0Corel-Layer"/>
  <rect fill="none" width="160" height="160"/>
  <g id="_945794416">
   <path fill="#90CAF9" d="M143 137l-86 0 0 -123c0,-4 3,-7 7,-7l72 0c4,0 7,3 7,7l0 123z"/>
   <ellipse fill="#201E1E" cx="61" cy="75" rx="27" ry="28"/>
   <rect fill="#64B5F6" x="57" y="130" width="86.0217" height="7.10489"/>
   <rect fill="#1565C0" x="75" y="52" width="20.4662" height="16.8241"/>
   <rect fill="#1565C0" x="75" y="79" width="20.4662" height="16.8241"/>
   <rect fill="#1565C0" x="106" y="79" width="20.4662" height="16.8241"/>
   <rect fill="#1565C0" x="106" y="52" width="20.4662" height="16.8241"/>
   <rect fill="#FF9800" x="48" y="107" width="24.8213" height="28.4571"/>
   <polygon fill="#FEFEFE" points="48,118 61,122 73,118 82,139 61,151 43,132 "/>
   <rect fill="#1565C0" x="75" y="107" width="20.4662" height="16.8241"/>
   <rect fill="#BF360C" x="106" y="107" width="20.4662" height="30.1374"/>
   <polygon fill="#D32F2F" points="56,131 53,131 61,122 69,131 65,131 65,152 56,152 "/>
   <path fill="#455A64" d="M104 153c0,-20 -15,-31 -31,-35l-4 9 -8 20 -9 -20 -4 -9c-15,4 -31,15 -31,35l87 0z"/>
   <ellipse fill="#201E1E" cx="65" cy="75" rx="25" ry="28"/>
   <ellipse fill="#201E1E" cx="57" cy="75" rx="25" ry="28"/>
   <ellipse fill="#FFB74D" cx="61" cy="83" rx="24" ry="30"/>
   <path fill="#201E1E" d="M71 54c0,1 1,3 1,4 0,12 -10,21 -22,21 -6,0 -11,-2 -15,-6 4,-12 14,-21 26,-21 3,0 7,1 10,2z"/>
   <path fill="#201E1E" d="M87 79l0 0c-12,0 -22,-9 -22,-21 0,-2 1,-4 1,-6 11,3 19,14 21,27z"/>
   <circle fill="#784719" cx="51" cy="87" r="5"/>
   <circle fill="#784719" cx="70" cy="87" r="5"/>
   <circle fill="#FFB74D" cx="37" cy="87" r="5"/>
   <circle fill="#FFB74D" cx="85" cy="87" r="5"/>
   <rect fill="#1565C0" x="75" y="25" width="20.4662" height="16.8241"/>
   <rect fill="#1565C0" x="106" y="25" width="20.4662" height="16.8241"/>
  </g>
 </g>
</svg>
