<?xml version="1.0" encoding="UTF-8"?>
<!DOCTYPE svg PUBLIC "-//W3C//DTD SVG 1.1//EN" "http://www.w3.org/Graphics/SVG/1.1/DTD/svg11.dtd">
<!-- Creator: CorelDRAW X8 -->
<svg xmlns="http://www.w3.org/2000/svg" xml:space="preserve" width="0.159992in" height="0.159992in" version="1.1" shape-rendering="geometricPrecision" text-rendering="geometricPrecision" image-rendering="optimizeQuality" fill-rule="evenodd" clip-rule="evenodd"
viewBox="0 0 160 160"
 xmlns:xlink="http://www.w3.org/1999/xlink">
 <g id="Layer_x0020_1">
  <metadata id="CorelCorpID_0Corel-Layer"/>
  <rect fill="none" width="160" height="160"/>
  <g id="_945791536">
   <path fill="none" stroke="#201E1E" stroke-width="6.66535" d="M108 45c3,7 5,15 5,23 0,28 -23,51 -51,51 -28,0 -51,-23 -51,-51 0,-28 23,-51 51,-51 12,0 24,5 33,12"/>
   <circle fill="#201E1E" cx="62" cy="68" r="6"/>
   <polygon fill="#201E1E" points="62,66 92,36 92,28 102,17 102,27 112,27 101,38 93,39 63,69 "/>
   <path fill="none" stroke="#201E1E" stroke-width="6.66535" d="M81 59c1,3 2,6 2,9 0,12 -9,21 -21,21 -11,0 -21,-9 -21,-21 0,-11 10,-21 21,-21 6,0 11,2 14,6"/>
   <path fill="none" stroke="#201E1E" stroke-width="6.66535" d="M93 52c3,5 4,11 4,16 0,20 -15,35 -35,35 -19,0 -35,-15 -35,-35 0,-19 16,-35 35,-35 9,0 18,4 24,10"/>
   <path fill="#FEFEFE" d="M142 81l-4 0 0 -7 -7 0 0 7 -27 0 0 -7 -7 0 0 7 -3 0c-4,0 -7,3 -7,7l0 48c0,4 3,7 7,7l48 0c4,0 7,-3 7,-7l0 -48c0,-4 -3,-7 -7,-7zm0 55l-48 0 0 -38 48 0 0 38z"/>
  </g>
 </g>
</svg>
