Nama                : Deka Mersandi
Studi Indenpenden   : Binar Academy
Kelas               : FSW-13
Mentor              : Imam Taufiq Hermawan
Kampus              : Institut Teknologi Indonesia
Prodi               : Teknik Informatika 2018
