{
  "menu": [{
    "type": "Beverages",
    "items": [{
      "id": "1",
      "name": "Espresso",
      "description": "Espresso is a concentrated form of coffee, served in shots. It's made of two ingredients - finely ground, 100% coffee, and hot water",
      "price": 10,
      "quantity": 0,
      "tax": 4,
      "icon": "/assets/icons/espresso.jpg"
    }, {
      "id": "2",
      "name": "Cappuccino",
      "description": "A cappuccino is the perfect balance of espresso, steamed milk and foam",
      "price": 10,
      "quantity": 0,
      "tax": 4
    }, {
      "id": "3",
      "name": "Cappuccino Special",
      "description": "A cappuccino is the perfect balance of espresso, steamed milk and foam",
      "price": 10,
      "quantity": 0,
      "tax": 4
    }]
  }, {
    "type": "Food",
    "items": [{
      "id": "4",
      "name": "Pancake",
      "description": "A pancake is a breakfast dish, a flat cake that's made by pouring batter into a hot pan and frying it on both sides",
      "price": 10,
      "quantity": 0,
      "tax": 4
    }, {
      "id": "5",
      "name": "Bread Pudding",
      "description": "Bread Pudding is a cubed stale bread that is combined with a mixture of milk, sugar, and eggs that is baked",
      "price": 10,
      "quantity": 0,
      "tax": 4
    }]
  }]
}
