{
	"info": {
		"_postman_id": "20a8af7d-bdd9-4e68-9910-f3b61f301c53",
		"name": "SolomoBiz",
		"schema": "https://schema.getpostman.com/json/collection/v2.1.0/collection.json",
		"_exporter_id": "5788795"
	},
	"item": [
		{
			"name": "Shifts",
			"item": [
				{
					"name": "All worker shifts",
					"request": {
						"auth": {
							"type": "bearer",
							"bearer": [
								{
									"key": "token",
									"value": "{{key}}",
									"type": "string"
								}
							]
						},
						"method": "GET",
						"header": [
							{
								"key": "Content-Type",
								"value": "application/json",
								"type": "text"
							}
						],
						"url": {
							"raw": "{{url}}/api/V1/shifts",
							"host": [
								"{{url}}"
							],
							"path": [
								"api",
								"V1",
								"shifts"
							]
						}
					},
					"response": []
				},
				{
					"name": "Create Shift",
					"request": {
						"auth": {
							"type": "bearer",
							"bearer": [
								{
									"key": "token",
									"value": "{{key}}",
									"type": "string"
								}
							]
						},
						"method": "POST",
						"header": [
							{
								"key": "Content-Type",
								"value": "application/json",
								"type": "text"
							}
						],
						"url": {
							"raw": "{{url}}/api/V1/shifts?worker_id=1&start_time=00:00&date=2023-05-21",
							"host": [
								"{{url}}"
							],
							"path": [
								"api",
								"V1",
								"shifts"
							],
							"query": [
								{
									"key": "worker_id",
									"value": "1"
								},
								{
									"key": "start_time",
									"value": "00:00"
								},
								{
									"key": "end_time",
									"value": "16:20",
									"disabled": true
								},
								{
									"key": "date",
									"value": "2023-05-21"
								}
							]
						}
					},
					"response": []
				},
				{
					"name": "Search Shift using ID",
					"request": {
						"auth": {
							"type": "bearer",
							"bearer": [
								{
									"key": "token",
									"value": "{{key}}",
									"type": "string"
								}
							]
						},
						"method": "GET",
						"header": [
							{
								"key": "Content-Type",
								"value": "application/json",
								"type": "text"
							}
						],
						"url": {
							"raw": "{{url}}/api/V1/shifts/1",
							"host": [
								"{{url}}"
							],
							"path": [
								"api",
								"V1",
								"shifts",
								"1"
							]
						}
					},
					"response": []
				},
				{
					"name": "Update Shift",
					"request": {
						"auth": {
							"type": "bearer",
							"bearer": [
								{
									"key": "token",
									"value": "{{key}}",
									"type": "string"
								}
							]
						},
						"method": "PUT",
						"header": [],
						"url": {
							"raw": "{{url}}/api/V1/shifts/2?start_time=16:00&date=2023-05-20",
							"host": [
								"{{url}}"
							],
							"path": [
								"api",
								"V1",
								"shifts",
								"2"
							],
							"query": [
								{
									"key": "start_time",
									"value": "16:00"
								},
								{
									"key": "date",
									"value": "2023-05-20"
								}
							]
						}
					},
					"response": []
				},
				{
					"name": "Delete Shift",
					"request": {
						"auth": {
							"type": "bearer",
							"bearer": [
								{
									"key": "token",
									"value": "{{key}}",
									"type": "string"
								}
							]
						},
						"method": "DELETE",
						"header": [
							{
								"key": "Content-Type",
								"value": "application/json",
								"type": "text"
							}
						],
						"url": {
							"raw": "{{url}}/api/V1/shifts/1",
							"host": [
								"{{url}}"
							],
							"path": [
								"api",
								"V1",
								"shifts",
								"1"
							]
						}
					},
					"response": []
				}
			],
			"auth": {
				"type": "bearer"
			},
			"event": [
				{
					"listen": "prerequest",
					"script": {
						"type": "text/javascript",
						"exec": [
							""
						]
					}
				},
				{
					"listen": "test",
					"script": {
						"type": "text/javascript",
						"exec": [
							""
						]
					}
				}
			]
		},
		{
			"name": "Workers",
			"item": [
				{
					"name": "View All Workers",
					"request": {
						"auth": {
							"type": "bearer",
							"bearer": [
								{
									"key": "token",
									"value": "{{key}}",
									"type": "string"
								}
							]
						},
						"method": "GET",
						"header": [
							{
								"key": "Content-Type",
								"value": "application/json",
								"type": "text"
							}
						],
						"url": {
							"raw": "{{url}}/api/V1/workers",
							"host": [
								"{{url}}"
							],
							"path": [
								"api",
								"V1",
								"workers"
							]
						}
					},
					"response": []
				},
				{
					"name": "Create Worker",
					"request": {
						"auth": {
							"type": "bearer",
							"bearer": [
								{
									"key": "token",
									"value": "{{key}}",
									"type": "string"
								}
							]
						},
						"method": "POST",
						"header": [
							{
								"key": "Content-Type",
								"value": "application/json",
								"type": "text"
							}
						],
						"url": {
							"raw": "{{url}}/api/V1/workers?name=Jane Doe&email=worker_2@mail.com&password=0773518123&password_confirmation=0773518123",
							"host": [
								"{{url}}"
							],
							"path": [
								"api",
								"V1",
								"workers"
							],
							"query": [
								{
									"key": "name",
									"value": "Jane Doe"
								},
								{
									"key": "email",
									"value": "worker_2@mail.com"
								},
								{
									"key": "password",
									"value": "0773518123"
								},
								{
									"key": "password_confirmation",
									"value": "0773518123"
								}
							]
						}
					},
					"response": []
				},
				{
					"name": "Find worker info",
					"protocolProfileBehavior": {
						"disableBodyPruning": true
					},
					"request": {
						"auth": {
							"type": "bearer",
							"bearer": [
								{
									"key": "token",
									"value": "{{key}}",
									"type": "string"
								}
							]
						},
						"method": "GET",
						"header": [
							{
								"key": "Content-Type",
								"value": "application/json",
								"type": "text"
							}
						],
						"body": {
							"mode": "raw",
							"raw": ""
						},
						"url": {
							"raw": "{{url}}/api/V1/workers/1",
							"host": [
								"{{url}}"
							],
							"path": [
								"api",
								"V1",
								"workers",
								"1"
							]
						}
					},
					"response": []
				},
				{
					"name": "Worker Update",
					"request": {
						"auth": {
							"type": "bearer",
							"bearer": [
								{
									"key": "token",
									"value": "{{key}}",
									"type": "string"
								}
							]
						},
						"method": "PUT",
						"header": [],
						"url": {
							"raw": "{{url}}/api/V1/workers/1?name=Jane Doe&email=worker_1@mail.com&password=0773518124",
							"host": [
								"{{url}}"
							],
							"path": [
								"api",
								"V1",
								"workers",
								"1"
							],
							"query": [
								{
									"key": "name",
									"value": "Jane Doe"
								},
								{
									"key": "email",
									"value": "worker_1@mail.com"
								},
								{
									"key": "password",
									"value": "0773518124"
								}
							]
						}
					},
					"response": []
				},
				{
					"name": "Worker Delete",
					"request": {
						"auth": {
							"type": "bearer",
							"bearer": [
								{
									"key": "token",
									"value": "{{key}}",
									"type": "string"
								}
							]
						},
						"method": "DELETE",
						"header": [
							{
								"key": "Content-Type",
								"value": "application/json",
								"type": "text"
							}
						],
						"url": {
							"raw": "{{url}}/api/V1/workers/2",
							"host": [
								"{{url}}"
							],
							"path": [
								"api",
								"V1",
								"workers",
								"2"
							]
						}
					},
					"response": []
				}
			]
		},
		{
			"name": "Common API",
			"item": [
				{
					"name": "User Login",
					"request": {
						"method": "POST",
						"header": [
							{
								"key": "Content-Type",
								"value": "application/json",
								"type": "text"
							}
						],
						"body": {
							"mode": "raw",
							"raw": "",
							"options": {
								"raw": {
									"language": "json"
								}
							}
						},
						"url": {
							"raw": "{{url}}/api/V1/login?email=userlogin@mail.com&password=0773518123",
							"host": [
								"{{url}}"
							],
							"path": [
								"api",
								"V1",
								"login"
							],
							"query": [
								{
									"key": "email",
									"value": "userlogin@mail.com"
								},
								{
									"key": "password",
									"value": "0773518123"
								}
							]
						}
					},
					"response": []
				},
				{
					"name": "User Register",
					"protocolProfileBehavior": {
						"disabledSystemHeaders": {
							"content-type": true
						}
					},
					"request": {
						"method": "POST",
						"header": [
							{
								"key": "Content-Type",
								"value": "application/json",
								"type": "text"
							}
						],
						"body": {
							"mode": "raw",
							"raw": "",
							"options": {
								"raw": {
									"language": "json"
								}
							}
						},
						"url": {
							"raw": "{{url}}/api/V1/register?name=John Doe&email=userlogin@mail.com&password=0773518123&password_confirmation=0773518123",
							"host": [
								"{{url}}"
							],
							"path": [
								"api",
								"V1",
								"register"
							],
							"query": [
								{
									"key": "name",
									"value": "John Doe"
								},
								{
									"key": "email",
									"value": "userlogin@mail.com"
								},
								{
									"key": "password",
									"value": "0773518123"
								},
								{
									"key": "password_confirmation",
									"value": "0773518123"
								}
							]
						}
					},
					"response": []
				},
				{
					"name": "User Logout",
					"request": {
						"auth": {
							"type": "bearer",
							"bearer": [
								{
									"key": "token",
									"value": "{{key}}",
									"type": "string"
								}
							]
						},
						"method": "POST",
						"header": [
							{
								"key": "Content-Type",
								"value": "application/json",
								"type": "text"
							}
						],
						"url": {
							"raw": "{{url}}/api/V1/logout",
							"host": [
								"{{url}}"
							],
							"path": [
								"api",
								"V1",
								"logout"
							]
						}
					},
					"response": []
				}
			]
		}
	]
}