{
  "swagger": "2.0",
  "info": {
    "description": "celeng-8",
    "version": "sekian",
    "title": "celeng 8"
  },
  "host": "localhost:5000",
  "basePath": "/api",
  "tags": [
    {
      "name": "Player",
      "description": "Player resources"
    }
  ],
  "schemes": [
    "https",
    "http"
  ],
  "paths": {
    "/players": {
      "post": {
        "tags": [
          "Player"
        ],
        "summary": "Create Player",
        "description": "Create a new Player",
        "operationId": "createPlayer",
        "produces": [
          "application/json"
        ],
        "consumes": [
          "application/json"
        ],
        "parameters": [
          {
            "in": "body",
            "name": "body",
            "description": "Created player object",
            "required": true,
            "schema": {
              "$ref": "#/definitions/Player"
            }
          }
        ],
        "responses": {
          "201": {
            "description": "SUCCESS",
            "schema": {
              "$ref": "#/definitions/Player"
            }
          },
          "400": {
            "description": "FAILED",
            "schema": {
              "type": "object",
              "properties": {
                "message": {
                  "type": "string",
                  "example": "username or email or password field cannot be empty."
                }
              }
            }
          },
          "500": {
            "description": "FAILED",
            "schema": {
              "type": "object",
              "properties": {
                "message": {
                  "type": "string",
                  "example": "Some error occurred while creating the Player"
                }
              }
            }
          }
        }
      },
      "get": {
        "tags": [
          "Player"
        ],
        "summary": "List of all players",
        "description": "Describe of all Players",
        "operationId": "getAllPlayers",
        "produces": [
          "application/json"
        ],
        "responses": {
          "200": {
            "description": "SUCCESS",
            "schema": {
              "type": "array",
              "items": {
                "$ref": "#/definitions/Player"
              }
            }
          },
          "500": {
            "description": "Server error occurred",
            "schema": {
              "type": "object",
              "properties": {
                "message": {
                  "type": "string",
                  "example": "Some error occurred while creating the Player"
                }
              }
            }
          }
        }
      }
    },
    "/players/{id}": {
      "get": {
        "tags": [
          "Player"
        ],
        "summary": "Get user by user name",
        "description": "Get an user by specific ID",
        "operationId": "getUserByUserName",
        "produces": [
          "application/json"
        ],
        "parameters": [
          {
            "name": "id",
            "in": "path",
            "description": "ID of a player",
            "required": true,
            "type": "integer",
            "format": "int64"
          }
        ],
        "responses": {
          "200": {
            "description": "SUCCESS",
            "schema": {
              "$ref": "#/definitions/Player"
            }
          },
          "500": {
            "description": "Server error occurred",
            "schema": {
              "type": "object",
              "properties": {
                "message": {
                  "type": "string",
                  "example": "Error retrieving Player with id = ${id}"
                }
              }
            }
          }
        }
      },
      "put": {
        "tags": [
          "Player"
        ],
        "summary": "Updated user",
        "description": "Update Player Data",
        "operationId": "updateUser",
        "produces": [
          "application/json"
        ],
        "parameters": [
          {
            "name": "id",
            "in": "path",
            "description": "name that need to be updated",
            "required": true,
            "type": "integer",
            "format": "int64"
          },
          {
            "in": "body",
            "name": "body",
            "description": "Updated user object",
            "required": true,
            "schema": {
              "$ref": "#/definitions/Player"
            }
          }
        ],
        "responses": {
          "400": {
            "description": "Failed edit Player data",
            "schema": {
              "type": "object",
              "properties": {
                "message": {
                  "type": "string",
                  "example": "Cannot update Player with id=${id}. Maybe Player was not found or req.body is empty!"
                }
              }
            }
          },
          "500": {
            "description": "Server error occurred",
            "schema": {
              "type": "object",
              "properties": {
                "message": {
                  "type": "string",
                  "example": "Error updating Player with id= ${id}"
                }
              }
            }
          }
        }
      },
      "delete": {
        "tags": [
          "Player"
        ],
        "summary": "Delete user",
        "description": "Delete player",
        "operationId": "deleteUser",
        "produces": [
          "application/json"
        ],
        "parameters": [
          {
            "name": "id",
            "in": "path",
            "description": "The name that needs to be deleted",
            "required": true,
            "type": "integer",
            "format": "int64"
          }
        ],
        "responses": {
          "400": {
            "description": "Failed to delete player",
            "schema": {
              "type": "object",
              "properties": {
                "message": {
                  "type": "string",
                  "example": "Cannot delete Player with id=${id}. Maybe Player was not found."
                }
              }
            }
          },
          "500": {
            "description": "Server error occurred",
            "schema": {
              "type": "object",
              "properties": {
                "message": {
                  "type": "string",
                  "example": "Could not delete Player with id= ${id}"
                }
              }
            }
          }
        }
      }
    },
    "/players/exp/{id}": {
      "post": {
        "tags": [
          "Player"
        ],
        "summary": "Create Player",
        "description": "",
        "operationId": "create by experience Player",
        "produces": [
          "application/json"
        ],
        "consumes": [
          "application/json"
        ],
        "parameters": [
          {
            "in": "path",
            "name": "id",
            "description": "Created player object",
            "required": true,
            "type": "integer",
            "format": "int64"
          }
        ],
        "responses": {
          "200": {
            "description": "SUCCESS"
          },
          "400": {
            "description": "Failed to add player",
            "schema": {
              "type": "object",
              "properties": {
                "message": {
                  "type": "string",
                  "example": "exp field cannot be empty"
                }
              }
            }
          }
        }
      }
    }
  },
  "definitions": {
    "Player": {
      "type": "object",
      "properties": {
        "id": {
          "type": "integer",
          "format": "int64",
          "example": 1
        },
        "username": {
          "type": "string",
          "example": "test"
        },
        "email": {
          "type": "string",
          "example": "hehe@haha.com"
        },
        "password": {
          "type": "string",
          "example": "hahaha"
        },
        "experience": {
          "type": "integer",
          "format": "int64",
          "example": 322
        },
        "level": {
          "type": "integer",
          "format": "int64",
          "example": 3
        }
      }
    }
  },
  "externalDocs": {
    "description": "Find out more about Swagger",
    "url": "http://swagger.io"
  }
}