<?xml version="1.0" encoding="utf-8"?>
<!-- Svg Vector Icons : http://www.onlinewebfonts.com/icon -->
<!DOCTYPE svg PUBLIC "-//W3C//DTD SVG 1.1//EN" "http://www.w3.org/Graphics/SVG/1.1/DTD/svg11.dtd">
<svg version="1.1" xmlns="http://www.w3.org/2000/svg" xmlns:xlink="http://www.w3.org/1999/xlink" x="0px" y="0px" viewBox="0 0 1000 1000" enable-background="new 0 0 1000 1000" xml:space="preserve">
<metadata> Svg Vector Icons : http://www.onlinewebfonts.com/icon </metadata>
<g><path d="M842.2,233.7h-35.4V77.8c0-30.9-25-67.8-55.8-67.8H249c-30.8,0-55.8,37-55.8,67.8v155.8h-20.4c-76.9,0-147,74.6-147,151.7v340.2c0,58,41,101,87.9,118.8C114.6,925,180,990,260.8,990c78.4,0,142.3-61.4,146.7-138.8l209.4,0C621.1,928.5,685,990,763.5,990c81.2,0,147.1-65.9,147.1-147.1c0-3.5-0.5-6.8-0.7-10.2c36.2-21.7,64.3-59.3,64.3-107.1V385.4C974.1,308.3,919,233.7,842.2,233.7z M259.5,76.5h481v146.6h-481V76.5z M92.2,725.6V385.4c0-40.6,42.2-85.2,80.6-85.2h669.3c39.3,0,65.6,44.1,65.6,85.2v340.2c0,19.6-5.8,35-17.4,45.6c-11.3,10.4-28,15.9-48.3,15.9H172.8C132.8,787,92.2,765.9,92.2,725.6z M260.8,924c-41.9,0-76-31.9-80.2-72.7l160.4,0C336.8,892,302.7,924,260.8,924z M763.5,924c-41.9,0-76-32-80.2-72.8l160.4,0C839.5,892,805.4,924,763.5,924z"/><path d="M563.3,118.6H451.7c-15.4,0-27.9,12.5-27.9,28c0,15.4,12.5,28,27.9,28h111.6c15.4,0,27.9-12.5,27.9-28C591.1,131.2,578.7,118.6,563.3,118.6z"/><path d="M758.5,622c37.3,0,67.6-30.3,67.6-67.8c0-37.4-30.3-67.8-67.6-67.8c-37.3,0-67.6,30.3-67.6,67.8C690.9,591.7,721.1,622,758.5,622z"/><path d="M256.5,622c37.3,0,67.6-30.3,67.6-67.8c0-37.4-30.3-67.8-67.6-67.8c-37.3,0-67.6,30.3-67.6,67.8C188.9,591.7,219.1,622,256.5,622z"/></g>
</svg>