<?xml version="1.0" encoding="utf-8"?>
<!-- Svg Vector Icons : http://www.onlinewebfonts.com/icon -->
<!DOCTYPE svg PUBLIC "-//W3C//DTD SVG 1.1//EN" "http://www.w3.org/Graphics/SVG/1.1/DTD/svg11.dtd">
<svg version="1.1" xmlns="http://www.w3.org/2000/svg" xmlns:xlink="http://www.w3.org/1999/xlink" x="0px" y="0px" viewBox="0 0 1000 1000" enable-background="new 0 0 1000 1000" xml:space="preserve">
<metadata> Svg Vector Icons : http://www.onlinewebfonts.com/icon </metadata>
<g><g><path d="M309,518.6c-1.8-2.6-4.6-4.3-7.8-4.5l-126.6-10.6c-3.3-0.3-6.7,1.1-8.8,3.6c-2.2,2.6-3,6-2.2,9.3l14.2,57.2c1,4.1,4.4,7.2,8.6,7.8l160.7,24.3c0.5,0.1,1,0.1,1.6,0.1c3.6,0,6.9-1.8,8.9-4.9c2.2-3.5,2.1-8-0.2-11.5L309,518.6z M196.5,561.8l-9-36.2l107,9l32,46.9L196.5,561.8z"/><path d="M979.5,347.1H861.3c-4.1,0-7.8,2.3-9.5,6L830.8,398c-1.9-3.3-3.9-6.6-5.9-10c-63.9-108.5-108.6-179.6-147.1-179.8l-177.6-2.7c-0.2,0-0.3,0-0.5,0l-0.7,0l-0.7,0c-0.1,0-0.2,0-0.2,0c-0.1,0-0.2,0-0.3,0l-177.3,2.7c-38.7,0.2-83.4,71.3-147.3,179.7c-1.6,2.8-3.2,5.4-4.8,8.1l-20.2-43c-1.7-3.7-5.4-6-9.5-6H20.5c-5.8,0-10.5,4.7-10.5,10.5v64.5c0,5.8,4.6,10.4,10.4,10.5l125.8,0.8c-11.6,19.7-22.2,40.6-24,66.1c-3.8,48,9.4,155.3,24.3,231.3c1.4,7.4,7.9,12.7,15.4,12.7c0,0,0,0,0,0l1.3,0V784c0,5.8,4.7,10.5,10.5,10.5h143.9c5.8,0,10.5-4.7,10.5-10.5v-41l170.9-0.4l172.8,0.4V784c0,5.8,4.7,10.5,10.5,10.5h143.9c5.8,0,10.5-4.7,10.5-10.5v-40.6c7.3-0.3,13.4-5.5,14.8-12.6c15-76,28.2-183.4,24.4-231.2c-1.8-25.6-12.4-46.5-24-66.2l127.8-0.8c5.8,0,10.4-4.7,10.4-10.5v-64.5C990,351.8,985.3,347.1,979.5,347.1z M307.2,773.5H184.3v-27h122.9V773.5z M200.2,403.9c31.4-53.3,96.6-164.1,120.5-164.3L499,237l178.5,2.7c23.7,0.1,89,111,120.4,164.3c5.8,9.8,11.4,19.3,16.7,28.3l2.3,3.8H181.2l2.3-3.8C188.8,423.3,194.4,413.7,200.2,403.9z M30.9,368H132l20.9,44.4l-121.9-0.7V368z M815.7,773.5H692.8v-27h122.9V773.5z M823.1,712l-323-0.8c0,0,0,0-0.1,0c0,0,0,0,0,0l-0.9,0l-0.9,0c0,0,0,0,0,0c0,0,0,0-0.1,0L175,712c-13.3-71.5-24.8-167.9-21.4-210.2c1.1-16.1,7.2-30.2,15.3-44.8c0.2,0,0.3,0.1,0.5,0.1h659.8c8.1,14.6,14.2,28.7,15.3,44.9C847.9,544,836.4,640.5,823.1,712z M969.1,411.7l-121.9,0.7L868,368h101.1V411.7L969.1,411.7z"/><path d="M825.3,503.5l-126.6,10.6c-3.1,0.3-6,1.9-7.8,4.5l-48.4,70.9c-2.3,3.4-2.4,7.9-0.2,11.5c1.9,3.1,5.3,4.9,8.9,4.9c0.5,0,1,0,1.6-0.1l160.7-24.3c4.2-0.6,7.6-3.7,8.6-7.8l14.2-57.2c0.8-3.3,0-6.7-2.2-9.3C832,504.5,828.7,503.2,825.3,503.5z M803.5,561.8l-130.1,19.7l32-46.9l107-9L803.5,561.8z"/></g><g></g><g></g><g></g><g></g><g></g><g></g><g></g><g></g><g></g><g></g><g></g><g></g><g></g><g></g><g></g></g>
</svg>