<?xml version="1.0" encoding="utf-8"?>
<!-- Svg Vector Icons : http://www.onlinewebfonts.com/icon -->
<!DOCTYPE svg PUBLIC "-//W3C//DTD SVG 1.1//EN" "http://www.w3.org/Graphics/SVG/1.1/DTD/svg11.dtd">
<svg version="1.1" xmlns="http://www.w3.org/2000/svg" xmlns:xlink="http://www.w3.org/1999/xlink" x="0px" y="0px" viewBox="0 0 1000 1000" enable-background="new 0 0 1000 1000" xml:space="preserve">
<metadata> Svg Vector Icons : http://www.onlinewebfonts.com/icon </metadata>
<g><g transform="translate(0.000000,511.000000) scale(0.100000,-0.100000)"><path d="M4617.4,4998.2C2578.5,4839.7,797.7,3363,274,1390.5C18.5,424.8,44-528.2,353.2-1453.1c580-1745,2061.8-3002.1,3878.4-3293.4c132.9-23,245.3-38.3,247.8-33.2c2.6,2.6,12.8,94.5,23,201.9l17.9,199.3h-69c-130.3,0-587.6,104.7-884,204.4C2047.1-3668.3,928-2398.5,575.4-776.1C524.3-541,519.2-436.3,516.7,92.6c0,526.3,7.7,633.6,58.8,876.3c406.2,1931.6,1918.8,3354.7,3832.4,3607.6C5636.8,4740.1,6881.1,4385,7852,3590.4c253-204.4,605.5-585.1,809.9-868.7c201.9-283.6,495.7-861,603-1185.5c252.9-781.8,296.4-1596.8,125.2-2388.9c-79.2-375.6-186.5-672-378.1-1060.3c-536.5-1080.8-1464-1888.1-2608.6-2268.8c-255.5-86.9-751.2-196.7-878.9-196.7c-58.8,0-61.3-5.1-48.5-122.6c7.7-66.4,17.9-158.4,25.6-207l12.8-84.3l120.1,17.9c1103.8,155.8,2049.1,623.4,2818.1,1392.5c1793.6,1793.6,1939.2,4642.4,332.1,6602C7775.3,4448.8,6204,5120.8,4617.4,4998.2z"/><path d="M4681.3,3577.6c-1389.9-150.7-2560.1-1096.1-2971.4-2404.2c-232.5-730.7-222.3-1522.7,25.5-2225.4c393.5-1116.5,1323.5-1952,2483.4-2227.9c112.4-28.1,207-46,212.1-40.9c12.8,12.8,58.8,273.4,58.8,334.7c0,48.5-17.9,61.3-107.3,76.6c-176.3,30.7-536.5,155.8-740.9,258C2798.3-2227.3,2226-1486.3,2003.7-533.3c-69,309.1-76.7,924.9-10.2,1234c132.9,623.4,408.8,1137,848.3,1579C3735.9,3179,5056.9,3434.5,6227,2931.2c674.5-291.3,1295.4-912.1,1591.7-1599.4c163.5-373,224.8-659.2,240.2-1088.4c20.4-567.2-58.8-988.8-273.4-1448.6c-278.5-595.3-799.7-1129.3-1392.5-1435.9c-212.1-107.3-597.8-242.7-779.3-270.8c-99.6-15.3-107.3-23-92-86.9c5.1-38.3,20.4-127.8,30.7-199.3c15.3-117.5,23-130.3,71.5-120.1c28.1,7.7,132.9,30.7,227.4,51.1c258.1,56.2,666.9,224.8,924.9,378.1c1093.5,651.5,1745,1854.9,1691.4,3122.2c-7.7,184-33.2,426.7-56.2,544.2c-130.3,666.9-472.7,1308.1-958.1,1793.6c-633.6,633.6-1453.8,986.2-2350.6,1009.2C4926.6,3585.3,4737.5,3582.7,4681.3,3577.6z"/><path d="M4752.8,2134c-518.7-61.3-1047.5-365.4-1356.7-781.8c-508.4-674.5-564.6-1540.6-150.8-2281.6c145.6-258.1,475.2-590.2,738.4-735.8c109.9-61.3,212.1-107.3,229.9-102.2c17.9,7.7,61.3,84.3,97.1,176.3l66.4,163.5l-181.4,107.3c-350,204.4-608.1,518.7-743.5,914.7c-63.9,178.8-71.5,242.7-71.5,511c0,268.3,7.7,332.1,71.5,511c229.9,661.7,781.8,1085.9,1471.7,1129.3c283.6,17.9,536.5-35.8,817.6-173.8c408.8-204.4,753.7-636.2,858.5-1085.9c61.3-265.7,40.9-682.2-46-924.9c-132.9-367.9-431.8-720.5-761.4-896.8c-84.3-46-153.3-86.9-153.3-92c0-46,143.1-344.9,163.5-344.9c79.2,2.5,429.2,232.5,605.5,403.7c1042.5,993.9,756.3,2718.5-546.7,3329.1C5539.8,2111,5110.5,2177.5,4752.8,2134z"/><path d="M4783.5,902.6c-250.4-84.3-413.9-224.8-521.2-452.2c-94.5-204.4-92-490.5,5.1-695c76.6-158.4,212.1-293.8,380.7-383.2c92-48.6,148.2-58.8,352.6-58.8c201.9,0,260.6,10.2,347.5,56.2c235,125.2,360.2,278.5,434.3,534c107.3,373-84.3,784.4-444.6,950.4C5171.8,928.1,4929.1,951.1,4783.5,902.6z"/></g></g>
</svg>