<?xml version="1.0" encoding="utf-8"?>
<!-- Svg Vector Icons : http://www.onlinewebfonts.com/icon -->
<!DOCTYPE svg PUBLIC "-//W3C//DTD SVG 1.1//EN" "http://www.w3.org/Graphics/SVG/1.1/DTD/svg11.dtd">
<svg version="1.1" xmlns="http://www.w3.org/2000/svg" xmlns:xlink="http://www.w3.org/1999/xlink" x="0px" y="0px" viewBox="0 0 1000 1000" enable-background="new 0 0 1000 1000" xml:space="preserve">
<metadata> Svg Vector Icons : http://www.onlinewebfonts.com/icon </metadata>
<g><path d="M797,96.2c76,76,123,181,123,297c0,115.9-47,220.9-123.1,296.9l49.5,49.6C935.2,651.1,990,528.6,990,393.3c0-135.4-54.8-257.9-143.5-346.5L797,96.2z"/><path d="M10,393.3c0,135.3,54.9,257.8,143.6,346.5l49.5-49.6C127,614.2,80,509.2,80,393.3c0-116,47-221,123-297l-49.5-49.5C64.8,135.4,10,257.9,10,393.3z"/><path d="M747.5,145.7L698,195.3c50.7,50.7,82,120.7,82,198s-31.4,147.3-82,198l49.5,49.5C810.8,577.4,850,489.9,850,393.3C850,296.6,810.8,209.1,747.5,145.7z"/><path d="M150,393.3c0,96.7,39.2,184.2,102.5,247.4l49.5-49.5c-50.6-50.7-82-120.7-82-198s31.4-147.3,82-198l-49.4-49.5C189.2,209.1,150,296.6,150,393.3z"/><path d="M570,743.3v210H430v-210H290l210.1-210l209.9,210H570z"/><path d="M290,393.3c0,58,23.5,110.5,61.5,148.5l49.6-49.5c-25.3-25.3-41-60.3-41-99c0-38.6,15.7-73.6,41-99l-49.5-49.5C313.5,282.8,290,335.3,290,393.3z"/><path d="M599,294.3c25.3,25.3,41,60.3,41,99c0,38.7-15.7,73.7-41,99l49.5,49.5c38-38,61.5-90.5,61.5-148.5c0-58-23.5-110.5-61.5-148.5L599,294.3z"/><path d="M430,393.3c0,38.7,31.3,70,70,70c38.7,0,70-31.3,70-70c0-38.7-31.3-70-70-70C461.3,323.3,430,354.6,430,393.3z"/></g>
</svg>