[
  {
    "sensorConfiguration" : {

      "instanceDataMapper" : {
      },
      "sensorType" :{
        "typeId":"car",
        "label":"Car"
      },
      "configuration" : {
        "make" : {
          "type" : "text",
          "description" : "Enter Manufacturer Name",
          "label":"Make",
          "required":false,
          "autoComplete":false
        },
        "modelNo" : {
          "type" : "text",
          "description" : "Enter Model Number",
          "label":"Model Number",
          "required":false,
          "autoComplete":false
        },
        "registrationNumber" : {
          "type" : "text",
          "description" : "Enter Registration Number",
          "label":"Registration Number",
          "required":false,
          "autoComplete":false,
          "assetName":true
        },
        "vinNo" : {
          "type" : "text",
          "description" : "Enter Vin Number",
          "label":"Vin Number",
          "required":false,
          "autoComplete":false
        },
        "year" : {
          "type" : "Number",
          "description" : "Enter Manufactured Year",
          "label":"Year",
          "required":false,
          "autoComplete":false
        }
      }
    }
  },
  {
    "sensorConfiguration" : {
      "sensorType" :{
        "typeId":"driver",
        "label":"Driver"
      },
      "configuration" : {
        "driverId" : {
          "type" : "text",
          "assetName":true,
          "description" : "Enter Driver Id",
          "label":"Driver Id",
          "required":false,
          "autoComplete":true
        },
        "nationality" : {
          "type" : "text",
          "description" : "Enter Nationality",
          "label":"Nationality",
          "required":false,
          "autoComplete":true
        },
        "gender" : {
          "type" : "dropDown",
          "description" : "Enter Driver Name",
          "label":"Driver Name",
          "required":false,
          "autoComplete":true,
          "value":{
            "dropDownValues": ["Male","Female"],
            "defaultValue":"Male"
          }
        },
        "department" : {
          "type" : "text",
          "description" : "Enter Department",
          "label":"Department",
          "required":false,
          "autoComplete":true
        },
        "dateOfJoin" : {
          "type" : "date",
          "description" : "Enter Date Of Join",
          "label":"Date Of Join",
          "required":false,
          "autoComplete":true
        },
        "accommodation" : {
          "type" : "date",
          "description" : "Enter Your Accommodation",
          "label":"Accommodation",
          "required":false,
          "autoComplete":true
        },
        "licenceNo" : {
          "type" : "text",
          "description" : "Enter Licence No",
          "label":"Licence No",
          "required":false,
          "autoComplete":true
        },
        "mobileNo" : {
          "type" : "number",
          "description" : "Enter Mobile No",
          "label":"Mobile No",
          "required":false,
          "autoComplete":true
        },
        "dutyType" : {
          "type" : "dropDown",
          "description" : "Enter Duty Type",
          "label":"Duty Type",
          "required":false,
          "value":{
            "dropDownValues": ["Hatta Taxi","Ladies and Family","Limousine","Off-road","Public Taxi","Special Needs"],
            "defaultValue":"Hatta Taxi"
          },
          "autoComplete":false
        }
      },
      "instanceDataMapper":{
      }

    }
  },
  {
    "sensorConfiguration" : {
      "sensorType" :{
        "typeId":"rfIdTag",
        "label":"RFID Tag"
      },
      "configuration" : {
        "make" : {
          "type" : "text",
          "description" : "Enter Manufacturer Name",
          "label":"Make",
          "required":false,
          "autoComplete":true
        },
        "modelNo" : {
          "type" : "text",
          "description" : "Enter Model Number",
          "label":"Model Number",
          "required":false,
          "autoComplete":true
        },
        "type" : {
          "type" : "dropDown",
          "description" : "Enter Model Number",
          "label":"Model Number",
          "required":false,
          "value":{
            "dropDownValues":["Active","Passive"],
            "defaultValue":"Active"
          },
          "autoComplete":false
        },
        "uniqueIdentifier" : {
          "type" : "text",
          "description" : "Enter Unique Identifier",
          "label":"Unique Identifier",
          "required":false,
          "autoComplete":false,
          "assetName":true
        }
      },
      "instanceDataMapper":{
      }

    }
  },
  {
    "sensorConfiguration" : {
      "sensorType" :{
        "typeId":"obdDevice",
        "label":"Obd Device"
      },
      "configuration" : {
        "make" : {
          "type" : "text",
          "description" : "Enter Manufacturer Name",
          "label":"Make",
          "required":false,
          "autoComplete":true
        },
        "modelNo" : {
          "type" : "text",
          "description" : "Enter Model Number",
          "label":"Model Number",
          "required":false,
          "autoComplete":true
        },
        "uniqueIdentifier" : {
          "type" : "text",
          "description" : "Unique Identifier",
          "label":"IMEI Number / UId",
          "required":false,
          "autoComplete":false
        },
        "gsmId" : {
          "type" : "text",
          "description" : "Enter GSM Id",
          "label":"GSM Id",
          "required":false,
          "autoComplete":false,
          "assetName":true
        }
      },
      "instanceDataMapper":{
      }

    }
  },
  {
    "sensorConfiguration" : {
      "sensorType" :{
        "typeId":"obdDevice",
        "label":"Obd Device"
      },
      "configuration" : {
        "make" : {
          "type" : "text",
          "description" : "Enter Manufacturer Name",
          "label":"Make",
          "required":false,
          "autoComplete":true
        },
        "modelNo" : {
          "type" : "text",
          "description" : "Enter Model Number",
          "label":"Model Number",
          "required":false,
          "autoComplete":true
        },
        "uniqueIdentifier" : {
          "type" : "text",
          "description" : "Unique Identifier",
          "label":"IMEI Number / UId",
          "required":false,
          "autoComplete":false
        },
        "gsmId" : {
          "type" : "text",
          "description" : "Enter GSM Id",
          "label":"GSM Id",
          "required":false,
          "autoComplete":false,
          "assetName":true
        }
      },
      "instanceDataMapper":{
      }

    }
  },
  {
    "sensorConfiguration" : {
      "sensorType" :{
        "typeId":"beacon",
        "label":"Beacon"
      },
      "configuration" : {
        "beaconType" : {
          "type" : "text",
          "description" : "Enter Manufacturer Name",
          "label":"Make",
          "required":false,
          "autoComplete":true
        },
        "beaconId" : {
          "type" : "text",
          "description" : "Enter Model Number",
          "label":"Model Number",
          "required":false,
          "autoComplete":true
        }
      }

    }
  }
]