{
  "apps":[
    {
      "name": "iot_server",
      "script": "./iotServer",
      "min_uptime": "15s",
      "max_restarts": 12,
      "watch":false,
      "autorestart":true,
      "vizion":false,
      "env": {
        "NODE_ENV": "dtc_binary"
      }
    },{
      "name": "mqttBroker",
      "script": "./mqttBroker.js",
      "min_uptime": "15s",
      "max_restarts": 12,
      "watch":false,
      "autorestart":true
    }]
}


