<?xml version="1.0" standalone="no"?>
<!DOCTYPE svg PUBLIC "-//W3C//DTD SVG 1.1//EN" "http://www.w3.org/Graphics/SVG/1.1/DTD/svg11.dtd" >
<svg xmlns="http://www.w3.org/2000/svg">
    <metadata></metadata>
    <defs>
        <font id="robotothin" horiz-adv-x="1121">
            <font-face units-per-em="2048" ascent="1536" descent="-512"/>
            <missing-glyph horiz-adv-x="490"/>
            <glyph unicode="&#xfb01;" horiz-adv-x="1067"
                   d="M66 1027v55h188v158q0 163 85.5 252t237.5 89q67 0 135 -13.5t133 -43.5l-8 -52q-66 29 -121.5 42t-137.5 13q-126 0 -198 -76t-72 -211v-158h286v-55h-286v-1027h-54v1027h-188zM830 0v1082h54v-1082h-54z"/>
            <glyph horiz-adv-x="2048"/>
            <glyph horiz-adv-x="2048"/>
            <glyph unicode="&#xd;" horiz-adv-x="490"/>
            <glyph horiz-adv-x="0"/>
            <glyph unicode="&#x9;" horiz-adv-x="0"/>
            <glyph unicode=" " horiz-adv-x="490"/>
            <glyph unicode="&#x09;" horiz-adv-x="490"/>
            <glyph unicode="&#xa0;" horiz-adv-x="490"/>
            <glyph unicode="!" horiz-adv-x="397" d="M147 0v134h95v-134h-95zM167 478v978h54v-978h-54z"/>
            <glyph unicode="&#x22;" horiz-adv-x="610"
                   d="M156 1018l45 268v170h55v-167l-50 -271h-50zM337 1018l46 268v170h54v-167l-50 -271h-50z"/>
            <glyph unicode="#" horiz-adv-x="1265"
                   d="M65 410v52h281l95 524h-300v54h310l75 416h56l-76 -416h365l76 416h56l-76 -416h254v-54h-264l-96 -524h285v-52h-294l-75 -410h-56l75 410h-364l-74 -410h-56l74 410h-271zM402 462h363l96 524h-365z"/>
            <glyph unicode="$"
                   d="M127 403l2 6h46q0 -199 121.5 -288t289.5 -89q163 0 262 92t99 220q0 130 -79 205.5t-292 152.5q-215 71 -311.5 156t-96.5 252q0 160 104.5 259.5t281.5 106.5v187h55v-187q181 -10 281.5 -120.5t97.5 -303.5l-2 -5h-47q0 166 -95 271.5t-265 105.5q-174 0 -265.5 -91.5 t-91.5 -220.5q0 -131 73.5 -208t297.5 -150q210 -73 309 -158t99 -250q0 -161 -104 -258.5t-277 -107.5v-188h-55v187q-189 6 -316 108t-122 316z"/>
            <glyph unicode="%" horiz-adv-x="1527"
                   d="M114 1099v77q0 126 76 213.5t196 87.5q119 0 195 -87.5t76 -213.5v-77q0 -126 -75.5 -212.5t-193.5 -86.5q-122 0 -198 86.5t-76 212.5zM169 1099q0 -100 56.5 -172t162.5 -72q102 0 158 72t56 172v77q0 100 -56.5 173t-159.5 73t-160 -73.5t-57 -172.5v-77zM417 162 l711 1138l45 -31l-711 -1138zM870 279v78q0 125 75.5 212.5t195.5 87.5t196 -87t76 -213v-78q0 -126 -75.5 -213t-194.5 -87q-121 0 -197 87t-76 213zM925 279q0 -101 56 -173t162 -72q103 0 159 72t56 173v78q0 106 -56 175.5t-161 69.5q-103 0 -159.5 -70t-56.5 -175v-78z "/>
            <glyph unicode="&#x26;" horiz-adv-x="1247"
                   d="M115 352q0 114 67.5 211t188.5 199l51 41q-82 103 -121 188t-39 176q0 149 81.5 229.5t223.5 80.5q132 0 204 -72t72 -190q0 -84 -38.5 -142.5t-108.5 -114.5l-202 -161l475 -540q54 76 84.5 171t30.5 204h55q0 -125 -35 -227.5t-98 -188.5l185 -211l-2 -5h-60l-157 177 l-8 -8t-4 -5q-90 -89 -188.5 -137t-222.5 -48q-202 0 -318 100.5t-116 272.5zM169 352q0 -134 98 -226.5t282 -92.5q110 0 211 47.5t177 135.5l-449 509q-8 8 -15.5 17t-18.5 22l-52 -41q-137 -118 -185 -205.5t-48 -165.5zM317 1169q0 -79 35 -163t110 -172l209 166 q60 50 88 103.5t28 111.5q0 94 -56.5 151t-163.5 57q-120 0 -185 -72.5t-65 -181.5z"/>
            <glyph unicode="'" horiz-adv-x="406" d="M156 1018l45 267v171h55v-169l-50 -269h-50z"/>
            <glyph unicode="(" horiz-adv-x="607"
                   d="M148 566v20q0 338 120.5 632.5t290.5 397.5h6l16 -36q-153 -101 -266 -387.5t-113 -602.5v-26q0 -317 113 -603.5t266 -387.5l-16 -36h-6q-172 105 -291.5 390.5t-119.5 638.5z"/>
            <glyph unicode=")" horiz-adv-x="623"
                   d="M28 -427q152 101 265.5 387.5t113.5 603.5v26q0 316 -113.5 602.5t-265.5 387.5l16 36h6q169 -103 290 -397.5t121 -632.5v-20q0 -353 -120 -638.5t-291 -390.5h-6z"/>
            <glyph unicode="*" horiz-adv-x="856"
                   d="M90 799l18 54l302 -93l-7 324l56 -2l1 -325l292 105l20 -53l-300 -97l189 -257l-47 -33l-182 262l-178 -265l-45 32l184 264z"/>
            <glyph unicode="+" horiz-adv-x="1151" d="M73 649v53h462v504h55v-504h481v-53h-481v-503h-55v503h-462z"/>
            <glyph unicode="," horiz-adv-x="383" d="M114 -258l67 246v171h54v-167l-70 -250h-51z"/>
            <glyph unicode="-" horiz-adv-x="807" d="M99 599v54h590v-54h-590z"/>
            <glyph unicode="." horiz-adv-x="439" d="M173 0v130h86v-130h-86z"/>
            <glyph unicode="/" horiz-adv-x="782" d="M42 -125l608 1581h59l-608 -1581h-59z"/>
            <glyph unicode="0"
                   d="M117 514v428q0 250 116.5 392.5t326.5 142.5q209 0 326.5 -142.5t117.5 -392.5v-428q0 -251 -116 -393t-326 -142q-209 0 -327 142.5t-118 392.5zM171 516q0 -217 101.5 -350t289.5 -133q187 0 287.5 132.5t100.5 350.5v426q0 220 -101 350.5t-289 130.5 q-189 0 -289 -130.5t-100 -350.5v-426z"/>
            <glyph unicode="1" d="M194 1347v46l422 84v-1477h-54v1425z"/>
            <glyph unicode="2"
                   d="M136 1052q-5 177 111.5 301t311.5 124q179 0 284.5 -102t105.5 -289q0 -121 -78.5 -247t-221.5 -293l-417 -487l2 -5h793v-54h-871v54l497 572q133 154 187 257.5t54 202.5q0 162 -82 249.5t-253 87.5q-179 0 -277 -105t-98 -272h-46z"/>
            <glyph unicode="3"
                   d="M109 399l2 6h46q0 -162 118.5 -267t297.5 -105q180 0 280 92.5t100 256.5q0 170 -114.5 251.5t-310.5 81.5h-111v56h111q183 0 288 91t105 224q0 147 -90.5 242t-266.5 95q-162 0 -269 -95t-107 -253h-46l-2 6q-5 177 118.5 286.5t305.5 109.5q188 0 299.5 -106.5 t111.5 -288.5q0 -115 -72.5 -206t-195.5 -131q142 -35 221 -127t79 -232q0 -190 -121 -298.5t-313 -108.5q-185 0 -327 109.5t-137 310.5z"/>
            <glyph unicode="4"
                   d="M72 397v30l695 1029h65v-1005h252v-54h-252v-397h-54v397h-706zM156 451h622v929l-6 2l-78 -129z"/>
            <glyph unicode="5"
                   d="M184 377l2 6h47q0 -172 96 -261t261 -89q194 0 284.5 107t90.5 322q0 184 -90.5 290t-253.5 106q-160 0 -251.5 -53.5t-131.5 -158.5l-41 16l78 794h690v-53h-641l-61 -618q63 63 137.5 95t219.5 36q174 5 287 -119t113 -333q0 -223 -105 -354t-325 -131 q-177 0 -294 100.5t-112 297.5z"/>
            <glyph unicode="6"
                   d="M170 512v448q0 228 127 372.5t316 144.5q78 0 155 -16.5t140 -53.5l-21 -51q-65 37 -126.5 52t-147.5 15q-166 0 -277.5 -126.5t-111.5 -335.5v-299q49 110 155.5 182.5t244.5 72.5q198 0 304.5 -126.5t106.5 -350.5q0 -204 -120.5 -332.5t-310.5 -128.5t-312 145.5 t-122 387.5zM224 513q0 -216 106 -348.5t274 -132.5q169 0 273 117t104 291q0 206 -90 314.5t-274 108.5q-154 0 -273 -103t-119 -244h-1v-3z"/>
            <glyph unicode="7"
                   d="M87 1402v54h930v-54q-219 -246 -365 -561t-146 -710v-131h-54v131q0 362 134 683t366 588h-865z"/>
            <glyph unicode="8"
                   d="M98 389q0 132 87.5 230.5t230.5 135.5q-125 37 -201 128t-76 213q0 182 122 281.5t310 99.5q177 0 295 -100t118 -281q0 -122 -73.5 -213t-191.5 -128q136 -38 221.5 -136t85.5 -230q0 -192 -130 -301t-323 -109q-206 0 -340.5 108.5t-134.5 301.5zM152 384 q0 -161 120 -256t301 -95q168 0 283 95.5t115 255.5q0 153 -116.5 248.5t-283.5 95.5q-178 0 -298.5 -95.5t-120.5 -248.5zM193 1101q0 -145 108.5 -232t271.5 -87q150 0 253.5 87.5t103.5 231.5q0 142 -105 232t-254 90q-163 0 -270.5 -86.5t-107.5 -235.5z"/>
            <glyph unicode="9"
                   d="M95 988q0 206 122.5 347.5t313.5 141.5q196 0 319 -133t123 -381v-503q0 -224 -121 -352.5t-320 -128.5q-71 0 -144 16t-149 47l16 50q66 -32 129.5 -45.5t147.5 -13.5q175 0 277 113t102 312v292q-56 -104 -158.5 -163t-229.5 -59q-189 0 -308.5 133t-119.5 327z M157 988q0 -169 99.5 -288t266.5 -119q149 0 249 79.5t139 193.5v108q0 222 -104.5 341.5t-271.5 119.5q-168 0 -273 -129.5t-105 -305.5z"/>
            <glyph unicode=":" horiz-adv-x="364" d="M146 0v130h86v-130h-86zM146 949v130h86v-130h-86z"/>
            <glyph unicode=";" horiz-adv-x="364"
                   d="M115 -258l67 246v171h54v-167l-70 -250h-51zM153 952v130h86v-130h-86z"/>
            <glyph unicode="&#x3c;" horiz-adv-x="1053"
                   d="M82 515v50l837 378v-58l-661 -308l-119 -37v-6l119 -36l661 -303v-59z"/>
            <glyph unicode="=" horiz-adv-x="1142" d="M147 436v54h834v-54h-834zM147 843v54h834v-54h-834z"/>
            <glyph unicode="&#x3e;" horiz-adv-x="1053"
                   d="M114 137v59l660 307l118 36v6l-118 37l-660 304v58l836 -378v-50z"/>
            <glyph unicode="?" horiz-adv-x="893"
                   d="M98 1122q-2 170 96.5 262.5t253.5 92.5q164 0 258.5 -101t94.5 -266q0 -141 -62.5 -243t-190.5 -217q-69 -53 -84 -101.5t-15 -148.5h-54q1 117 20.5 165.5t104.5 126.5q121 116 174 197.5t53 222.5q0 146 -78 229t-221 83q-142 0 -220 -84.5t-81 -223.5h-46zM391 0v106 h82v-106h-82z"/>
            <glyph unicode="@" horiz-adv-x="1902"
                   d="M129 478q18 427 255.5 680t616.5 253q402 0 592.5 -234t173.5 -654q-10 -219 -114 -381.5t-296 -162.5q-83 0 -135 61t-61 169q-55 -114 -139 -172t-193 -58q-136 0 -203 119t-48 318q23 250 144 401t293 151q83 0 135 -27.5t115 -82.5l-49 -565q-11 -152 36.5 -205.5 t107.5 -53.5q158 0 248.5 134.5t101.5 354.5q20 396 -154 613.5t-559 217.5q-336 0 -564.5 -239.5t-248.5 -636.5q-20 -383 174.5 -629.5t551.5 -246.5q87 0 177.5 22t152.5 58l24 -46q-62 -40 -164 -64.5t-194 -24.5q-380 0 -588 249.5t-189 681.5zM632 416 q-19 -167 31.5 -275t163.5 -108q108 0 194 66.5t144 245.5l42 486q-34 39 -82.5 60.5t-112.5 21.5q-142 0 -248 -126.5t-132 -370.5z"/>
            <glyph unicode="A" horiz-adv-x="1223"
                   d="M34 0l544 1456h66l545 -1456h-59l-163 435h-711l-163 -435h-59zM276 489h671l-305 815l-28 85h-6l-27 -85z"/>
            <glyph unicode="B" horiz-adv-x="1230"
                   d="M200 0v1456h383q226 0 351 -93t125 -280q0 -122 -59.5 -208t-168.5 -115l-1 -6q129 -17 217 -118.5t88 -234.5q0 -191 -123.5 -296t-326.5 -105h-485zM254 54h431q184 0 290 91t106 254q0 144 -107 232t-289 88h-431v-665zM254 773h368q189 3 285.5 81t96.5 233 q0 156 -106.5 235.5t-314.5 79.5h-329v-629z"/>
            <glyph unicode="C" horiz-adv-x="1327"
                   d="M144 619v218q0 286 144 463t383 177q227 0 367 -119q136 -116 136 -328v-12l-2 -6h-46q0 197 -122.5 304t-332.5 107q-213 0 -343 -161t-130 -423v-220q0 -265 130 -425.5t343 -160.5q210 0 332.5 103t122.5 310h46l2 -6v-12q0 -214 -136 -330q-140 -118 -367 -119 q-239 0 -383 176.5t-144 463.5z"/>
            <glyph unicode="D" horiz-adv-x="1370"
                   d="M200 0v1456h433q251 0 426 -180t175 -459v-178q0 -280 -175 -459.5t-426 -179.5h-433zM254 54h379q227 0 387 166t160 419v181q0 250 -160 416t-387 166h-379v-1348z"/>
            <glyph unicode="E" horiz-adv-x="1129" d="M200 0v1456h856v-54h-802v-616h700v-54h-700v-678h802v-54h-856z"/>
            <glyph unicode="F" horiz-adv-x="1127" d="M200 0v1456h872v-54h-818v-630h716v-56h-716v-716h-54z"/>
            <glyph unicode="G" horiz-adv-x="1429"
                   d="M168 620v238q0 274 151 446.5t393 172.5q233 0 372 -120q133 -116 133 -295v-13l-2 -6h-45q0 167 -119.5 273.5t-338.5 106.5q-221 0 -355.5 -157.5t-134.5 -405.5v-240q0 -260 139 -423.5t368 -163.5q175 0 288.5 57t154.5 131v414h-445v55h499v-494 q-46 -78 -176.5 -147.5t-320.5 -69.5q-250 0 -405.5 178t-155.5 463z"/>
            <glyph unicode="H" horiz-adv-x="1438" d="M200 0v1456h54v-707h930v707h54v-1456h-54v695h-930v-695h-54z"/>
            <glyph unicode="I" horiz-adv-x="534" d="M240 0v1456h54v-1456h-54z"/>
            <glyph unicode="J" horiz-adv-x="1122"
                   d="M93 395l2 6h46q0 -189 95.5 -278.5t282.5 -89.5q153 0 253.5 105t100.5 284v1034h54v-1034q0 -203 -114 -323t-294 -120q-200 0 -315 106q-111 102 -111 293v17z"/>
            <glyph unicode="K" horiz-adv-x="1227"
                   d="M200 0v1456h54v-682h198l598 682h64l2 -5l-619 -711l695 -734l-3 -6h-63l-689 721h-183v-721h-54z"/>
            <glyph unicode="L" horiz-adv-x="1130" d="M200 0v1456h55v-1402h787v-54h-842z"/>
            <glyph unicode="M" horiz-adv-x="1756"
                   d="M200 0v1456h75l606 -1370h6l608 1370h61v-1456h-54v1323l-6 1l-590 -1324h-43l-603 1353l-6 -1v-1352h-54z"/>
            <glyph unicode="N" horiz-adv-x="1449"
                   d="M200 0v1456h55l934 -1353l6 2v1351h54v-1456h-54l-934 1356l-6 -2v-1354h-55z"/>
            <glyph unicode="O" horiz-adv-x="1364"
                   d="M133 619v218q0 294 145.5 467t402.5 173q256 0 403 -173t147 -467v-218q0 -295 -146 -467.5t-402 -172.5q-257 0 -403.5 172.5t-146.5 467.5zM188 619q0 -270 128.5 -428t366.5 -158t366 157.5t128 428.5v220q0 268 -129 426t-367 158q-237 0 -365 -158t-128 -426v-220z "/>
            <glyph unicode="P" horiz-adv-x="1230"
                   d="M200 0v1456h455q226 0 348 -113.5t122 -301.5q0 -190 -121.5 -303t-348.5 -113h-401v-625h-54zM254 679h401q207 0 311.5 103t104.5 257q0 158 -104 260.5t-312 102.5h-401v-723z"/>
            <glyph unicode="Q" horiz-adv-x="1364"
                   d="M133 619v218q0 294 145.5 467t402.5 173q256 0 403 -173t147 -467v-218q0 -151 -39.5 -272t-114.5 -205l246 -240l-39 -35l-246 236q-70 -61 -159 -92.5t-196 -31.5q-257 0 -403.5 172.5t-146.5 467.5zM188 619q0 -270 128.5 -428t366.5 -158t366 157.5t128 428.5v220 q0 268 -129 426t-367 158q-237 0 -365 -158t-128 -426v-220z"/>
            <glyph unicode="R" horiz-adv-x="1364"
                   d="M195 -1v1456h474q230 0 354 -99.5t124 -290.5q0 -123 -78.5 -223.5t-214.5 -130.5q157 -27 225 -115t68 -225v-137q0 -68 16.5 -122t54.5 -88v-25h-53q-36 41 -54 101.5t-18 135.5v133q0 148 -101.5 231t-289.5 83h-453v-684h-54zM249 737h410q223 0 328.5 94t105.5 234 q0 163 -106.5 249.5t-317.5 86.5h-420v-664z"/>
            <glyph unicode="S" horiz-adv-x="1223"
                   d="M89 404l2 6h45q0 -198 146 -287.5t337 -89.5t316 88.5t125 221.5q0 125 -102.5 201.5t-349.5 157.5q-246 75 -362.5 159t-116.5 249q0 164 136.5 265.5t346.5 101.5q218 0 350 -112q129 -109 129 -301v-12l-2 -6h-46q0 163 -120 270t-311 107q-197 0 -313 -92.5 t-116 -218.5t93.5 -204.5t348.5 -153.5q248 -78 369 -162t121 -247q0 -166 -143 -266t-353 -100q-219 1 -377 103q-153 99 -153 309v13z"/>
            <glyph unicode="T" horiz-adv-x="1224" d="M57 1402v54h1110v-54h-510v-1402h-54v1402h-546z"/>
            <glyph unicode="U" horiz-adv-x="1365"
                   d="M185 489v967h54v-967q0 -207 125.5 -331.5t318.5 -124.5q192 0 317.5 124.5t125.5 331.5v967h54v-967q0 -240 -139 -375t-358 -135q-220 0 -359 135.5t-139 374.5z"/>
            <glyph unicode="V" horiz-adv-x="1223" d="M35 1456h59l489 -1314l26 -79h6l26 79l489 1314h59l-544 -1456h-66z"/>
            <glyph unicode="W" horiz-adv-x="1855"
                   d="M61 1456h60l302 -1116l63 -236h6l63 236l344 1116h60l342 -1116l62 -236h6l65 236l300 1116h59l-392 -1456h-61l-361 1214l-48 145h-6l-46 -145l-364 -1214h-61z"/>
            <glyph unicode="X" horiz-adv-x="1223"
                   d="M53 0l524 743l-504 713h68l469 -671l471 671h67l-503 -713l524 -743h-67l-492 701l-491 -701h-66z"/>
            <glyph unicode="Y" horiz-adv-x="1223"
                   d="M36 1456h66l481 -809l26 -50l27 50l483 809h66l-547 -903v-553h-55v553z"/>
            <glyph unicode="Z" horiz-adv-x="1224" d="M94 0v44l929 1359h-889v53h964v-38l-930 -1364h962v-54h-1036z"/>
            <glyph unicode="[" horiz-adv-x="439" d="M181 -312v1976h283v-54h-229v-1868h229v-54h-283z"/>
            <glyph unicode="\" horiz-adv-x="774" d="M57 1456h58l608 -1581h-58z"/>
            <glyph unicode="]" horiz-adv-x="439" d="M-8 -258h228v1868h-228v54h283v-1976h-283v54z"/>
            <glyph unicode="^" horiz-adv-x="849"
                   d="M91 729l299 727h52l299 -727h-61l-222 543l-40 114h-6l-43 -114l-219 -543h-59z"/>
            <glyph unicode="_" horiz-adv-x="845" d="M-1 0h846v-54h-846v54z"/>
            <glyph unicode="`" horiz-adv-x="537" d="M103 1513l2 5h89l220 -261l-2 -5h-75z"/>
            <glyph unicode="a" horiz-adv-x="1081"
                   d="M92 284q0 136 128.5 228t321.5 92h309v158q0 135 -86.5 210.5t-243.5 75.5q-147 0 -236.5 -71t-89.5 -183l-45 2l-2 5v14q0 117 98 199q104 88 275 88q174 0 279 -88t105 -254v-542q0 -57 6.5 -111t21.5 -107h-60q-13 71 -17.5 106.5t-4.5 76.5v17q-56 -98 -167 -159.5 t-269 -61.5q-151 0 -237 82.5t-86 222.5zM146 280q0 -109 73.5 -178.5t195.5 -69.5q161 0 272.5 71t163.5 203v243h-306q-168 0 -283.5 -77.5t-115.5 -191.5z"/>
            <glyph unicode="b"
                   d="M170 304v441v1.5t2 6.5v807h54v-668q54 98 146 154t219 56q191 0 299.5 -151.5t108.5 -408.5v-21q0 -250 -108 -396t-298 -146q-127 0 -221.5 51t-147.5 137l-7 -167h-45v295q-1 3 -1.5 5t-0.5 4zM226 263q41 -105 134 -167.5t234 -62.5q171 0 260 132t89 356v21 q0 225 -90 365.5t-261 140.5q-154 0 -240.5 -77t-125.5 -190v-518z"/>
            <glyph unicode="c" horiz-adv-x="1039"
                   d="M97 520v42q0 242 117 391t323 149q169 0 285 -98q113 -95 112 -266v-12l-2 -6h-46q0 159 -102 243.5t-247 84.5q-190 0 -288 -136t-98 -350v-42q0 -216 98 -351.5t290 -135.5q137 0 242 75t105 225h46l2 -6v-10q0 -151 -116 -243q-120 -94 -279 -95q-207 0 -324.5 149 t-117.5 392z"/>
            <glyph unicode="d"
                   d="M122 521v21q0 257 108 408.5t300 151.5q126 0 218.5 -56.5t147.5 -154.5v669h54v-811v-3t1 -1v-441q-1 -2 -1 -3v-2v-299h-52l-2 167q-54 -87 -148 -137.5t-220 -50.5q-191 0 -298.5 146t-107.5 396zM178 521q0 -224 88.5 -356t260.5 -132q141 0 234 63.5t135 169.5v512 q-40 115 -126.5 192.5t-240.5 77.5q-172 0 -261.5 -140.5t-89.5 -365.5v-21z"/>
            <glyph unicode="e" horiz-adv-x="1039"
                   d="M97 500v64q0 235 130.5 386.5t328.5 151.5q180 0 287 -118.5t107 -323.5v-83h-799v-13v-64q0 -198 112 -332.5t288 -134.5q97 0 186.5 36t145.5 96l29 -42q-57 -63 -147 -103.5t-214 -40.5q-191 0 -322.5 148t-131.5 373zM159 637l3 -6h734v33q0 167 -91 275.5 t-249 108.5q-168 0 -275.5 -116.5t-121.5 -294.5z"/>
            <glyph unicode="f" horiz-adv-x="645"
                   d="M66 1027v55h188v178q0 153 74.5 237t208.5 84q33 0 65.5 -4t62.5 -13l-8 -52q-32 8 -56.5 11.5t-62.5 3.5q-108 0 -169 -71t-61 -196v-178h286v-55h-286v-1027h-54v1027h-188z"/>
            <glyph unicode="g"
                   d="M122 521v21q0 257 108 408.5t300 151.5q126 0 218.5 -57t147.5 -156l8 193h46v-333v-3t1 -1v-441q-1 -2 -1 -3v-2v-305q0 -206 -108.5 -318.5t-300.5 -112.5q-79 0 -164.5 16.5t-149.5 45.5l16 54q73 -32 141 -47.5t155 -15.5q175 0 265.5 97.5t90.5 280.5v171 q-55 -86 -148.5 -136t-218.5 -50q-191 0 -298.5 146t-107.5 396zM177 521q0 -224 89 -356t261 -132q139 0 232 62.5t136 167.5v518q-40 113 -126.5 190t-239.5 77q-172 0 -262 -140.5t-90 -365.5v-21z"/>
            <glyph unicode="h"
                   d="M170 554v35t2 28v943h54v-703q51 116 148 180.5t236 64.5q169 0 256.5 -107t87.5 -337v-658h-55v660q0 213 -78.5 300.5t-209.5 87.5q-172 0 -265.5 -101t-119.5 -259v-688h-54v554h-2z"/>
            <glyph unicode="i" horiz-adv-x="422" d="M185 0v1082h54v-1082h-54zM185 1422v138h54v-138h-54z"/>
            <glyph unicode="j" horiz-adv-x="445"
                   d="M-157 -417l13 52q19 -6 46.5 -12t52.5 -6q110 0 170.5 77t60.5 217v1171h54v-1171q0 -167 -75 -257.5t-210 -90.5q-29 0 -55 5t-57 15zM180 1426v134h54v-134h-54z"/>
            <glyph unicode="k" horiz-adv-x="969"
                   d="M172 0v1560h54v-953h127l492 475h63l2 -6l-496 -487l534 -584l-2 -5h-63l-509 553h-148v-553h-54z"/>
            <glyph unicode="l" horiz-adv-x="422" d="M185 0v1560h54v-1560h-54z"/>
            <glyph unicode="m" horiz-adv-x="1836"
                   d="M161 554q0 14 0.5 28t1.5 35v465h47l7 -218q50 113 141 175.5t222 62.5q138 0 225 -69.5t121 -215.5q45 135 141.5 210.5t240.5 75.5q179 0 272 -117t93 -368v-617h-55v619q0 235 -84 332t-224 97q-167 0 -254.5 -98t-112.5 -254q1 -20 2 -40.5t1 -41.5v-615h-55v554h-3 q0 19 0.5 38t2.5 37q-3 230 -86 324.5t-223 94.5q-165 0 -251.5 -95.5t-112.5 -247.5v-705h-55v554h-2z"/>
            <glyph unicode="n"
                   d="M169 554q0 19 0.5 38.5t2.5 39.5v450h46l7 -218q50 113 144 175.5t231 62.5q177 0 265.5 -111.5t88.5 -353.5v-637h-54v639q0 225 -80.5 317t-218.5 92q-170 0 -260 -99t-115 -255v-694h-54v554h-3z"/>
            <glyph unicode="o"
                   d="M87 520v42q0 238 131.5 389t341.5 151q211 0 342.5 -151t131.5 -389v-42q0 -239 -131.5 -390t-340.5 -151q-211 0 -343 151t-132 390zM141 520q0 -204 114 -345.5t307 -141.5q190 0 304 142t114 345v42q0 199 -115 342.5t-305 143.5q-191 0 -305 -143.5t-114 -342.5v-42z "/>
            <glyph unicode="p"
                   d="M170 305v440v1.5t2 6.5v329h42l11 -191q54 98 147 154.5t219 56.5q191 0 299.5 -151.5t108.5 -408.5v-21q0 -250 -108 -396t-298 -146q-126 0 -219.5 50t-147.5 136v-581h-54v712q-1 3 -1.5 5t-0.5 4zM226 264q41 -106 134 -168.5t234 -62.5q171 0 260.5 132t89.5 356v21 q0 225 -90.5 365.5t-261.5 140.5q-154 0 -240.5 -77t-125.5 -190v-517z"/>
            <glyph unicode="q"
                   d="M122 521v21q0 257 108 408.5t300 151.5q126 0 218.5 -56.5t147.5 -155.5l5 192h49v-333v-3t1 -1v-441q-1 -2 -1 -3v-2v-715h-54v582q-55 -86 -149 -136.5t-219 -50.5q-191 0 -298.5 146t-107.5 396zM178 521q0 -224 88.5 -356t260.5 -132q141 0 234 63.5t135 169.5v512 q-40 115 -126.5 192.5t-240.5 77.5q-172 0 -261.5 -140.5t-89.5 -365.5v-21z"/>
            <glyph unicode="r" horiz-adv-x="685"
                   d="M172 0v1082h44l10 -188v-37q45 116 134 180.5t219 64.5q23 0 42.5 -3.5t33.5 -7.5l-6 -48l-70 6q-145 0 -235.5 -93.5t-117.5 -246.5v-709h-54z"/>
            <glyph unicode="s" horiz-adv-x="1019"
                   d="M112 269l2 6h44q8 -128 110 -185t241 -57q150 0 238 70t88 162q0 86 -73.5 156.5t-256.5 110.5q-193 41 -279.5 105.5t-86.5 191.5q0 116 98 194.5t264 78.5q179 0 282 -84q98 -80 98 -207v-12l-2 -6h-46q0 106 -89.5 180.5t-242.5 74.5q-152 0 -230 -65.5t-78 -151.5 q0 -85 66 -145t262 -105q181 -42 274.5 -114.5t93.5 -202.5q0 -127 -104 -206t-276 -79q-189 1 -297 85q-101 79 -100 190v15z"/>
            <glyph unicode="t" horiz-adv-x="633"
                   d="M29 1027v55h200v292h55v-292h266v-55h-266v-748q0 -133 45 -189.5t119 -56.5q27 0 48 2t58 7l10 -49q-25 -8 -52 -11t-61 -3q-109 0 -165.5 71t-56.5 229v748h-200z"/>
            <glyph unicode="u"
                   d="M168 465v617h54v-619q0 -220 81 -325t219 -105q165 0 255.5 80.5t117.5 212.5v756h55v-637h2q0 -13 -1 -25t-1 -28v-392h-45l-8 190q-51 -100 -145 -155.5t-228 -55.5q-167 0 -261.5 118.5t-94.5 367.5z"/>
            <glyph unicode="v" horiz-adv-x="978"
                   d="M43 1082h58l334 -853l51 -146h6l52 146l333 853h58l-421 -1081l1 -1h-52z"/>
            <glyph unicode="w" horiz-adv-x="1550"
                   d="M83 1082h62l221 -769l56 -222l6 -1l71 223l243 769h55l242 -769l70 -223l6 1l58 222l220 769h63l-315 -1082h-54l-271 813l-45 168h-6l-47 -168l-267 -813h-54z"/>
            <glyph unicode="x" horiz-adv-x="978"
                   d="M55 0l400 555l-380 527h68l346 -480l345 480h68l-380 -527l400 -555h-67l-367 508l-366 -508h-67z"/>
            <glyph unicode="y" horiz-adv-x="978"
                   d="M43 1082h59l356 -886l40 -108h6l6 16l374 978h60l-481 -1262q-44 -114 -102.5 -185.5t-186.5 -71.5q-19 0 -42 3.5t-34 7.5l9 51q11 -3 33 -6t34 -3q92 0 143.5 54t91.5 160l65 176z"/>
            <glyph unicode="z" horiz-adv-x="978" d="M87 0v44l711 983h-680v55h753v-48l-711 -980h770v-54h-843z"/>
            <glyph unicode="{" horiz-adv-x="660"
                   d="M73 543v66q128 0 189 72t61 204v247q0 171 73 290.5t246 174.5l15 -45q-143 -46 -211.5 -155.5t-68.5 -264.5v-247q0 -120 -52 -202t-159 -107q107 -26 159 -109t52 -202v-245q0 -154 70.5 -260t214.5 -155l-20 -46q-173 55 -246 173t-73 288v245q0 132 -61 205t-189 73z "/>
            <glyph unicode="|" horiz-adv-x="406" d="M181 -270v1726h54v-1726h-54z"/>
            <glyph unicode="}" horiz-adv-x="660"
                   d="M0 -395q143 49 213.5 155t70.5 260v245q0 119 51.5 202t159.5 109q-108 25 -159.5 107t-51.5 202v247q0 155 -68.5 264.5t-210.5 155.5l14 45q172 -55 245.5 -174.5t73.5 -290.5v-247q0 -132 61 -204t189 -72v-66q-128 0 -189 -73.5t-61 -204.5v-245q0 -171 -73 -288.5 t-246 -172.5z"/>
            <glyph unicode="~" horiz-adv-x="1412"
                   d="M156 474q0 128 73.5 214t188.5 86q86 0 158.5 -39.5t164.5 -120.5q67 -62 125 -90t121 -28q86 0 144.5 70.5t58.5 186.5l61 -13q0 -121 -75.5 -209t-188.5 -88q-87 0 -158.5 38t-162.5 121q-68 59 -127.5 88.5t-120.5 29.5q-89 0 -146 -68t-57 -190z"/>
            <glyph unicode="&#xa1;" horiz-adv-x="406" d="M147 918v164h95v-164h-95zM167 -374v978h54v-978h-54z"/>
            <glyph unicode="&#xa2;" horiz-adv-x="1110"
                   d="M134 520v42q0 234 110 381.5t305 157.5v217h55v-217q158 -10 264.5 -107.5t103.5 -267.5l-3 -6h-46q0 159 -102 243.5t-247 84.5q-190 0 -288 -136t-98 -350v-42q0 -216 98 -351.5t290 -135.5q137 0 242 75t105 225h46l2 -6q4 -152 -106 -245t-261 -102v-225h-55v225 q-196 11 -305.5 158t-109.5 382z"/>
            <glyph unicode="&#xa3;" horiz-adv-x="1150"
                   d="M65 667v54h241l-11 319q0 204 101 320.5t270 116.5q175 0 256 -102t78 -280l-2 -5h-47q0 176 -73.5 254.5t-211.5 78.5q-147 0 -232 -100t-85 -283l11 -319h478v-54h-476l8 -201q0 -125 -36 -235.5t-102 -176.5h808l1 -54h-912v54h10q89 16 133 145.5t44 266.5l-8 201 h-243z"/>
            <glyph unicode="&#xa4;" horiz-adv-x="1502"
                   d="M114 13l179 182q-69 84 -106.5 189.5t-37.5 223.5q0 122 40 230.5t114 193.5l-189 193l40 39l188 -192q80 77 183.5 119.5t219.5 42.5q114 0 217.5 -43t185.5 -121l191 195l41 -40l-193 -196q72 -85 112 -193t40 -228q0 -117 -37 -221.5t-104 -187.5l182 -186l-41 -40 l-180 183q-82 -84 -188.5 -130t-225.5 -46q-120 0 -226.5 45.5t-188.5 128.5l-176 -180zM204 608q0 -238 159 -406.5t382 -168.5q221 0 380.5 168.5t159.5 406.5q0 237 -159.5 405t-380.5 168q-223 0 -382 -168t-159 -405z"/>
            <glyph unicode="&#xa5;" horiz-adv-x="1207"
                   d="M58 1456h65l452 -718l24 -51h5l24 51l451 718h66l-489 -780h424v-55h-452v-240h452v-55h-452v-326h-54v326h-450v55h450v240h-450v55h421z"/>
            <glyph unicode="&#xa6;" horiz-adv-x="398" d="M172 -270v752h54v-752h-54zM172 698v758h54v-758h-54z"/>
            <glyph unicode="&#xa7;" horiz-adv-x="1223"
                   d="M121 -69l2 5l46 2q0 -199 127 -289t304 -90q185 0 290 80.5t105 209.5q0 120 -80.5 188.5t-307.5 128.5q-245 58 -365.5 142.5t-120.5 242.5q0 108 76 179t211 92q-122 48 -182 120.5t-60 187.5q0 157 123 252t329 95q214 0 333 -111.5t115 -313.5l-2 -6h-46 q0 162 -106.5 269.5t-293.5 107.5q-197 0 -297.5 -81.5t-100.5 -208.5q0 -126 79.5 -194t316.5 -135q252 -64 365 -140.5t113 -232.5q0 -105 -82 -176t-222 -91q131 -50 195.5 -122t64.5 -191q0 -161 -122 -253.5t-328 -92.5q-205 0 -344.5 102.5t-134.5 323.5zM175 553 q0 -130 88 -195.5t361 -142.5l69 -19q161 1 254 67t93 165q0 123 -95.5 194.5t-354.5 143.5q-30 6 -57 13.5t-51 16.5q-152 -7 -229.5 -74t-77.5 -169z"/>
            <glyph unicode="&#xa8;" horiz-adv-x="906" d="M155 1338v118h137v-118h-137zM625 1338v118h136v-118h-136z"/>
            <glyph unicode="&#xa9;" horiz-adv-x="1666"
                   d="M123 729q0 315 207 531t503 216q295 0 502.5 -216t207.5 -531q0 -316 -207.5 -533t-502.5 -217t-502.5 217t-207.5 533zM179 729q0 -290 191.5 -492.5t462.5 -202.5q269 0 461.5 202.5t192.5 492.5q0 289 -192 490.5t-462 201.5q-271 0 -462.5 -201.5t-191.5 -490.5z M506 669v119q0 172 88.5 279.5t231.5 107.5q139 0 218 -79.5t76 -227.5l-3 -6h-44q0 129 -64 194.5t-183 65.5q-123 0 -194 -95t-71 -238v-120q0 -145 70.5 -238.5t194.5 -93.5q120 0 183 63.5t63 195.5h44l3 -6q3 -150 -75.5 -229t-217.5 -79q-144 0 -232 107t-88 280z"/>
            <glyph unicode="&#xaa;" horiz-adv-x="898"
                   d="M148 920q0 101 74 157t215 56h220v69q0 105 -51 163t-148 58q-114 0 -175.5 -47t-61.5 -138l-46 5l-2 6q-5 98 74.5 163t210.5 65q115 0 184.5 -71.5t69.5 -204.5v-314q0 -48 6 -92.5t20 -88.5h-58q-10 28 -15.5 58.5t-6.5 61.5q-40 -58 -106.5 -96t-154.5 -38 q-119 0 -184 61t-65 167zM202 924q0 -84 48 -130.5t148 -46.5q87 0 163 47.5t96 105.5v177h-219q-113 0 -174.5 -44t-61.5 -109z"/>
            <glyph unicode="&#xab;" horiz-adv-x="905"
                   d="M145 516v19l295 370h70l-294 -380l294 -379h-70zM432 516v19l295 370h70l-294 -380l294 -379h-70z"/>
            <glyph unicode="&#xac;" horiz-adv-x="1101" d="M122 700v53h793v-357h-54v304h-739z"/>
            <glyph unicode="&#xad;" horiz-adv-x="807" d="M99 599v54h590v-54h-590z"/>
            <glyph unicode="&#xae;" horiz-adv-x="1674"
                   d="M115 729q0 315 207 531t503 216q295 0 502.5 -216t207.5 -531q0 -316 -207.5 -533t-502.5 -217q-296 0 -503 217t-207 533zM170 729q0 -290 192 -492.5t463 -202.5q269 0 461.5 202.5t192.5 492.5q0 289 -192 490.5t-462 201.5q-271 0 -463 -201.5t-192 -490.5zM593 316 v850h239q143 0 216 -61t73 -179q0 -73 -40 -125t-113 -81q70 -22 101 -75.5t31 -129.5v-56q0 -38 4 -71.5t13 -55.5v-16h-59q-10 21 -12 61.5t-2 82.5v54q0 94 -42 134t-142 40h-212v-372h-55zM648 744h205q91 0 152 48t61 135q0 96 -52.5 140t-181.5 44h-184v-367z"/>
            <glyph unicode="&#xaf;" horiz-adv-x="811" d="M92 1403v53h627v-53h-627z"/>
            <glyph unicode="&#xb0;" horiz-adv-x="783"
                   d="M156 1237q0 98 69 169t167 71q95 0 163.5 -71t68.5 -169q0 -100 -68.5 -168.5t-163.5 -68.5q-98 0 -167 68.5t-69 168.5zM211 1237q0 -79 51.5 -130t129.5 -51q76 0 126 51t50 130q0 80 -50 132.5t-126 52.5q-78 0 -129.5 -53t-51.5 -132z"/>
            <glyph unicode="&#xb1;" horiz-adv-x="1077"
                   d="M72 751v54h443v462h54v-462h419v-54h-419v-462h-54v462h-443zM240 88v54h835v-54h-835z"/>
            <glyph unicode="&#xb2;" horiz-adv-x="807"
                   d="M114 667v55l327 300q83 80 114.5 131t31.5 102q0 78 -48 123.5t-144 45.5q-104 0 -160 -51t-56 -131h-48l-3 6q-5 95 69 163t198 68q115 0 181.5 -57.5t66.5 -167.5q0 -70 -49.5 -136.5t-140.5 -154.5l-265 -235l2 -6h475v-55h-551z"/>
            <glyph unicode="&#xb3;" horiz-adv-x="831"
                   d="M129 882l2 6h48q0 -78 62.5 -128t163.5 -50q106 0 164 45.5t58 125.5q0 86 -55.5 126t-165.5 40h-114v56h114q107 0 157.5 40.5t50.5 116.5q0 73 -52.5 118t-156.5 45q-92 0 -153 -45.5t-61 -119.5h-46l-2 6q-6 94 71 154t191 60q122 0 193 -57.5t71 -163.5 q0 -61 -36 -109t-101 -72q74 -21 112.5 -69.5t38.5 -123.5q0 -107 -77.5 -167.5t-200.5 -60.5q-115 0 -198 58.5t-78 168.5z"/>
            <glyph unicode="&#xb4;" horiz-adv-x="511" d="M119 1257l220 261h78l2 -5l-231 -261h-67z"/>
            <glyph unicode="&#xb5;"
                   d="M171 -416v1498h52v-642q0 -223 85 -315t221 -92q184 0 268 93t102 263v693h54v-577h2q0 -16 -0.5 -30.5t-1.5 -36.5v-438h-41l-11 205q-48 -109 -138 -167.5t-225 -58.5q-103 0 -185.5 45t-129.5 147v-587h-52z"/>
            <glyph unicode="&#xb6;" horiz-adv-x="946"
                   d="M99 988q0 207 129.5 337.5t362.5 130.5h179v-1456h-54v520h-125q-234 0 -363 129.5t-129 338.5z"/>
            <glyph unicode="&#xb7;" horiz-adv-x="472" d="M171 624v152h118v-152h-118z"/>
            <glyph unicode="&#xb8;" horiz-adv-x="490"
                   d="M81 -386q104 0 180.5 36t76.5 105q0 64 -45.5 89t-163.5 35l25 121h53l-11 -76q91 -7 144 -45.5t53 -123.5q0 -87 -79 -138.5t-226 -51.5z"/>
            <glyph unicode="&#xb9;" horiz-adv-x="471" d="M79 1398v56l220 23v-812h-54v747z"/>
            <glyph unicode="&#xba;" horiz-adv-x="914"
                   d="M148 1025v117q0 148 82 241.5t222 93.5t222.5 -93.5t82.5 -241.5v-117q0 -149 -82 -241.5t-221 -92.5q-141 0 -223.5 92.5t-82.5 241.5zM202 1025q0 -125 63 -202.5t189 -77.5q120 0 185 78.5t65 201.5v117q0 122 -65 201.5t-187 79.5q-121 0 -185.5 -79.5t-64.5 -201.5 v-117z"/>
            <glyph unicode="&#xbb;" horiz-adv-x="897"
                   d="M128 171l293 379l-293 390h70l294 -380v-19l-294 -370h-70zM418 171l293 379l-293 390h70l294 -380v-19l-294 -370h-70z"/>
            <glyph unicode="&#xbc;" horiz-adv-x="1533"
                   d="M141 1397v56l220 23v-812h-54v747zM316 170l711 1138l45 -31l-711 -1138zM760 186v36l435 579h62v-560h176v-55h-176v-186h-55v186h-442zM843 241h359v481l-6 2l-36 -60z"/>
            <glyph unicode="&#xbd;" horiz-adv-x="1447"
                   d="M141 1397v56l220 23v-812h-54v747zM328 170l711 1138l45 -31l-711 -1138zM895 0v55l327 300q83 80 114.5 131t31.5 102q0 78 -48 123.5t-144 45.5q-104 0 -160 -51t-56 -131h-48l-3 6q-5 95 69 163t198 68q115 0 181.5 -57.5t66.5 -167.5q0 -70 -49.5 -136.5 t-140.5 -154.5l-265 -235l2 -6h475v-55h-551z"/>
            <glyph unicode="&#xbe;" horiz-adv-x="1653"
                   d="M161 883l2 6h48q0 -78 62.5 -128t163.5 -50q106 0 164 45.5t58 125.5q0 86 -55.5 126t-165.5 40h-114v56h114q107 0 157.5 40.5t50.5 116.5q0 73 -52.5 118t-156.5 45q-92 0 -153 -45.5t-61 -119.5h-46l-2 6q-6 94 71 154t191 60q122 0 193 -57.5t71 -163.5 q0 -61 -36 -109t-101 -72q74 -21 112.5 -69.5t38.5 -123.5q0 -107 -77.5 -167.5t-200.5 -60.5q-115 0 -198 58.5t-78 168.5zM543 170l711 1138l45 -31l-711 -1138zM985 186v36l435 579h62v-560h176v-55h-176v-186h-55v186h-442zM1068 241h359v481l-6 2l-36 -60z"/>
            <glyph unicode="&#xbf;" horiz-adv-x="912"
                   d="M104 -27q0 140 62 242t191 218q68 52 83.5 100.5t15.5 149.5h54q-2 -118 -21.5 -166.5t-103.5 -125.5q-122 -117 -174.5 -198.5t-52.5 -221.5q0 -146 77.5 -229t221.5 -83q141 0 219 84.5t82 223.5h46l3 -6q1 -170 -97.5 -262.5t-252.5 -92.5q-165 0 -259 101t-94 266z M432 977v106h82v-106h-82z"/>
            <glyph unicode="&#xc0;" horiz-adv-x="1223"
                   d="M34 0l544 1456h66l545 -1456h-59l-163 435h-711l-163 -435h-59zM276 489h671l-305 815l-28 85h-6l-27 -85zM355 1865l2 5h89l220 -261l-2 -5h-75z"/>
            <glyph unicode="&#xc1;" horiz-adv-x="1223"
                   d="M34 0l544 1456h66l545 -1456h-59l-163 435h-711l-163 -435h-59zM276 489h671l-305 815l-28 85h-6l-27 -85zM565 1601l220 261h78l2 -5l-231 -261h-67z"/>
            <glyph unicode="&#xc2;" horiz-adv-x="1223"
                   d="M34 0l544 1456h66l545 -1456h-59l-163 435h-711l-163 -435h-59zM276 489h671l-305 815l-28 85h-6l-27 -85zM362 1601v17l210 206h80l214 -210v-13h-70l-185 186l-183 -186h-66z"/>
            <glyph unicode="&#xc3;" horiz-adv-x="1223"
                   d="M34 0l544 1456h66l545 -1456h-59l-163 435h-711l-163 -435h-59zM270 1615q0 80 50 129.5t126 49.5q72 0 153 -62t134 -62q50 0 85.5 39.5t35.5 101.5l55 -10q0 -82 -51 -134t-125 -52q-76 0 -154 62.5t-133 62.5q-52 0 -86.5 -37t-34.5 -98zM276 489h671l-305 815l-28 85 h-6l-27 -85z"/>
            <glyph unicode="&#xc4;" horiz-adv-x="1223"
                   d="M34 0l544 1456h66l545 -1456h-59l-163 435h-711l-163 -435h-59zM276 489h671l-305 815l-28 85h-6l-27 -85zM317 1673v118h137v-118h-137zM787 1673v118h136v-118h-136z"/>
            <glyph unicode="&#xc5;" horiz-adv-x="1223"
                   d="M34 0l544 1456h66l545 -1456h-59l-163 435h-711l-163 -435h-59zM276 489h671l-305 815l-28 85h-6l-27 -85zM474 1726q0 56 40 97.5t96 41.5q54 0 93.5 -41t39.5 -98t-39 -96t-94 -39q-56 0 -96 39t-40 96zM531 1726q0 -34 23 -56.5t56 -22.5q32 0 54 22t22 57t-22 58.5 t-54 23.5q-33 0 -56 -23.5t-23 -58.5z"/>
            <glyph unicode="&#xc6;" horiz-adv-x="1816"
                   d="M50 0l881 1456h776v-54h-696l26 -616h588v-54h-586l28 -678h701v-54h-752l-18 425h-628l-255 -425h-65zM402 478h594l-39 924l-5 1l-57 -105z"/>
            <glyph unicode="&#xc7;" horiz-adv-x="1327"
                   d="M144 619v218q0 286 144 463t383 177q228 0 367.5 -119t135.5 -340l-2 -6h-46q0 197 -122.5 304t-332.5 107q-213 0 -343 -161t-130 -423v-220q0 -265 130 -425.5t343 -160.5q210 0 332.5 103t122.5 310h46l2 -6q4 -224 -135.5 -342.5t-367.5 -118.5q-239 0 -383 176.5 t-144 463.5zM553 -395q104 0 180.5 36t76.5 105q0 64 -45.5 89t-163.5 35l25 121h53l-11 -76q91 -7 144 -45.5t53 -123.5q0 -87 -79 -138.5t-226 -51.5z"/>
            <glyph unicode="&#xc8;" horiz-adv-x="1129"
                   d="M200 0v1456h856v-54h-802v-616h700v-54h-700v-678h802v-54h-856zM362 1865l2 5h89l220 -261l-2 -5h-75z"/>
            <glyph unicode="&#xc9;" horiz-adv-x="1129"
                   d="M200 0v1456h856v-54h-802v-616h700v-54h-700v-678h802v-54h-856zM572 1601l220 261h78l2 -5l-231 -261h-67z"/>
            <glyph unicode="&#xca;" horiz-adv-x="1129"
                   d="M200 0v1456h856v-54h-802v-616h700v-54h-700v-678h802v-54h-856zM369 1601v17l210 206h80l214 -210v-13h-70l-185 186l-183 -186h-66z"/>
            <glyph unicode="&#xcb;" horiz-adv-x="1129"
                   d="M200 0v1456h856v-54h-802v-616h700v-54h-700v-678h802v-54h-856zM324 1673v118h137v-118h-137zM794 1673v118h136v-118h-136z"/>
            <glyph unicode="&#xcc;" horiz-adv-x="534" d="M12 1865l2 5h89l220 -261l-2 -5h-75zM240 0v1456h54v-1456h-54z"/>
            <glyph unicode="&#xcd;" horiz-adv-x="534"
                   d="M221 1601l220 261h78l2 -5l-231 -261h-67zM240 0v1456h54v-1456h-54z"/>
            <glyph unicode="&#xce;" horiz-adv-x="534"
                   d="M19 1601v17l210 206h80l214 -210v-13h-70l-185 186l-183 -186h-66zM240 0v1456h54v-1456h-54z"/>
            <glyph unicode="&#xcf;" horiz-adv-x="534"
                   d="M-26 1673v118h137v-118h-137zM240 0v1456h54v-1456h-54zM444 1673v118h136v-118h-136z"/>
            <glyph unicode="&#xd0;" horiz-adv-x="1370"
                   d="M60 713v54h140v689h433q251 0 426 -180t175 -459v-178q0 -280 -175 -459.5t-426 -179.5h-433v713h-140zM254 54h379q227 0 387 166t160 419v181q0 250 -160 416t-387 166h-379v-635h393v-54h-393v-659z"/>
            <glyph unicode="&#xd1;" horiz-adv-x="1449"
                   d="M200 0v1456h55l934 -1353l6 2v1351h54v-1456h-54l-934 1356l-6 -2v-1354h-55zM384 1615q0 80 50 129.5t126 49.5q72 0 153 -62t134 -62q50 0 85.5 39.5t35.5 101.5l55 -10q0 -82 -51 -134t-125 -52q-76 0 -154 62.5t-133 62.5q-52 0 -86.5 -37t-34.5 -98z"/>
            <glyph unicode="&#xd2;" horiz-adv-x="1364"
                   d="M133 619v218q0 294 145.5 467t402.5 173q256 0 403 -173t147 -467v-218q0 -295 -146 -467.5t-402 -172.5q-257 0 -403.5 172.5t-146.5 467.5zM188 619q0 -270 128.5 -428t366.5 -158t366 157.5t128 428.5v220q0 268 -129 426t-367 158q-237 0 -365 -158t-128 -426v-220z M419 1886l2 5h89l220 -261l-2 -5h-75z"/>
            <glyph unicode="&#xd3;" horiz-adv-x="1364"
                   d="M133 619v218q0 294 145.5 467t402.5 173q256 0 403 -173t147 -467v-218q0 -295 -146 -467.5t-402 -172.5q-257 0 -403.5 172.5t-146.5 467.5zM188 619q0 -270 128.5 -428t366.5 -158t366 157.5t128 428.5v220q0 268 -129 426t-367 158q-237 0 -365 -158t-128 -426v-220z M629 1622l220 261h78l2 -5l-231 -261h-67z"/>
            <glyph unicode="&#xd4;" horiz-adv-x="1364"
                   d="M133 619v218q0 294 145.5 467t402.5 173q256 0 403 -173t147 -467v-218q0 -295 -146 -467.5t-402 -172.5q-257 0 -403.5 172.5t-146.5 467.5zM188 619q0 -270 128.5 -428t366.5 -158t366 157.5t128 428.5v220q0 268 -129 426t-367 158q-237 0 -365 -158t-128 -426v-220z M426 1622v17l210 206h80l214 -210v-13h-70l-185 186l-183 -186h-66z"/>
            <glyph unicode="&#xd5;" horiz-adv-x="1364"
                   d="M133 619v218q0 294 145.5 467t402.5 173q256 0 403 -173t147 -467v-218q0 -295 -146 -467.5t-402 -172.5q-257 0 -403.5 172.5t-146.5 467.5zM188 619q0 -270 128.5 -428t366.5 -158t366 157.5t128 428.5v220q0 268 -129 426t-367 158q-237 0 -365 -158t-128 -426v-220z M334 1636q0 80 50 129.5t126 49.5q72 0 153 -62t134 -62q50 0 85.5 39.5t35.5 101.5l55 -10q0 -82 -51 -134t-125 -52q-76 0 -154 62.5t-133 62.5q-52 0 -86.5 -37t-34.5 -98z"/>
            <glyph unicode="&#xd6;" horiz-adv-x="1364"
                   d="M133 619v218q0 294 145.5 467t402.5 173q256 0 403 -173t147 -467v-218q0 -295 -146 -467.5t-402 -172.5q-257 0 -403.5 172.5t-146.5 467.5zM188 619q0 -270 128.5 -428t366.5 -158t366 157.5t128 428.5v220q0 268 -129 426t-367 158q-237 0 -365 -158t-128 -426v-220z M381 1694v118h137v-118h-137zM851 1694v118h136v-118h-136z"/>
            <glyph unicode="&#xd7;" horiz-adv-x="1052"
                   d="M98 289l384 393l-357 364l39 39l356 -364l357 364l39 -39l-357 -364l385 -393l-39 -37l-384 391l-384 -391z"/>
            <glyph unicode="&#xd8;" horiz-adv-x="1364"
                   d="M133 619v218q0 294 145.5 467t402.5 173q121 0 220 -41.5t171 -118.5l113 178h66l-142 -223q59 -83 90.5 -193.5t31.5 -241.5v-218q0 -295 -146 -467.5t-402 -172.5q-99 0 -181.5 26t-148.5 77l-99 -157h-66l123 193q-87 84 -132.5 211.5t-45.5 289.5zM188 619 q0 -146 38 -261t112 -186l6 -1l699 1100q-65 73 -156 112.5t-206 39.5q-237 0 -365 -158t-128 -426v-220zM382 127q59 -47 134.5 -70.5t166.5 -23.5q238 0 366 157.5t128 428.5v220q0 115 -24.5 212t-71.5 166l-6 1z"/>
            <glyph unicode="&#xd9;" horiz-adv-x="1365"
                   d="M185 489v967h54v-967q0 -207 125.5 -331.5t318.5 -124.5q192 0 317.5 124.5t125.5 331.5v967h54v-967q0 -240 -139 -375t-358 -135q-220 0 -359 135.5t-139 374.5zM440 1865l2 5h89l220 -261l-2 -5h-75z"/>
            <glyph unicode="&#xda;" horiz-adv-x="1365"
                   d="M185 489v967h54v-967q0 -207 125.5 -331.5t318.5 -124.5q192 0 317.5 124.5t125.5 331.5v967h54v-967q0 -240 -139 -375t-358 -135q-220 0 -359 135.5t-139 374.5zM650 1601l220 261h78l2 -5l-231 -261h-67z"/>
            <glyph unicode="&#xdb;" horiz-adv-x="1365"
                   d="M185 489v967h54v-967q0 -207 125.5 -331.5t318.5 -124.5q192 0 317.5 124.5t125.5 331.5v967h54v-967q0 -240 -139 -375t-358 -135q-220 0 -359 135.5t-139 374.5zM447 1601v17l210 206h80l214 -210v-13h-70l-185 186l-183 -186h-66z"/>
            <glyph unicode="&#xdc;" horiz-adv-x="1365"
                   d="M185 489v967h54v-967q0 -207 125.5 -331.5t318.5 -124.5q192 0 317.5 124.5t125.5 331.5v967h54v-967q0 -240 -139 -375t-358 -135q-220 0 -359 135.5t-139 374.5zM402 1673v118h137v-118h-137zM872 1673v118h136v-118h-136z"/>
            <glyph unicode="&#xdd;" horiz-adv-x="1223"
                   d="M36 1456h66l481 -809l26 -50l27 50l483 809h66l-547 -903v-553h-55v553zM561 1590l220 261h78l2 -5l-231 -261h-67z"/>
            <glyph unicode="&#xde;" horiz-adv-x="1219"
                   d="M200 0v1456h54v-313h371q212 0 331 -113t119 -292q0 -180 -119 -292t-331 -112h-371v-334h-54zM254 388h371q195 0 295.5 104t100.5 244q0 144 -100 248.5t-296 104.5h-371v-701z"/>
            <glyph unicode="&#xdf;" horiz-adv-x="1183"
                   d="M164 0v1082q0 188 89 290t250 102q123 0 207.5 -73t84.5 -195q0 -101 -59.5 -204.5t-59.5 -201.5q0 -90 193 -231.5t193 -291.5q0 -141 -114 -219.5t-253 -78.5q-87 0 -179.5 26t-132.5 63l25 49q42 -34 122.5 -59.5t156.5 -25.5q140 0 230.5 71.5t90.5 182.5 q0 113 -193 252t-193 264q0 105 56.5 212t56.5 194q0 90 -67.5 151t-154.5 61q-134 0 -214.5 -87.5t-80.5 -250.5v-1082h-54z"/>
            <glyph unicode="&#xe0;" horiz-adv-x="1081"
                   d="M92 284q0 136 128.5 228t321.5 92h309v158q0 135 -86.5 210.5t-243.5 75.5q-147 0 -236.5 -71t-89.5 -183l-45 2l-2 5q-6 126 98 213.5t275 87.5q174 0 279 -88t105 -254v-542q0 -57 6.5 -111t21.5 -107h-60q-13 71 -17.5 106.5t-4.5 76.5v17q-56 -98 -167 -159.5 t-269 -61.5q-151 0 -237 82.5t-86 222.5zM146 280q0 -109 73.5 -178.5t195.5 -69.5q161 0 272.5 71t163.5 203v243h-306q-168 0 -283.5 -77.5t-115.5 -191.5zM277 1545l2 5h89l220 -261l-2 -5h-75z"/>
            <glyph unicode="&#xe1;" horiz-adv-x="1081"
                   d="M92 284q0 136 128.5 228t321.5 92h309v158q0 135 -86.5 210.5t-243.5 75.5q-147 0 -236.5 -71t-89.5 -183l-45 2l-2 5q-6 126 98 213.5t275 87.5q174 0 279 -88t105 -254v-542q0 -57 6.5 -111t21.5 -107h-60q-13 71 -17.5 106.5t-4.5 76.5v17q-56 -98 -167 -159.5 t-269 -61.5q-151 0 -237 82.5t-86 222.5zM146 280q0 -109 73.5 -178.5t195.5 -69.5q161 0 272.5 71t163.5 203v243h-306q-168 0 -283.5 -77.5t-115.5 -191.5zM487 1281l220 261h78l2 -5l-231 -261h-67z"/>
            <glyph unicode="&#xe2;" horiz-adv-x="1081"
                   d="M92 284q0 136 128.5 228t321.5 92h309v158q0 135 -86.5 210.5t-243.5 75.5q-147 0 -236.5 -71t-89.5 -183l-45 2l-2 5q-6 126 98 213.5t275 87.5q174 0 279 -88t105 -254v-542q0 -57 6.5 -111t21.5 -107h-60q-13 71 -17.5 106.5t-4.5 76.5v17q-56 -98 -167 -159.5 t-269 -61.5q-151 0 -237 82.5t-86 222.5zM146 280q0 -109 73.5 -178.5t195.5 -69.5q161 0 272.5 71t163.5 203v243h-306q-168 0 -283.5 -77.5t-115.5 -191.5zM284 1281v17l210 206h80l214 -210v-13h-70l-185 186l-183 -186h-66z"/>
            <glyph unicode="&#xe3;" horiz-adv-x="1081"
                   d="M92 284q0 136 128.5 228t321.5 92h309v158q0 135 -86.5 210.5t-243.5 75.5q-147 0 -236.5 -71t-89.5 -183l-45 2l-2 5q-6 126 98 213.5t275 87.5q174 0 279 -88t105 -254v-542q0 -57 6.5 -111t21.5 -107h-60q-13 71 -17.5 106.5t-4.5 76.5v17q-56 -98 -167 -159.5 t-269 -61.5q-151 0 -237 82.5t-86 222.5zM146 280q0 -109 73.5 -178.5t195.5 -69.5q161 0 272.5 71t163.5 203v243h-306q-168 0 -283.5 -77.5t-115.5 -191.5zM192 1295q0 80 50 129.5t126 49.5q72 0 153 -62t134 -62q50 0 85.5 39.5t35.5 101.5l55 -10q0 -82 -51 -134 t-125 -52q-76 0 -154 62.5t-133 62.5q-52 0 -86.5 -37t-34.5 -98z"/>
            <glyph unicode="&#xe4;" horiz-adv-x="1081"
                   d="M92 284q0 136 128.5 228t321.5 92h309v158q0 135 -86.5 210.5t-243.5 75.5q-147 0 -236.5 -71t-89.5 -183l-45 2l-2 5q-6 126 98 213.5t275 87.5q174 0 279 -88t105 -254v-542q0 -57 6.5 -111t21.5 -107h-60q-13 71 -17.5 106.5t-4.5 76.5v17q-56 -98 -167 -159.5 t-269 -61.5q-151 0 -237 82.5t-86 222.5zM146 280q0 -109 73.5 -178.5t195.5 -69.5q161 0 272.5 71t163.5 203v243h-306q-168 0 -283.5 -77.5t-115.5 -191.5zM239 1353v118h137v-118h-137zM709 1353v118h136v-118h-136z"/>
            <glyph unicode="&#xe5;" horiz-adv-x="1081"
                   d="M92 284q0 136 128.5 228t321.5 92h309v158q0 135 -86.5 210.5t-243.5 75.5q-147 0 -236.5 -71t-89.5 -183l-45 2l-2 5q-6 126 98 213.5t275 87.5q174 0 279 -88t105 -254v-542q0 -57 6.5 -111t21.5 -107h-60q-13 71 -17.5 106.5t-4.5 76.5v17q-56 -98 -167 -159.5 t-269 -61.5q-151 0 -237 82.5t-86 222.5zM146 280q0 -109 73.5 -178.5t195.5 -69.5q161 0 272.5 71t163.5 203v243h-306q-168 0 -283.5 -77.5t-115.5 -191.5zM396 1406q0 56 40 97.5t96 41.5q54 0 93.5 -41t39.5 -98t-39 -96t-94 -39q-56 0 -96 39t-40 96zM453 1406 q0 -34 23 -56.5t56 -22.5q32 0 54 22t22 57t-22 58.5t-54 23.5q-33 0 -56 -23.5t-23 -58.5z"/>
            <glyph unicode="&#xe6;" horiz-adv-x="1802"
                   d="M123 284q0 139 111 221t319 82h290v133q0 157 -72.5 242.5t-209.5 85.5q-153 0 -240 -78t-87 -199l-46 6l-1 6q-5 138 98 228.5t276 90.5q131 0 218.5 -74t110.5 -214q53 133 157 210.5t236 77.5q188 0 296 -118.5t108 -323.5v-83h-787v-13v-64q0 -208 99 -337.5 t299 -129.5q102 0 186.5 34.5t145.5 96.5l30 -42q-65 -66 -148.5 -104.5t-213.5 -38.5q-143 0 -245 66t-155 185v-12h1q-44 -95 -153 -167t-268 -72q-169 0 -262 82t-93 223zM178 280q0 -117 77.5 -183t221.5 -66q130 0 237 65.5t129 128.5v307h-288q-185 0 -281 -71.5 t-96 -180.5zM908 637l2 -5h723v32q0 168 -91.5 276t-258.5 108q-159 0 -260.5 -116.5t-114.5 -294.5z"/>
            <glyph unicode="&#xe7;" horiz-adv-x="1039"
                   d="M97 520v42q0 242 117 391t323 149q168 0 284.5 -98.5t112.5 -277.5l-2 -6h-46q0 159 -102 243.5t-247 84.5q-190 0 -288 -136t-98 -350v-42q0 -216 98 -351.5t290 -135.5q137 0 242 75t105 225h46l2 -6q4 -159 -116.5 -253.5t-278.5 -94.5q-207 0 -324.5 149t-117.5 392z M422 -395q104 0 180.5 36t76.5 105q0 64 -45.5 89t-163.5 35l25 121h53l-11 -76q91 -7 144 -45.5t53 -123.5q0 -87 -79 -138.5t-226 -51.5z"/>
            <glyph unicode="&#xe8;" horiz-adv-x="1039"
                   d="M97 500v64q0 235 130.5 386.5t328.5 151.5q180 0 287 -118.5t107 -323.5v-83h-799v-13v-64q0 -198 112 -332.5t288 -134.5q97 0 186.5 36t145.5 96l29 -42q-57 -63 -147 -103.5t-214 -40.5q-191 0 -322.5 148t-131.5 373zM159 637l3 -6h734v33q0 167 -91 275.5 t-249 108.5q-168 0 -275.5 -116.5t-121.5 -294.5zM300 1544l2 5h89l220 -261l-2 -5h-75z"/>
            <glyph unicode="&#xe9;" horiz-adv-x="1039"
                   d="M97 500v64q0 235 130.5 386.5t328.5 151.5q180 0 287 -118.5t107 -323.5v-83h-799v-13v-64q0 -198 112 -332.5t288 -134.5q97 0 186.5 36t145.5 96l29 -42q-57 -63 -147 -103.5t-214 -40.5q-191 0 -322.5 148t-131.5 373zM159 637l3 -6h734v33q0 167 -91 275.5 t-249 108.5q-168 0 -275.5 -116.5t-121.5 -294.5zM510 1280l220 261h78l2 -5l-231 -261h-67z"/>
            <glyph unicode="&#xea;" horiz-adv-x="1039"
                   d="M97 500v64q0 235 130.5 386.5t328.5 151.5q180 0 287 -118.5t107 -323.5v-83h-799v-13v-64q0 -198 112 -332.5t288 -134.5q97 0 186.5 36t145.5 96l29 -42q-57 -63 -147 -103.5t-214 -40.5q-191 0 -322.5 148t-131.5 373zM159 637l3 -6h734v33q0 167 -91 275.5 t-249 108.5q-168 0 -275.5 -116.5t-121.5 -294.5zM307 1280v17l210 206h80l214 -210v-13h-70l-185 186l-183 -186h-66z"/>
            <glyph unicode="&#xeb;" horiz-adv-x="1039"
                   d="M97 500v64q0 235 130.5 386.5t328.5 151.5q180 0 287 -118.5t107 -323.5v-83h-799v-13v-64q0 -198 112 -332.5t288 -134.5q97 0 186.5 36t145.5 96l29 -42q-57 -63 -147 -103.5t-214 -40.5q-191 0 -322.5 148t-131.5 373zM159 637l3 -6h734v33q0 167 -91 275.5 t-249 108.5q-168 0 -275.5 -116.5t-121.5 -294.5zM262 1352v118h137v-118h-137zM732 1352v118h136v-118h-136z"/>
            <glyph unicode="&#xec;" horiz-adv-x="406"
                   d="M-47 1522l2 5h89l220 -261l-2 -5h-75zM181 0v1082h54v-1082h-54z"/>
            <glyph unicode="&#xed;" horiz-adv-x="406"
                   d="M162 1258l220 261h78l2 -5l-231 -261h-67zM181 0v1082h54v-1082h-54z"/>
            <glyph unicode="&#xee;" horiz-adv-x="406"
                   d="M-40 1258v17l210 206h80l214 -210v-13h-70l-185 186l-183 -186h-66zM181 0v1082h54v-1082h-54z"/>
            <glyph unicode="&#xef;" horiz-adv-x="406"
                   d="M-85 1331v118h137v-118h-137zM181 0v1082h54v-1082h-54zM385 1331v118h136v-118h-136z"/>
            <glyph unicode="&#xf0;" horiz-adv-x="1183"
                   d="M123 446q0 241 118.5 374t329.5 133q137 0 246.5 -51t162.5 -141l4 5q1 179 -53 308.5t-154 220.5l-360 -206l-28 48l341 195q-54 40 -116.5 73t-135.5 62l20 50q85 -34 155.5 -72.5t128.5 -82.5l260 149l29 -48l-244 -140q108 -102 161 -240.5t53 -327.5v-220 q0 -245 -131.5 -400.5t-330.5 -155.5t-327.5 134.5t-128.5 332.5zM178 446q0 -164 109.5 -286.5t295.5 -122.5q179 0 291.5 139.5t112.5 358.5v128q-43 95 -150.5 163.5t-265.5 68.5q-198 0 -295.5 -124.5t-97.5 -324.5z"/>
            <glyph unicode="&#xf1;"
                   d="M169 554q0 19 0.5 38.5t2.5 39.5v450h46l7 -218q50 113 144 175.5t231 62.5q177 0 265.5 -111.5t88.5 -353.5v-637h-54v639q0 225 -80.5 317t-218.5 92q-170 0 -260 -99t-115 -255v-694h-54v554h-3zM236 1293q0 80 50 129.5t126 49.5q72 0 153 -62t134 -62 q50 0 85.5 39.5t35.5 101.5l55 -10q0 -82 -51 -134t-125 -52q-76 0 -154 62.5t-133 62.5q-52 0 -86.5 -37t-34.5 -98z"/>
            <glyph unicode="&#xf2;"
                   d="M87 520v42q0 238 131.5 389t341.5 151q211 0 342.5 -151t131.5 -389v-42q0 -239 -131.5 -390t-340.5 -151q-211 0 -343 151t-132 390zM141 520q0 -204 114 -345.5t307 -141.5q190 0 304 142t114 345v42q0 199 -115 342.5t-305 143.5q-191 0 -305 -143.5t-114 -342.5v-42z M325 1543l2 5h89l220 -261l-2 -5h-75z"/>
            <glyph unicode="&#xf3;"
                   d="M87 520v42q0 238 131.5 389t341.5 151q211 0 342.5 -151t131.5 -389v-42q0 -239 -131.5 -390t-340.5 -151q-211 0 -343 151t-132 390zM141 520q0 -204 114 -345.5t307 -141.5q190 0 304 142t114 345v42q0 199 -115 342.5t-305 143.5q-191 0 -305 -143.5t-114 -342.5v-42z M535 1279l220 261h78l2 -5l-231 -261h-67z"/>
            <glyph unicode="&#xf4;"
                   d="M87 520v42q0 238 131.5 389t341.5 151q211 0 342.5 -151t131.5 -389v-42q0 -239 -131.5 -390t-340.5 -151q-211 0 -343 151t-132 390zM141 520q0 -204 114 -345.5t307 -141.5q190 0 304 142t114 345v42q0 199 -115 342.5t-305 143.5q-191 0 -305 -143.5t-114 -342.5v-42z M332 1279v17l210 206h80l214 -210v-13h-70l-185 186l-183 -186h-66z"/>
            <glyph unicode="&#xf5;"
                   d="M87 520v42q0 238 131.5 389t341.5 151q211 0 342.5 -151t131.5 -389v-42q0 -239 -131.5 -390t-340.5 -151q-211 0 -343 151t-132 390zM141 520q0 -204 114 -345.5t307 -141.5q190 0 304 142t114 345v42q0 199 -115 342.5t-305 143.5q-191 0 -305 -143.5t-114 -342.5v-42z M240 1293q0 80 50 129.5t126 49.5q72 0 153 -62t134 -62q50 0 85.5 39.5t35.5 101.5l55 -10q0 -82 -51 -134t-125 -52q-76 0 -154 62.5t-133 62.5q-52 0 -86.5 -37t-34.5 -98z"/>
            <glyph unicode="&#xf6;"
                   d="M87 520v42q0 238 131.5 389t341.5 151q211 0 342.5 -151t131.5 -389v-42q0 -239 -131.5 -390t-340.5 -151q-211 0 -343 151t-132 390zM141 520q0 -204 114 -345.5t307 -141.5q190 0 304 142t114 345v42q0 199 -115 342.5t-305 143.5q-191 0 -305 -143.5t-114 -342.5v-42z M287 1351v118h137v-118h-137zM757 1351v118h136v-118h-136z"/>
            <glyph unicode="&#xf7;" horiz-adv-x="1159"
                   d="M73 686v52h998v-52h-998zM535 241v122h96v-122h-96zM535 1020v122h96v-122h-96z"/>
            <glyph unicode="&#xf8;"
                   d="M87 520v42q0 238 131.5 389t341.5 151q61 0 117.5 -14.5t106.5 -40.5l84 172h63l-99 -203q95 -71 148.5 -189t53.5 -265v-42q0 -239 -131.5 -390t-340.5 -151q-58 0 -111 12t-100 36l-83 -172h-63l97 201q-102 68 -158.5 189t-56.5 275zM141 520q0 -130 48 -238.5 t135 -168.5h6l429 882q-44 25 -93.5 39t-105.5 14q-191 0 -305 -143.5t-114 -342.5v-42zM375 77q41 -22 88 -33t99 -11q190 0 304 142t114 345v42q0 120 -45.5 226t-125.5 168l-6 1z"/>
            <glyph unicode="&#xf9;"
                   d="M168 465v617h54v-619q0 -220 81 -325t219 -105q165 0 255.5 80.5t117.5 212.5v756h55v-637h2q0 -13 -1 -25t-1 -28v-392h-45l-8 190q-51 -100 -145 -155.5t-228 -55.5q-167 0 -261.5 118.5t-94.5 367.5zM323 1522l2 5h89l220 -261l-2 -5h-75z"/>
            <glyph unicode="&#xfa;"
                   d="M168 465v617h54v-619q0 -220 81 -325t219 -105q165 0 255.5 80.5t117.5 212.5v756h55v-637h2q0 -13 -1 -25t-1 -28v-392h-45l-8 190q-51 -100 -145 -155.5t-228 -55.5q-167 0 -261.5 118.5t-94.5 367.5zM533 1258l220 261h78l2 -5l-231 -261h-67z"/>
            <glyph unicode="&#xfb;"
                   d="M168 465v617h54v-619q0 -220 81 -325t219 -105q165 0 255.5 80.5t117.5 212.5v756h55v-637h2q0 -13 -1 -25t-1 -28v-392h-45l-8 190q-51 -100 -145 -155.5t-228 -55.5q-167 0 -261.5 118.5t-94.5 367.5zM330 1258v17l210 206h80l214 -210v-13h-70l-185 186l-183 -186h-66 z"/>
            <glyph unicode="&#xfc;"
                   d="M168 465v617h54v-619q0 -220 81 -325t219 -105q165 0 255.5 80.5t117.5 212.5v756h55v-637h2q0 -13 -1 -25t-1 -28v-392h-45l-8 190q-51 -100 -145 -155.5t-228 -55.5q-167 0 -261.5 118.5t-94.5 367.5zM285 1331v118h137v-118h-137zM755 1331v118h136v-118h-136z"/>
            <glyph unicode="&#xfd;" horiz-adv-x="978"
                   d="M43 1082h59l356 -886l40 -108h6l6 16l374 978h60l-481 -1262q-44 -114 -102.5 -185.5t-186.5 -71.5q-19 0 -42 3.5t-34 7.5l9 51q11 -3 33 -6t34 -3q92 0 143.5 54t91.5 160l65 176zM467 1258l220 261h78l2 -5l-231 -261h-67z"/>
            <glyph unicode="&#xfe;"
                   d="M170 305v440v1.5t2 6.5v329h1v478h54v-666q54 97 146 152.5t218 55.5q191 0 299.5 -151.5t108.5 -408.5v-21q0 -250 -108 -396t-298 -146q-126 0 -219 49.5t-147 134.5v-163h-1v-416h-54v712q-1 3 -1.5 5t-0.5 4zM227 261q42 -105 134.5 -166.5t232.5 -61.5 q171 0 260.5 132t89.5 356v21q0 225 -90.5 365.5t-261.5 140.5q-153 0 -239.5 -76t-125.5 -188v-523z"/>
            <glyph unicode="&#xff;" horiz-adv-x="978"
                   d="M43 1082h59l356 -886l40 -108h6l6 16l374 978h60l-481 -1262q-44 -114 -102.5 -185.5t-186.5 -71.5q-19 0 -42 3.5t-34 7.5l9 51q11 -3 33 -6t34 -3q92 0 143.5 54t91.5 160l65 176zM219 1331v118h137v-118h-137zM689 1331v118h136v-118h-136z"/>
            <glyph unicode="&#x152;" horiz-adv-x="1873"
                   d="M112 576v304q0 265 143 431t374 166q80 0 161.5 -6t170.5 -15h798v-54h-802v-616h700v-54h-700v-678h802v-54h-798q-103 -10 -178 -15.5t-152 -5.5q-231 0 -375 166t-144 431zM166 576q0 -240 127.5 -391.5t337.5 -151.5q73 0 143 2.5t129 9.5v1366q-60 6 -128.5 9 t-145.5 3q-211 0 -337 -149t-126 -392v-306z"/>
            <glyph unicode="&#x153;" horiz-adv-x="1921"
                   d="M92 520v42q0 238 131.5 389t341.5 151q164 0 282.5 -94t165.5 -255q46 159 162.5 254t270.5 95q180 0 287 -118.5t107 -323.5v-83h-799v-13v-64q0 -198 112 -332.5t288 -134.5q97 0 186.5 36t145.5 96l29 -42q-57 -63 -147 -103.5t-214 -40.5q-150 0 -267 94t-162 251 q-47 -160 -165.5 -252.5t-279.5 -92.5q-211 0 -343 151t-132 390zM146 520q0 -204 114 -345.5t307 -141.5q190 0 304 142t114 345v42q0 199 -115 342.5t-305 143.5q-191 0 -305 -143.5t-114 -342.5v-42zM1049 637l3 -6h734v33q0 167 -91 275.5t-249 108.5 q-168 0 -275.5 -116.5t-121.5 -294.5z"/>
            <glyph unicode="&#x178;" horiz-adv-x="1223"
                   d="M36 1456h66l481 -809l26 -50l27 50l483 809h66l-547 -903v-553h-55v553zM313 1662v118h137v-118h-137zM783 1662v118h136v-118h-136z"/>
            <glyph unicode="&#x2c6;" horiz-adv-x="796"
                   d="M152 1252v17l210 206h80l214 -210v-13h-70l-185 186l-183 -186h-66z"/>
            <glyph unicode="&#x2dc;" horiz-adv-x="818"
                   d="M75 1286q0 80 50 129.5t126 49.5q72 0 153 -62t134 -62q50 0 85.5 39.5t35.5 101.5l55 -10q0 -82 -51 -134t-125 -52q-76 0 -154 62.5t-133 62.5q-52 0 -86.5 -37t-34.5 -98z"/>
            <glyph unicode="&#x2000;" horiz-adv-x="945"/>
            <glyph unicode="&#x2001;" horiz-adv-x="1891"/>
            <glyph unicode="&#x2002;" horiz-adv-x="945"/>
            <glyph unicode="&#x2003;" horiz-adv-x="1891"/>
            <glyph unicode="&#x2004;" horiz-adv-x="630"/>
            <glyph unicode="&#x2005;" horiz-adv-x="472"/>
            <glyph unicode="&#x2006;" horiz-adv-x="315"/>
            <glyph unicode="&#x2007;" horiz-adv-x="315"/>
            <glyph unicode="&#x2008;" horiz-adv-x="236"/>
            <glyph unicode="&#x2009;" horiz-adv-x="378"/>
            <glyph unicode="&#x200a;" horiz-adv-x="105"/>
            <glyph unicode="&#x2010;" horiz-adv-x="807" d="M99 599v54h590v-54h-590z"/>
            <glyph unicode="&#x2011;" horiz-adv-x="807" d="M99 599v54h590v-54h-590z"/>
            <glyph unicode="&#x2012;" horiz-adv-x="807" d="M99 599v54h590v-54h-590z"/>
            <glyph unicode="&#x2013;" horiz-adv-x="1412" d="M161 721v54h1085v-54h-1085z"/>
            <glyph unicode="&#x2014;" horiz-adv-x="1673" d="M131 721v54h1336v-54h-1336z"/>
            <glyph unicode="&#x2018;" horiz-adv-x="430" d="M172 1019v166l50 271h50l-46 -267v-170h-54z"/>
            <glyph unicode="&#x2019;" horiz-adv-x="430" d="M155 1019l46 268v169h54v-166l-50 -271h-50z"/>
            <glyph unicode="&#x201a;" horiz-adv-x="447" d="M155 -171l46 269v170h54v-168l-50 -271h-50z"/>
            <glyph unicode="&#x201c;" horiz-adv-x="673"
                   d="M172 1019v166l50 271h50l-46 -267v-170h-54zM422 1019v166l50 271h50l-46 -267v-170h-54z"/>
            <glyph unicode="&#x201d;" horiz-adv-x="657"
                   d="M186 1019l46 268v169h54v-166l-50 -271h-50zM388 1019l46 268v169h54v-166l-50 -271h-50z"/>
            <glyph unicode="&#x201e;" horiz-adv-x="615"
                   d="M155 -169l45 269v169h55v-166l-50 -272h-50zM336 -169l46 269v169h54v-166l-50 -272h-50z"/>
            <glyph unicode="&#x2022;" horiz-adv-x="635"
                   d="M155 703v70q0 70 45 115t121 45t122 -45.5t46 -114.5v-70q0 -70 -45.5 -114t-121.5 -44q-77 0 -122 44t-45 114z"/>
            <glyph unicode="&#x2026;" horiz-adv-x="1255"
                   d="M211 0v130h86v-130h-86zM595 0v130h86v-130h-86zM964 0v130h86v-130h-86z"/>
            <glyph unicode="&#x202f;" horiz-adv-x="378"/>
            <glyph unicode="&#x2039;" horiz-adv-x="604" d="M108 551v19l295 370h70l-294 -380l294 -379h-70z"/>
            <glyph unicode="&#x203a;" horiz-adv-x="604" d="M106 171l293 379l-293 390h70l294 -380v-19l-294 -370h-70z"/>
            <glyph unicode="&#x205f;" horiz-adv-x="472"/>
            <glyph unicode="&#x20ac;" horiz-adv-x="1060"
                   d="M82 553v55h187v222h-187v56h187v56q0 244 130.5 389.5t342.5 145.5q54 0 107 -8t115 -23v-58q-53 16 -109.5 25.5t-112.5 9.5q-193 0 -306 -128.5t-113 -350.5v-58h593v-56h-593v-222h593v-55h-593v-39q0 -219 114.5 -350t306.5 -131q57 0 113 8.5t107 25.5v-57 q-52 -15 -108 -23t-112 -8q-212 0 -343.5 145t-131.5 390v39h-187z"/>
            <glyph unicode="&#x2122;" horiz-adv-x="1247"
                   d="M90 1399v57h384v-57h-158v-480h-56v480h-170zM552 919v537h75l181 -452h6l183 452h69v-537h-55v421l-6 1l-169 -422h-51l-172 436l-6 -1v-435h-55z"/>
            <glyph unicode="&#x25fc;" horiz-adv-x="1080" d="M0 0v1080h1080v-1080h-1080z"/>
            <glyph unicode="&#xfb02;" horiz-adv-x="1067"
                   d="M66 1027v55h188v178q0 153 74.5 237t208.5 84q33 0 65.5 -4t62.5 -13l-8 -52q-32 8 -56.5 11.5t-62.5 3.5q-108 0 -169 -71t-61 -196v-178h286v-55h-286v-1027h-54v1027h-188zM830 0v1560h54v-1560h-54z"/>
            <glyph unicode="&#xfb03;" horiz-adv-x="1712"
                   d="M66 1027v55h188v178q0 153 74.5 237t208.5 84q33 0 65.5 -4t62.5 -13l-8 -52q-32 8 -56.5 11.5t-62.5 3.5q-108 0 -169 -71t-61 -196v-178h286v-55h-286v-1027h-54v1027h-188zM711 1027v55h188v158q0 163 85.5 252t237.5 89q67 0 135 -13.5t133 -43.5l-8 -52 q-66 29 -121.5 42t-137.5 13q-126 0 -198 -76t-72 -211v-158h286v-55h-286v-1027h-54v1027h-188zM1475 0v1082h54v-1082h-54z"/>
            <glyph unicode="&#xfb04;" horiz-adv-x="1712"
                   d="M66 1027v55h188v178q0 153 74.5 237t208.5 84q33 0 65.5 -4t62.5 -13l-8 -52q-32 8 -56.5 11.5t-62.5 3.5q-108 0 -169 -71t-61 -196v-178h286v-55h-286v-1027h-54v1027h-188zM711 1027v55h188v178q0 153 74.5 237t208.5 84q33 0 65.5 -4t62.5 -13l-8 -52 q-32 8 -56.5 11.5t-62.5 3.5q-108 0 -169 -71t-61 -196v-178h286v-55h-286v-1027h-54v1027h-188zM1475 0v1560h54v-1560h-54z"/>
            <hkern u1="&#x22;" u2="w" k="-11"/>
            <hkern u1="&#x27;" u2="w" k="-11"/>
            <hkern u1="&#x28;" u2="&#x178;" k="-22"/>
            <hkern u1="&#x28;" u2="&#xdd;" k="-22"/>
            <hkern u1="&#x28;" u2="Y" k="-22"/>
            <hkern u1="&#x28;" u2="W" k="-18"/>
            <hkern u1="&#x28;" u2="V" k="-20"/>
            <hkern u1="A" u2="w" k="33"/>
            <hkern u1="A" u2="t" k="17"/>
            <hkern u1="A" u2="&#x3f;" k="61"/>
            <hkern u1="C" u2="&#x7d;" k="17"/>
            <hkern u1="C" u2="]" k="12"/>
            <hkern u1="C" u2="&#x29;" k="26"/>
            <hkern u1="D" u2="&#xc6;" k="33"/>
            <hkern u1="E" u2="w" k="22"/>
            <hkern u1="E" u2="f" k="18"/>
            <hkern u1="F" u2="&#x2026;" k="234"/>
            <hkern u1="F" u2="&#x201e;" k="234"/>
            <hkern u1="F" u2="&#x201a;" k="234"/>
            <hkern u1="F" u2="&#x153;" k="21"/>
            <hkern u1="F" u2="&#xff;" k="24"/>
            <hkern u1="F" u2="&#xfd;" k="24"/>
            <hkern u1="F" u2="&#xfc;" k="22"/>
            <hkern u1="F" u2="&#xfb;" k="22"/>
            <hkern u1="F" u2="&#xfa;" k="22"/>
            <hkern u1="F" u2="&#xf9;" k="22"/>
            <hkern u1="F" u2="&#xf6;" k="21"/>
            <hkern u1="F" u2="&#xf5;" k="21"/>
            <hkern u1="F" u2="&#xf4;" k="21"/>
            <hkern u1="F" u2="&#xf3;" k="21"/>
            <hkern u1="F" u2="&#xf2;" k="21"/>
            <hkern u1="F" u2="&#xeb;" k="21"/>
            <hkern u1="F" u2="&#xea;" k="21"/>
            <hkern u1="F" u2="&#xe9;" k="21"/>
            <hkern u1="F" u2="&#xe8;" k="21"/>
            <hkern u1="F" u2="&#xe7;" k="21"/>
            <hkern u1="F" u2="&#xe5;" k="34"/>
            <hkern u1="F" u2="&#xe4;" k="34"/>
            <hkern u1="F" u2="&#xe3;" k="34"/>
            <hkern u1="F" u2="&#xe2;" k="34"/>
            <hkern u1="F" u2="&#xe1;" k="34"/>
            <hkern u1="F" u2="&#xe0;" k="34"/>
            <hkern u1="F" u2="&#xc5;" k="59"/>
            <hkern u1="F" u2="&#xc4;" k="59"/>
            <hkern u1="F" u2="&#xc3;" k="59"/>
            <hkern u1="F" u2="&#xc2;" k="59"/>
            <hkern u1="F" u2="&#xc1;" k="59"/>
            <hkern u1="F" u2="&#xc0;" k="59"/>
            <hkern u1="F" u2="y" k="24"/>
            <hkern u1="F" u2="v" k="24"/>
            <hkern u1="F" u2="u" k="22"/>
            <hkern u1="F" u2="r" k="26"/>
            <hkern u1="F" u2="q" k="21"/>
            <hkern u1="F" u2="o" k="21"/>
            <hkern u1="F" u2="g" k="21"/>
            <hkern u1="F" u2="e" k="21"/>
            <hkern u1="F" u2="d" k="21"/>
            <hkern u1="F" u2="c" k="21"/>
            <hkern u1="F" u2="a" k="34"/>
            <hkern u1="F" u2="A" k="59"/>
            <hkern u1="F" u2="&#x3a;" k="234"/>
            <hkern u1="F" u2="&#x2e;" k="234"/>
            <hkern u1="F" u2="&#x2c;" k="234"/>
            <hkern u1="K" u2="w" k="63"/>
            <hkern u1="L" u2="w" k="92"/>
            <hkern u1="O" u2="&#xc6;" k="33"/>
            <hkern u1="P" u2="&#xc6;" k="97"/>
            <hkern u1="P" u2="t" k="-14"/>
            <hkern u1="Q" u2="&#x178;" k="35"/>
            <hkern u1="Q" u2="&#xdd;" k="35"/>
            <hkern u1="Q" u2="Y" k="35"/>
            <hkern u1="Q" u2="W" k="20"/>
            <hkern u1="Q" u2="V" k="28"/>
            <hkern u1="Q" u2="T" k="43"/>
            <hkern u1="R" u2="&#x178;" k="48"/>
            <hkern u1="R" u2="&#xdd;" k="48"/>
            <hkern u1="R" u2="Y" k="48"/>
            <hkern u1="R" u2="V" k="19"/>
            <hkern u1="R" u2="T" k="80"/>
            <hkern u1="T" u2="&#xf8;" k="95"/>
            <hkern u1="T" u2="&#xe6;" k="114"/>
            <hkern u1="T" u2="&#xc6;" k="179"/>
            <hkern u1="T" u2="&#xbb;" k="216"/>
            <hkern u1="T" u2="&#xab;" k="328"/>
            <hkern u1="T" u2="w" k="57"/>
            <hkern u1="T" u2="r" k="75"/>
            <hkern u1="V" u2="&#x7d;" k="-19"/>
            <hkern u1="V" u2="r" k="30"/>
            <hkern u1="V" u2="]" k="-17"/>
            <hkern u1="V" u2="&#x29;" k="-20"/>
            <hkern u1="W" u2="&#x7d;" k="-14"/>
            <hkern u1="W" u2="r" k="21"/>
            <hkern u1="W" u2="]" k="-12"/>
            <hkern u1="W" u2="&#x29;" k="-15"/>
            <hkern u1="Y" u2="&#x2022;" k="45"/>
            <hkern u1="Y" u2="&#xf8;" k="64"/>
            <hkern u1="Y" u2="&#xe6;" k="63"/>
            <hkern u1="Y" u2="&#xc6;" k="96"/>
            <hkern u1="Y" u2="&#xbb;" k="51"/>
            <hkern u1="Y" u2="&#xab;" k="82"/>
            <hkern u1="Y" u2="&#x7d;" k="-19"/>
            <hkern u1="Y" u2="t" k="22"/>
            <hkern u1="Y" u2="r" k="40"/>
            <hkern u1="Y" u2="f" k="22"/>
            <hkern u1="Y" u2="]" k="-18"/>
            <hkern u1="Y" u2="&#x2a;" k="49"/>
            <hkern u1="Y" u2="&#x29;" k="-20"/>
            <hkern u1="Y" u2="&#x26;" k="30"/>
            <hkern u1="Z" u2="w" k="27"/>
            <hkern u1="[" u2="&#xdc;" k="18"/>
            <hkern u1="[" u2="&#xdb;" k="18"/>
            <hkern u1="[" u2="&#xda;" k="18"/>
            <hkern u1="[" u2="&#xd9;" k="18"/>
            <hkern u1="[" u2="U" k="18"/>
            <hkern u1="[" u2="J" k="18"/>
            <hkern u1="f" u2="&#x201d;" k="-16"/>
            <hkern u1="f" u2="&#x201c;" k="-16"/>
            <hkern u1="f" u2="&#x2019;" k="-16"/>
            <hkern u1="f" u2="&#x2018;" k="-16"/>
            <hkern u1="f" u2="&#x153;" k="24"/>
            <hkern u1="f" u2="&#xeb;" k="24"/>
            <hkern u1="f" u2="&#xea;" k="24"/>
            <hkern u1="f" u2="&#xe9;" k="24"/>
            <hkern u1="f" u2="&#xe8;" k="24"/>
            <hkern u1="f" u2="&#xe7;" k="24"/>
            <hkern u1="f" u2="&#x7d;" k="-19"/>
            <hkern u1="f" u2="q" k="24"/>
            <hkern u1="f" u2="g" k="24"/>
            <hkern u1="f" u2="e" k="24"/>
            <hkern u1="f" u2="d" k="24"/>
            <hkern u1="f" u2="c" k="24"/>
            <hkern u1="f" u2="]" k="-18"/>
            <hkern u1="f" u2="&#x29;" k="-20"/>
            <hkern u1="f" u2="&#x27;" k="-16"/>
            <hkern u1="f" u2="&#x22;" k="-16"/>
            <hkern u1="k" u2="&#x153;" k="20"/>
            <hkern u1="k" u2="&#xeb;" k="20"/>
            <hkern u1="k" u2="&#xea;" k="20"/>
            <hkern u1="k" u2="&#xe9;" k="20"/>
            <hkern u1="k" u2="&#xe8;" k="20"/>
            <hkern u1="k" u2="&#xe7;" k="20"/>
            <hkern u1="k" u2="q" k="20"/>
            <hkern u1="k" u2="g" k="20"/>
            <hkern u1="k" u2="e" k="20"/>
            <hkern u1="k" u2="d" k="20"/>
            <hkern u1="k" u2="c" k="20"/>
            <hkern u1="r" u2="w" k="-17"/>
            <hkern u1="r" u2="t" k="-17"/>
            <hkern u1="r" u2="f" k="-15"/>
            <hkern u1="v" u2="f" k="-13"/>
            <hkern u1="w" u2="&#x2026;" k="124"/>
            <hkern u1="w" u2="&#x201e;" k="124"/>
            <hkern u1="w" u2="&#x201a;" k="124"/>
            <hkern u1="w" u2="&#x3a;" k="124"/>
            <hkern u1="w" u2="&#x2e;" k="124"/>
            <hkern u1="w" u2="&#x2c;" k="124"/>
            <hkern u1="y" u2="f" k="-13"/>
            <hkern u1="&#x7b;" u2="&#xdc;" k="20"/>
            <hkern u1="&#x7b;" u2="&#xdb;" k="20"/>
            <hkern u1="&#x7b;" u2="&#xda;" k="20"/>
            <hkern u1="&#x7b;" u2="&#xd9;" k="20"/>
            <hkern u1="&#x7b;" u2="U" k="20"/>
            <hkern u1="&#x7b;" u2="J" k="20"/>
            <hkern u1="&#xc0;" u2="w" k="33"/>
            <hkern u1="&#xc0;" u2="t" k="17"/>
            <hkern u1="&#xc0;" u2="&#x3f;" k="61"/>
            <hkern u1="&#xc1;" u2="w" k="33"/>
            <hkern u1="&#xc1;" u2="t" k="17"/>
            <hkern u1="&#xc1;" u2="&#x3f;" k="61"/>
            <hkern u1="&#xc2;" u2="w" k="33"/>
            <hkern u1="&#xc2;" u2="t" k="17"/>
            <hkern u1="&#xc2;" u2="&#x3f;" k="61"/>
            <hkern u1="&#xc3;" u2="w" k="33"/>
            <hkern u1="&#xc3;" u2="t" k="17"/>
            <hkern u1="&#xc3;" u2="&#x3f;" k="61"/>
            <hkern u1="&#xc4;" u2="w" k="33"/>
            <hkern u1="&#xc4;" u2="t" k="17"/>
            <hkern u1="&#xc4;" u2="&#x3f;" k="61"/>
            <hkern u1="&#xc5;" u2="w" k="33"/>
            <hkern u1="&#xc5;" u2="t" k="17"/>
            <hkern u1="&#xc5;" u2="&#x3f;" k="61"/>
            <hkern u1="&#xc7;" u2="&#x7d;" k="17"/>
            <hkern u1="&#xc7;" u2="]" k="12"/>
            <hkern u1="&#xc7;" u2="&#x29;" k="26"/>
            <hkern u1="&#xc8;" u2="w" k="22"/>
            <hkern u1="&#xc8;" u2="f" k="18"/>
            <hkern u1="&#xc9;" u2="w" k="22"/>
            <hkern u1="&#xc9;" u2="f" k="18"/>
            <hkern u1="&#xca;" u2="w" k="22"/>
            <hkern u1="&#xca;" u2="f" k="18"/>
            <hkern u1="&#xcb;" u2="w" k="22"/>
            <hkern u1="&#xcb;" u2="f" k="18"/>
            <hkern u1="&#xd0;" u2="&#xc6;" k="33"/>
            <hkern u1="&#xd2;" u2="&#xc6;" k="33"/>
            <hkern u1="&#xd3;" u2="&#xc6;" k="33"/>
            <hkern u1="&#xd4;" u2="&#xc6;" k="33"/>
            <hkern u1="&#xd5;" u2="&#xc6;" k="33"/>
            <hkern u1="&#xd6;" u2="&#xc6;" k="33"/>
            <hkern u1="&#xdd;" u2="&#x2022;" k="45"/>
            <hkern u1="&#xdd;" u2="&#xf8;" k="64"/>
            <hkern u1="&#xdd;" u2="&#xe6;" k="63"/>
            <hkern u1="&#xdd;" u2="&#xc6;" k="96"/>
            <hkern u1="&#xdd;" u2="&#xbb;" k="51"/>
            <hkern u1="&#xdd;" u2="&#xab;" k="82"/>
            <hkern u1="&#xdd;" u2="&#x7d;" k="-19"/>
            <hkern u1="&#xdd;" u2="t" k="22"/>
            <hkern u1="&#xdd;" u2="r" k="40"/>
            <hkern u1="&#xdd;" u2="f" k="22"/>
            <hkern u1="&#xdd;" u2="]" k="-18"/>
            <hkern u1="&#xdd;" u2="&#x2a;" k="49"/>
            <hkern u1="&#xdd;" u2="&#x29;" k="-20"/>
            <hkern u1="&#xdd;" u2="&#x26;" k="30"/>
            <hkern u1="&#xfd;" u2="f" k="-13"/>
            <hkern u1="&#xff;" u2="f" k="-13"/>
            <hkern u1="&#x178;" u2="&#x2022;" k="45"/>
            <hkern u1="&#x178;" u2="&#xf8;" k="64"/>
            <hkern u1="&#x178;" u2="&#xe6;" k="63"/>
            <hkern u1="&#x178;" u2="&#xc6;" k="96"/>
            <hkern u1="&#x178;" u2="&#xbb;" k="51"/>
            <hkern u1="&#x178;" u2="&#xab;" k="82"/>
            <hkern u1="&#x178;" u2="&#x7d;" k="-19"/>
            <hkern u1="&#x178;" u2="t" k="22"/>
            <hkern u1="&#x178;" u2="r" k="40"/>
            <hkern u1="&#x178;" u2="f" k="22"/>
            <hkern u1="&#x178;" u2="]" k="-18"/>
            <hkern u1="&#x178;" u2="&#x2a;" k="49"/>
            <hkern u1="&#x178;" u2="&#x29;" k="-20"/>
            <hkern u1="&#x178;" u2="&#x26;" k="30"/>
            <hkern u1="&#x2018;" u2="w" k="-11"/>
            <hkern u1="&#x2019;" u2="w" k="-11"/>
            <hkern u1="&#x201c;" u2="w" k="-11"/>
            <hkern u1="&#x201d;" u2="w" k="-11"/>
            <hkern g1="B" g2="T" k="27"/>
            <hkern g1="B" g2="V" k="24"/>
            <hkern g1="B" g2="Y,Yacute,Ydieresis" k="55"/>
            <hkern g1="H,I,M,N,Igrave,Iacute,Icircumflex,Idieresis,Ntilde" g2="T" k="29"/>
            <hkern g1="H,I,M,N,Igrave,Iacute,Icircumflex,Idieresis,Ntilde" g2="Y,Yacute,Ydieresis" k="28"/>
            <hkern g1="H,I,M,N,Igrave,Iacute,Icircumflex,Idieresis,Ntilde"
                   g2="A,Agrave,Aacute,Acircumflex,Atilde,Adieresis,Aring" k="-18"/>
            <hkern g1="H,I,M,N,Igrave,Iacute,Icircumflex,Idieresis,Ntilde" g2="X" k="-17"/>
            <hkern g1="D,O,Eth,Ograve,Oacute,Ocircumflex,Otilde,Odieresis" g2="T" k="27"/>
            <hkern g1="D,O,Eth,Ograve,Oacute,Ocircumflex,Otilde,Odieresis" g2="V" k="22"/>
            <hkern g1="D,O,Eth,Ograve,Oacute,Ocircumflex,Otilde,Odieresis" g2="Y,Yacute,Ydieresis" k="43"/>
            <hkern g1="D,O,Eth,Ograve,Oacute,Ocircumflex,Otilde,Odieresis"
                   g2="A,Agrave,Aacute,Acircumflex,Atilde,Adieresis,Aring" k="21"/>
            <hkern g1="D,O,Eth,Ograve,Oacute,Ocircumflex,Otilde,Odieresis" g2="X" k="22"/>
            <hkern g1="D,O,Eth,Ograve,Oacute,Ocircumflex,Otilde,Odieresis"
                   g2="comma,period,colon,quotesinglbase,quotedblbase,ellipsis" k="102"/>
            <hkern g1="D,O,Eth,Ograve,Oacute,Ocircumflex,Otilde,Odieresis" g2="Z" k="23"/>
            <hkern g1="C,Ccedilla" g2="T" k="29"/>
            <hkern g1="E,Egrave,Eacute,Ecircumflex,Edieresis" g2="v,y,yacute,ydieresis" k="26"/>
            <hkern g1="E,Egrave,Eacute,Ecircumflex,Edieresis" g2="o,ograve,oacute,ocircumflex,otilde,odieresis" k="19"/>
            <hkern g1="E,Egrave,Eacute,Ecircumflex,Edieresis" g2="u,ugrave,uacute,ucircumflex,udieresis" k="17"/>
            <hkern g1="E,Egrave,Eacute,Ecircumflex,Edieresis"
                   g2="c,d,e,g,q,ccedilla,egrave,eacute,ecircumflex,edieresis,oe" k="19"/>
            <hkern g1="T" g2="v,y,yacute,ydieresis" k="72"/>
            <hkern g1="T" g2="C,G,O,Q,Ccedilla,Ograve,Oacute,Ocircumflex,Otilde,Odieresis,Oslash,OE" k="28"/>
            <hkern g1="T" g2="o,ograve,oacute,ocircumflex,otilde,odieresis" k="99"/>
            <hkern g1="T" g2="W" k="-15"/>
            <hkern g1="T" g2="T" k="-16"/>
            <hkern g1="T" g2="u,ugrave,uacute,ucircumflex,udieresis" k="95"/>
            <hkern g1="T" g2="z" k="60"/>
            <hkern g1="T" g2="V" k="-16"/>
            <hkern g1="T" g2="Y,Yacute,Ydieresis" k="-16"/>
            <hkern g1="T" g2="A,Agrave,Aacute,Acircumflex,Atilde,Adieresis,Aring" k="79"/>
            <hkern g1="T" g2="comma,period,colon,quotesinglbase,quotedblbase,ellipsis" k="218"/>
            <hkern g1="T" g2="c,d,e,g,q,ccedilla,egrave,eacute,ecircumflex,edieresis,oe" k="99"/>
            <hkern g1="T" g2="x" k="77"/>
            <hkern g1="T" g2="hyphen,uni00AD,endash,emdash" k="232"/>
            <hkern g1="T" g2="m,n,p,ntilde" k="109"/>
            <hkern g1="T" g2="S" k="16"/>
            <hkern g1="T" g2="a,agrave,aacute,acircumflex,atilde,adieresis,aring" k="113"/>
            <hkern g1="T" g2="s" k="116"/>
            <hkern g1="K" g2="v,y,yacute,ydieresis" k="40"/>
            <hkern g1="K" g2="C,G,O,Q,Ccedilla,Ograve,Oacute,Ocircumflex,Otilde,Odieresis,Oslash,OE" k="31"/>
            <hkern g1="K" g2="o,ograve,oacute,ocircumflex,otilde,odieresis" k="27"/>
            <hkern g1="K" g2="u,ugrave,uacute,ucircumflex,udieresis" k="23"/>
            <hkern g1="K" g2="c,d,e,g,q,ccedilla,egrave,eacute,ecircumflex,edieresis,oe" k="26"/>
            <hkern g1="K" g2="hyphen,uni00AD,endash,emdash" k="64"/>
            <hkern g1="K" g2="m,n,p,ntilde" k="23"/>
            <hkern g1="L" g2="v,y,yacute,ydieresis" k="133"/>
            <hkern g1="L" g2="C,G,O,Q,Ccedilla,Ograve,Oacute,Ocircumflex,Otilde,Odieresis,Oslash,OE" k="65"/>
            <hkern g1="L" g2="U,Ugrave,Uacute,Ucircumflex,Udieresis" k="54"/>
            <hkern g1="L" g2="quotedbl,quotesingle,quoteleft,quoteright,quotedblleft,quotedblright" k="138"/>
            <hkern g1="L" g2="W" k="143"/>
            <hkern g1="L" g2="T" k="275"/>
            <hkern g1="L" g2="u,ugrave,uacute,ucircumflex,udieresis" k="44"/>
            <hkern g1="L" g2="V" k="175"/>
            <hkern g1="L" g2="Y,Yacute,Ydieresis" k="239"/>
            <hkern g1="L" g2="A,Agrave,Aacute,Acircumflex,Atilde,Adieresis,Aring" k="-19"/>
            <hkern g1="P" g2="v,y,yacute,ydieresis" k="-15"/>
            <hkern g1="P" g2="o,ograve,oacute,ocircumflex,otilde,odieresis" k="13"/>
            <hkern g1="P" g2="A,Agrave,Aacute,Acircumflex,Atilde,Adieresis,Aring" k="138"/>
            <hkern g1="P" g2="X" k="31"/>
            <hkern g1="P" g2="comma,period,colon,quotesinglbase,quotedblbase,ellipsis" k="324"/>
            <hkern g1="P" g2="Z" k="26"/>
            <hkern g1="P" g2="c,d,e,g,q,ccedilla,egrave,eacute,ecircumflex,edieresis,oe" k="13"/>
            <hkern g1="P" g2="a,agrave,aacute,acircumflex,atilde,adieresis,aring" k="11"/>
            <hkern g1="J,U,Ugrave,Uacute,Ucircumflex,Udieresis" g2="A,Agrave,Aacute,Acircumflex,Atilde,Adieresis,Aring"
                   k="22"/>
            <hkern g1="V" g2="v,y,yacute,ydieresis" k="11"/>
            <hkern g1="V" g2="C,G,O,Q,Ccedilla,Ograve,Oacute,Ocircumflex,Otilde,Odieresis,Oslash,OE" k="13"/>
            <hkern g1="V" g2="o,ograve,oacute,ocircumflex,otilde,odieresis" k="46"/>
            <hkern g1="V" g2="u,ugrave,uacute,ucircumflex,udieresis" k="28"/>
            <hkern g1="V" g2="A,Agrave,Aacute,Acircumflex,Atilde,Adieresis,Aring" k="75"/>
            <hkern g1="V" g2="comma,period,colon,quotesinglbase,quotedblbase,ellipsis" k="225"/>
            <hkern g1="V" g2="c,d,e,g,q,ccedilla,egrave,eacute,ecircumflex,edieresis,oe" k="44"/>
            <hkern g1="V" g2="hyphen,uni00AD,endash,emdash" k="37"/>
            <hkern g1="V" g2="a,agrave,aacute,acircumflex,atilde,adieresis,aring" k="46"/>
            <hkern g1="X" g2="v,y,yacute,ydieresis" k="31"/>
            <hkern g1="X" g2="C,G,O,Q,Ccedilla,Ograve,Oacute,Ocircumflex,Otilde,Odieresis,Oslash,OE" k="25"/>
            <hkern g1="X" g2="o,ograve,oacute,ocircumflex,otilde,odieresis" k="21"/>
            <hkern g1="X" g2="u,ugrave,uacute,ucircumflex,udieresis" k="21"/>
            <hkern g1="X" g2="V" k="-14"/>
            <hkern g1="X" g2="c,d,e,g,q,ccedilla,egrave,eacute,ecircumflex,edieresis,oe" k="26"/>
            <hkern g1="X" g2="hyphen,uni00AD,endash,emdash" k="46"/>
            <hkern g1="Y,Yacute,Ydieresis" g2="v,y,yacute,ydieresis" k="20"/>
            <hkern g1="Y,Yacute,Ydieresis" g2="C,G,O,Q,Ccedilla,Ograve,Oacute,Ocircumflex,Otilde,Odieresis,Oslash,OE"
                   k="29"/>
            <hkern g1="Y,Yacute,Ydieresis" g2="U,Ugrave,Uacute,Ucircumflex,Udieresis" k="96"/>
            <hkern g1="Y,Yacute,Ydieresis" g2="o,ograve,oacute,ocircumflex,otilde,odieresis" k="65"/>
            <hkern g1="Y,Yacute,Ydieresis" g2="W" k="-17"/>
            <hkern g1="Y,Yacute,Ydieresis" g2="T" k="-17"/>
            <hkern g1="Y,Yacute,Ydieresis" g2="u,ugrave,uacute,ucircumflex,udieresis" k="39"/>
            <hkern g1="Y,Yacute,Ydieresis" g2="z" k="30"/>
            <hkern g1="Y,Yacute,Ydieresis" g2="V" k="-18"/>
            <hkern g1="Y,Yacute,Ydieresis" g2="Y,Yacute,Ydieresis" k="-18"/>
            <hkern g1="Y,Yacute,Ydieresis" g2="A,Agrave,Aacute,Acircumflex,Atilde,Adieresis,Aring" k="82"/>
            <hkern g1="Y,Yacute,Ydieresis" g2="X" k="-13"/>
            <hkern g1="Y,Yacute,Ydieresis" g2="comma,period,colon,quotesinglbase,quotedblbase,ellipsis" k="211"/>
            <hkern g1="Y,Yacute,Ydieresis" g2="c,d,e,g,q,ccedilla,egrave,eacute,ecircumflex,edieresis,oe" k="65"/>
            <hkern g1="Y,Yacute,Ydieresis" g2="x" k="23"/>
            <hkern g1="Y,Yacute,Ydieresis" g2="hyphen,uni00AD,endash,emdash" k="52"/>
            <hkern g1="Y,Yacute,Ydieresis" g2="m,n,p,ntilde" k="40"/>
            <hkern g1="Y,Yacute,Ydieresis" g2="S" k="16"/>
            <hkern g1="Y,Yacute,Ydieresis" g2="a,agrave,aacute,acircumflex,atilde,adieresis,aring" k="73"/>
            <hkern g1="Y,Yacute,Ydieresis" g2="s" k="58"/>
            <hkern g1="Y,Yacute,Ydieresis" g2="J" k="96"/>
            <hkern g1="W" g2="o,ograve,oacute,ocircumflex,otilde,odieresis" k="31"/>
            <hkern g1="W" g2="T" k="-14"/>
            <hkern g1="W" g2="u,ugrave,uacute,ucircumflex,udieresis" k="19"/>
            <hkern g1="W" g2="A,Agrave,Aacute,Acircumflex,Atilde,Adieresis,Aring" k="43"/>
            <hkern g1="W" g2="comma,period,colon,quotesinglbase,quotedblbase,ellipsis" k="123"/>
            <hkern g1="W" g2="c,d,e,g,q,ccedilla,egrave,eacute,ecircumflex,edieresis,oe" k="31"/>
            <hkern g1="W" g2="hyphen,uni00AD,endash,emdash" k="60"/>
            <hkern g1="W" g2="a,agrave,aacute,acircumflex,atilde,adieresis,aring" k="33"/>
            <hkern g1="Z" g2="v,y,yacute,ydieresis" k="27"/>
            <hkern g1="Z" g2="C,G,O,Q,Ccedilla,Ograve,Oacute,Ocircumflex,Otilde,Odieresis,Oslash,OE" k="26"/>
            <hkern g1="Z" g2="o,ograve,oacute,ocircumflex,otilde,odieresis" k="21"/>
            <hkern g1="Z" g2="u,ugrave,uacute,ucircumflex,udieresis" k="19"/>
            <hkern g1="Z" g2="A,Agrave,Aacute,Acircumflex,Atilde,Adieresis,Aring" k="-13"/>
            <hkern g1="Z" g2="c,d,e,g,q,ccedilla,egrave,eacute,ecircumflex,edieresis,oe" k="21"/>
            <hkern g1="a,agrave,aacute,acircumflex,atilde,adieresis,aring" g2="v,y,yacute,ydieresis" k="15"/>
            <hkern g1="a,agrave,aacute,acircumflex,atilde,adieresis,aring"
                   g2="quotedbl,quotesingle,quoteleft,quoteright,quotedblleft,quotedblright" k="67"/>
            <hkern g1="c,ccedilla" g2="quotedbl,quotesingle,quoteleft,quoteright,quotedblleft,quotedblright" k="11"/>
            <hkern g1="b,p,thorn" g2="v,y,yacute,ydieresis" k="11"/>
            <hkern g1="b,p,thorn" g2="quotedbl,quotesingle,quoteleft,quoteright,quotedblleft,quotedblright" k="29"/>
            <hkern g1="b,p,thorn" g2="z" k="15"/>
            <hkern g1="b,p,thorn" g2="x" k="15"/>
            <hkern g1="e,egrave,eacute,ecircumflex,edieresis" g2="v,y,yacute,ydieresis" k="13"/>
            <hkern g1="e,egrave,eacute,ecircumflex,edieresis"
                   g2="quotedbl,quotesingle,quoteleft,quoteright,quotedblleft,quotedblright" k="14"/>
            <hkern g1="h,m,n,ntilde" g2="quotedbl,quotesingle,quoteleft,quoteright,quotedblleft,quotedblright" k="16"/>
            <hkern g1="o,ograve,oacute,ocircumflex,otilde,odieresis" g2="v,y,yacute,ydieresis" k="15"/>
            <hkern g1="o,ograve,oacute,ocircumflex,otilde,odieresis"
                   g2="quotedbl,quotesingle,quoteleft,quoteright,quotedblleft,quotedblright" k="20"/>
            <hkern g1="o,ograve,oacute,ocircumflex,otilde,odieresis" g2="z" k="16"/>
            <hkern g1="o,ograve,oacute,ocircumflex,otilde,odieresis" g2="x" k="21"/>
            <hkern g1="v,y,yacute,ydieresis" g2="quotedbl,quotesingle,quoteleft,quoteright,quotedblleft,quotedblright"
                   k="-15"/>
            <hkern g1="v,y,yacute,ydieresis" g2="o,ograve,oacute,ocircumflex,otilde,odieresis" k="15"/>
            <hkern g1="v,y,yacute,ydieresis" g2="comma,period,colon,quotesinglbase,quotedblbase,ellipsis" k="107"/>
            <hkern g1="v,y,yacute,ydieresis" g2="c,d,e,g,q,ccedilla,egrave,eacute,ecircumflex,edieresis,oe" k="13"/>
            <hkern g1="v,y,yacute,ydieresis" g2="a,agrave,aacute,acircumflex,atilde,adieresis,aring" k="15"/>
            <hkern g1="r" g2="v,y,yacute,ydieresis" k="-18"/>
            <hkern g1="r" g2="quotedbl,quotesingle,quoteleft,quoteright,quotedblleft,quotedblright" k="-16"/>
            <hkern g1="r" g2="o,ograve,oacute,ocircumflex,otilde,odieresis" k="20"/>
            <hkern g1="r" g2="comma,period,colon,quotesinglbase,quotedblbase,ellipsis" k="123"/>
            <hkern g1="r" g2="c,d,e,g,q,ccedilla,egrave,eacute,ecircumflex,edieresis,oe" k="19"/>
            <hkern g1="x" g2="o,ograve,oacute,ocircumflex,otilde,odieresis" k="20"/>
            <hkern g1="x" g2="c,d,e,g,q,ccedilla,egrave,eacute,ecircumflex,edieresis,oe" k="20"/>
            <hkern g1="z" g2="o,ograve,oacute,ocircumflex,otilde,odieresis" k="16"/>
            <hkern g1="z" g2="c,d,e,g,q,ccedilla,egrave,eacute,ecircumflex,edieresis,oe" k="16"/>
            <hkern g1="quotedbl,quotesingle,quoteleft,quoteright,quotedblleft,quotedblright"
                   g2="quotedbl,quotesingle,quoteleft,quoteright,quotedblleft,quotedblright" k="107"/>
            <hkern g1="quotedbl,quotesingle,quoteleft,quoteright,quotedblleft,quotedblright"
                   g2="o,ograve,oacute,ocircumflex,otilde,odieresis" k="61"/>
            <hkern g1="quotedbl,quotesingle,quoteleft,quoteright,quotedblleft,quotedblright"
                   g2="A,Agrave,Aacute,Acircumflex,Atilde,Adieresis,Aring" k="106"/>
            <hkern g1="quotedbl,quotesingle,quoteleft,quoteright,quotedblleft,quotedblright"
                   g2="c,d,e,g,q,ccedilla,egrave,eacute,ecircumflex,edieresis,oe" k="59"/>
            <hkern g1="quotedbl,quotesingle,quoteleft,quoteright,quotedblleft,quotedblright" g2="m,n,p,ntilde" k="20"/>
            <hkern g1="quotedbl,quotesingle,quoteleft,quoteright,quotedblleft,quotedblright"
                   g2="a,agrave,aacute,acircumflex,atilde,adieresis,aring" k="50"/>
            <hkern g1="quotedbl,quotesingle,quoteleft,quoteright,quotedblleft,quotedblright" g2="s" k="42"/>
        </font>
    </defs>
</svg>